Now run 'make' to compile ksquirrel-libs
/usr/bin/make -C obj-i486-linux-gnu
make[1]: Entering directory `/build/ryan/ksquirrel-libs-0.7.0/obj-i486-linux-gnu'
Making all in kernel
make[2]: Entering directory `/build/ryan/ksquirrel-libs-0.7.0/obj-i486-linux-gnu/kernel'
Making all in ksquirrel-libs
make[3]: Entering directory `/build/ryan/ksquirrel-libs-0.7.0/obj-i486-linux-gnu/kernel/ksquirrel-libs'
/bin/sh ../../libtool --silent --tag=CXX --mode=compile g++ -DPACKAGE_NAME=\"ksquirrel-libs\" -DPACKAGE_TARNAME=\"ksquirrel-libs\" -DPACKAGE_VERSION=\"0.7.0\" -DPACKAGE_STRING=\"ksquirrel-libs\ 0.7.0\" -DPACKAGE_BUGREPORT=\"ksquirrel@tut.by\" -DPACKAGE=\"ksquirrel-libs\" -DVERSION=\"0.7.0\" -DSTDC_HEADERS=1 -DHAVE_SYS_TYPES_H=1 -DHAVE_SYS_STAT_H=1 -DHAVE_STDLIB_H=1 -DHAVE_STRING_H=1 -DHAVE_MEMORY_H=1 -DHAVE_STRINGS_H=1 -DHAVE_INTTYPES_H=1 -DHAVE_STDINT_H=1 -DHAVE_UNISTD_H=1 -DHAVE_DLFCN_H=1 -DSTDC_HEADERS=1 -DHAVE__BOOL=1 -DHAVE_STDBOOL_H=1 -DHAVE_STDLIB_H=1 -DHAVE_REALLOC=1 -DLSTAT_FOLLOWS_SLASHED_SYMLINK=1 -DHAVE_JPEGLIB_H=1 -DHAVE_TIFF_H=1 -DHAVE_LIBMNG_H=1 -DHAVE_PIXMAN_H=1 -DHAVE_GIF_LIB_H=1 -DHAVE_X11_XWDFILE_H=1 -Dinline=__inline__ -DCAN_DO_UNALIGNED_WORDS=1 -DHAVE_INTTYPES_H=1 -DHAVE_NETINET_IN_H=1 -DHAVE_ARPA_INET_H=1 -DHAVE_GETOPT_H=1 -DHAVE_GETOPT_LONG=1 -DHAVE_STRCASECMP=1 -DHAVE_STDLIB_H=1 -DHAVE_UNISTD_H=1 -DHAVE_GETPAGESIZE=1 -DHAVE_MMAP=1 -DENABLE_NLS=1 -DHAVE_GETTEXT=1 -DHAVE_DCGETTEXT=1 -DHAVE_ICONV=1 -DICONV_CONST= -I. -I/build/ryan/ksquirrel-libs-0.7.0/./kernel/ksquirrel-libs -I../include -Wnon-virtual-dtor -Wno-long-long -Wundef -Wall -W -Wpointer-arith -Wwrite-strings -ansi -D_XOPEN_SOURCE=500 -D_BSD_SOURCE -Wcast-align -Wconversion -Wchar-subscripts -DNDEBUG -DNO_DEBUG -O2 -g -Wall -O2 -Wformat-security -Wmissing-format-attribute -fno-exceptions -fno-check-new -fno-common -c -o fileio.lo /build/ryan/ksquirrel-libs-0.7.0/./kernel/ksquirrel-libs/fileio.cpp
/build/ryan/ksquirrel-libs-0.7.0/./kernel/ksquirrel-libs/fileio.cpp:22:35: error: ksquirrel-libs/fileio.h: No such file or directory
/build/ryan/ksquirrel-libs-0.7.0/./kernel/ksquirrel-libs/fileio.cpp:25: error: 'ifstreamK' has not been declared
/build/ryan/ksquirrel-libs-0.7.0/./kernel/ksquirrel-libs/fileio.cpp:25: error: ISO C++ forbids declaration of 'ifstreamK' with no type
/build/ryan/ksquirrel-libs-0.7.0/./kernel/ksquirrel-libs/fileio.cpp: In function 'int ifstreamK()':
/build/ryan/ksquirrel-libs-0.7.0/./kernel/ksquirrel-libs/fileio.cpp:25: error: only constructors take base initializers
/build/ryan/ksquirrel-libs-0.7.0/./kernel/ksquirrel-libs/fileio.cpp: At global scope:
/build/ryan/ksquirrel-libs-0.7.0/./kernel/ksquirrel-libs/fileio.cpp:28: error: 'ifstreamK' is not a class or namespace
/build/ryan/ksquirrel-libs-0.7.0/./kernel/ksquirrel-libs/fileio.cpp: In function 'bool readK(void*, int)':
/build/ryan/ksquirrel-libs-0.7.0/./kernel/ksquirrel-libs/fileio.cpp:30: error: 'read' was not declared in this scope
/build/ryan/ksquirrel-libs-0.7.0/./kernel/ksquirrel-libs/fileio.cpp:32: error: 'good' was not declared in this scope
/build/ryan/ksquirrel-libs-0.7.0/./kernel/ksquirrel-libs/fileio.cpp: At global scope:
/build/ryan/ksquirrel-libs-0.7.0/./kernel/ksquirrel-libs/fileio.cpp:35: error: 'ifstreamK' is not a class or namespace
/build/ryan/ksquirrel-libs-0.7.0/./kernel/ksquirrel-libs/fileio.cpp: In function 'bool getS(char*, int)':
/build/ryan/ksquirrel-libs-0.7.0/./kernel/ksquirrel-libs/fileio.cpp:37: error: 'getline' was not declared in this scope
/build/ryan/ksquirrel-libs-0.7.0/./kernel/ksquirrel-libs/fileio.cpp:39: error: 'good' was not declared in this scope
/build/ryan/ksquirrel-libs-0.7.0/./kernel/ksquirrel-libs/fileio.cpp: At global scope:
/build/ryan/ksquirrel-libs-0.7.0/./kernel/ksquirrel-libs/fileio.cpp:42: error: 'ifstreamK' is not a class or namespace
/build/ryan/ksquirrel-libs-0.7.0/./kernel/ksquirrel-libs/fileio.cpp:42: error: 'u8' was not declared in this scope
/build/ryan/ksquirrel-libs-0.7.0/./kernel/ksquirrel-libs/fileio.cpp:42: error: 'c' was not declared in this scope
/build/ryan/ksquirrel-libs-0.7.0/./kernel/ksquirrel-libs/fileio.cpp:43: error: expected ',' or ';' before '{' token
/build/ryan/ksquirrel-libs-0.7.0/./kernel/ksquirrel-libs/fileio.cpp:47: error: 'ifstreamK' is not a class or namespace
/build/ryan/ksquirrel-libs-0.7.0/./kernel/ksquirrel-libs/fileio.cpp:47: error: 'u16' was not declared in this scope
/build/ryan/ksquirrel-libs-0.7.0/./kernel/ksquirrel-libs/fileio.cpp:47: error: 's' was not declared in this scope
/build/ryan/ksquirrel-libs-0.7.0/./kernel/ksquirrel-libs/fileio.cpp:48: error: expected ',' or ';' before '{' token
/build/ryan/ksquirrel-libs-0.7.0/./kernel/ksquirrel-libs/fileio.cpp:59: error: 'ifstreamK' is not a class or namespace
/build/ryan/ksquirrel-libs-0.7.0/./kernel/ksquirrel-libs/fileio.cpp:59: error: 'u32' was not declared in this scope
/build/ryan/ksquirrel-libs-0.7.0/./kernel/ksquirrel-libs/fileio.cpp:59: error: 'l' was not declared in this scope
/build/ryan/ksquirrel-libs-0.7.0/./kernel/ksquirrel-libs/fileio.cpp:60: error: expected ',' or ';' before '{' token
/build/ryan/ksquirrel-libs-0.7.0/./kernel/ksquirrel-libs/fileio.cpp:71: error: 'ifstreamK' is not a class or namespace
/build/ryan/ksquirrel-libs-0.7.0/./kernel/ksquirrel-libs/fileio.cpp: In function 'void close()':
/build/ryan/ksquirrel-libs-0.7.0/./kernel/ksquirrel-libs/fileio.cpp:73: error: 'ifstream' has not been declared
/build/ryan/ksquirrel-libs-0.7.0/./kernel/ksquirrel-libs/fileio.cpp:75: error: 'clear' was not declared in this scope
/build/ryan/ksquirrel-libs-0.7.0/./kernel/ksquirrel-libs/fileio.cpp: At global scope:
/build/ryan/ksquirrel-libs-0.7.0/./kernel/ksquirrel-libs/fileio.cpp:78: error: 'ifstreamK' is not a class or namespace
/build/ryan/ksquirrel-libs-0.7.0/./kernel/ksquirrel-libs/fileio.cpp:78: error: 'u32' was not declared in this scope
/build/ryan/ksquirrel-libs-0.7.0/./kernel/ksquirrel-libs/fileio.cpp:78: error: 'hex' was not declared in this scope
/build/ryan/ksquirrel-libs-0.7.0/./kernel/ksquirrel-libs/fileio.cpp:79: error: expected ',' or ';' before '{' token
/build/ryan/ksquirrel-libs-0.7.0/./kernel/ksquirrel-libs/fileio.cpp:119: error: 'ofstreamK' has not been declared
/build/ryan/ksquirrel-libs-0.7.0/./kernel/ksquirrel-libs/fileio.cpp:119: error: ISO C++ forbids declaration of 'ofstreamK' with no type
/build/ryan/ksquirrel-libs-0.7.0/./kernel/ksquirrel-libs/fileio.cpp: In function 'int ofstreamK()':
/build/ryan/ksquirrel-libs-0.7.0/./kernel/ksquirrel-libs/fileio.cpp:119: error: only constructors take base initializers
/build/ryan/ksquirrel-libs-0.7.0/./kernel/ksquirrel-libs/fileio.cpp: At global scope:
/build/ryan/ksquirrel-libs-0.7.0/./kernel/ksquirrel-libs/fileio.cpp:122: error: 'ofstreamK' is not a class or namespace
/build/ryan/ksquirrel-libs-0.7.0/./kernel/ksquirrel-libs/fileio.cpp: In function 'bool writeK(void*, int)':
/build/ryan/ksquirrel-libs-0.7.0/./kernel/ksquirrel-libs/fileio.cpp:124: error: 'write' was not declared in this scope
/build/ryan/ksquirrel-libs-0.7.0/./kernel/ksquirrel-libs/fileio.cpp:126: error: 'good' was not declared in this scope
/build/ryan/ksquirrel-libs-0.7.0/./kernel/ksquirrel-libs/fileio.cpp: At global scope:
/build/ryan/ksquirrel-libs-0.7.0/./kernel/ksquirrel-libs/fileio.cpp:129: error: 'ofstreamK' is not a class or namespace
/build/ryan/ksquirrel-libs-0.7.0/./kernel/ksquirrel-libs/fileio.cpp: In function 'void close()':
/build/ryan/ksquirrel-libs-0.7.0/./kernel/ksquirrel-libs/fileio.cpp:129: error: redefinition of 'void close()'
/build/ryan/ksquirrel-libs-0.7.0/./kernel/ksquirrel-libs/fileio.cpp:71: error: 'void close()' previously defined here
/build/ryan/ksquirrel-libs-0.7.0/./kernel/ksquirrel-libs/fileio.cpp:131: error: 'ofstream' has not been declared
/build/ryan/ksquirrel-libs-0.7.0/./kernel/ksquirrel-libs/fileio.cpp:133: error: 'clear' was not declared in this scope
make[3]: *** [fileio.lo] Error 1
make[3]: Leaving directory `/build/ryan/ksquirrel-libs-0.7.0/obj-i486-linux-gnu/kernel/ksquirrel-libs'
make[2]: *** [all-recursive] Error 1
make[2]: Leaving directory `/build/ryan/ksquirrel-libs-0.7.0/obj-i486-linux-gnu/kernel'
make[1]: *** [all-recursive] Error 1
make[1]: Leaving directory `/build/ryan/ksquirrel-libs-0.7.0/obj-i486-linux-gnu'
make: *** [debian/stamp-makefile-build] Error 2
******************************************************************************
Build finished at 20070725-2331
FAILED [dpkg-buildpackage died]
------------------------------------------------------------------------------
Not removing build depends: session managed chroot in use
******************************************************************************
Finished at 20070725-2331
Build needed 00:00:23, 9368k disk space