rendered paste bodyMaking check in test-suite
make[2]: Entering directory `/home/chitlesh/rpmbuild/BUILD/guile-gnome-platform-2.15.93/glib/test-suite'
make check-TESTS
make[3]: Entering directory `/home/chitlesh/rpmbuild/BUILD/guile-gnome-platform-2.15.93/glib/test-suite'
.:./..:..:../../atk:../../cairo:../../corba:../../defs:../../docs:../../gconf:../../glib:../../gnome-vfs:../../gtk:../../libglade:../../libgnome:../../libgnomecanvas:../../libgnomeui:../../pango:.:/usr/share/guile/site:../../atk:../../cairo:../../corba:../../defs:../../docs:../../gconf:../../glib:../../gnome-vfs:../../gtk:../../libglade:../../libgnome:../../libgnomecanvas:../../libgnomeui:../../pango:.:/usr/share/guile/site:../atk:../cairo:../corba:../defs:../docs:../gconf:../glib:../gnome-vfs:../gtk:../libglade:../libgnome:../libgnomecanvas:../libgnomeui:../pango:.:/usr/share/guile/site:
Backtrace:
In unknown file:
?: 15* (if (or # #) (try-load-module name))
?: 16 [try-load-module (test-suite gw-test-gobject)]
?: 17 (or (begin (try-module-linked name)) (try-module-autoload name) ...)
?: 18* [try-module-autoload (test-suite gw-test-gobject)]
?: 19 (let* (# # # #) (resolve-module dir-hint-module-name #f) (and # #))
...
?: 20 (letrec ((load-file #)) (dynamic-wind (lambda () #) (lambda () #) ...) ...)
?: 21* [dynamic-wind #<procedure #f ()> #<procedure #f ()> #<procedure #f ()>]
?: 22* [#<procedure #f ()>]
?: 23* (let* ((file #)) (cond (# => #) (# => #)))
?: 24 [#<procedure #f (full)> "./../test-suite/gw-test-gobject.scm"]
?: 25 [with-fluid* #<fluid 7> #f #<procedure #f ()>]
?: 26* [#<procedure #f ()>]
?: 27* [load-file #<primitive-procedure primitive-load> ...]
?: 28* [save-module-excursion #<procedure #f ()>]
?: 29 (let (# #) (dynamic-wind # thunk #))
?: 30 [dynamic-wind #<procedure #f ()> #<procedure #f ()> #<procedure #f ()>]
?: 31* [#<procedure #f ()>]
?: 32* [primitive-load "./../test-suite/gw-test-gobject.scm"]
In ./../test-suite/gw-test-gobject.scm:
9: 33* [dynamic-call "gw_init_wrapset_test_gobject" ...
11: 34* [dynamic-link "libgw-guile-test-gobject"]
./../test-suite/gw-test-gobject.scm:11:3: In procedure dynamic-link in expression (dynamic-link "libgw-guile-test-gobject"):
./../test-suite/gw-test-gobject.scm:11:3: file: "libgw-guile-test-gobject", message: "./libgw-guile-test-gobject.so.0: cannot open shared object file: No such file or directory"
Some deprecated features have been used. Set the environment
variable GUILE_WARN_DEPRECATED to "detailed" and rerun the
program to get more information. Set it to "no" to suppress
this message.
FAIL: guile-gobject-test
===================
1 of 1 tests failed
===================
make[3]: *** [check-TESTS] Error 1
make[3]: Leaving directory `/home/chitlesh/rpmbuild/BUILD/guile-gnome-platform-2.15.93/glib/test-suite'
make[2]: *** [check-am] Error 2
make[2]: Leaving directory `/home/chitlesh/rpmbuild/BUILD/guile-gnome-platform-2.15.93/glib/test-suite'
make[1]: *** [check-recursive] Error 1
make[1]: Leaving directory `/home/chitlesh/rpmbuild/BUILD/guile-gnome-platform-2.15.93/glib'
make: *** [check-recursive] Error 1
error: Bad exit status from /var/tmp/rpm-tmp.66265 (%check)
RPM build errors:
Bad exit status from /var/tmp/rpm-tmp.66265 (%check)