All pastes #632531 Raw Edit

Someone

public text v1 · immutable
#632531 ·published 2007-07-24 22:30 UTC
rendered paste body
f-2.0.la ../gdk/libgdk-x11-2.0.la 
gcc -DG_DISABLE_DEPRECATED -g -O2 -g -Wall -o .libs/gtk-query-immodules-2.0 queryimmodules.o  ./.libs/libgtk-x11-2.0.so -L/evo/checkout/gnome2/install/lib /evo/checkout/gnome2/gtk+/gdk/.libs/libgdk-x11-2.0.so -L/opt/gnome/lib /evo/checkout/gnome2/install/lib/libatk-1.0.so ../gdk-pixbuf/.libs/libgdk_pixbuf-2.0.so ../gdk/.libs/libgdk-x11-2.0.so /opt/gnome/lib/libpangocairo-1.0.so /usr/lib/libcairo.so /usr/lib/libglitz.so /opt/gnome/lib/libpangoft2-1.0.so /opt/gnome/lib/libpango-1.0.so /usr/lib/libfontconfig.so /evo/checkout/gnome2/install/lib/libpango-1.0.so /opt/gnome/lib/libgobject-2.0.so /opt/gnome/lib/libgmodule-2.0.so /opt/gnome/lib/libglib-2.0.so -lrt /evo/checkout/gnome2/install/lib/libcairo.so /usr/lib/libpng12.so /evo/checkout/gnome2/install/lib/libfontconfig.so /usr/lib/libfreetype.so -lz /usr/local/lib/libexpat.so /usr/lib/libXinerama.so /usr/lib/libXrandr.so /usr/lib/libXcursor.so /usr/lib/libXrender.so /usr/lib/libXcomposite.so /usr/lib/libXext.so /usr/lib/libXdamage.so /usr/lib/libXfixes.so /usr/lib/libX11.so -lpthread /usr/lib/libXau.so /usr/lib/libXdmcp.so /evo/checkout/gnome2/gtk+/gdk-pixbuf/.libs/libgdk_pixbuf-2.0.so /evo/checkout/gnome2/install/lib/libgmodule-2.0.so -ldl /evo/checkout/gnome2/install/lib/libgobject-2.0.so /evo/checkout/gnome2/install/lib/libglib-2.0.so -lm -Wl,--rpath -Wl,/evo/checkout/gnome2/install/lib
/usr/lib/gcc/i586-suse-linux/4.1.2/../../../../i586-suse-linux/bin/ld: warning: libexpat.so.0, needed by /evo/checkout/gnome2/install/lib/libfontconfig.so, may conflict with libexpat.so.1
./.libs/libgtk-x11-2.0.so: undefined reference to `g_sequence_free'
/evo/checkout/gnome2/gtk+/gdk/.libs/libgdk-x11-2.0.so: undefined reference to `pango_color_to_string'
./.libs/libgtk-x11-2.0.so: undefined reference to `g_sequence_sort_changed_iter'
./.libs/libgtk-x11-2.0.so: undefined reference to `g_sequence_swap'
./.libs/libgtk-x11-2.0.so: undefined reference to `g_hash_table_get_keys'
./.libs/libgtk-x11-2.0.so: undefined reference to `g_sequence_get_length'
./.libs/libgtk-x11-2.0.so: undefined reference to `g_sequence_new'
./.libs/libgtk-x11-2.0.so: undefined reference to `g_sequence_iter_next'
./.libs/libgtk-x11-2.0.so: undefined reference to `g_sequence_insert_before'
./.libs/libgtk-x11-2.0.so: undefined reference to `pango_matrix_transform_rectangle'
./.libs/libgtk-x11-2.0.so: undefined reference to `g_sequence_get_end_iter'
./.libs/libgtk-x11-2.0.so: undefined reference to `g_sequence_iter_prev'
./.libs/libgtk-x11-2.0.so: undefined reference to `pango_layout_iter_get_line_readonly'
./.libs/libgtk-x11-2.0.so: undefined reference to `g_once_init_enter_impl'
./.libs/libgtk-x11-2.0.so: undefined reference to `g_sequence_iter_get_sequence'
./.libs/libgtk-x11-2.0.so: undefined reference to `pango_language_get_default'
./.libs/libgtk-x11-2.0.so: undefined reference to `g_sequence_get_begin_iter'
./.libs/libgtk-x11-2.0.so: undefined reference to `g_sequence_remove'
./.libs/libgtk-x11-2.0.so: undefined reference to `g_sequence_sort_iter'
./.libs/libgtk-x11-2.0.so: undefined reference to `g_sequence_get_iter_at_pos'
./.libs/libgtk-x11-2.0.so: undefined reference to `pango_extents_to_pixels'
./.libs/libgtk-x11-2.0.so: undefined reference to `g_sequence_set'
./.libs/libgtk-x11-2.0.so: undefined reference to `g_sequence_iter_get_position'
./.libs/libgtk-x11-2.0.so: undefined reference to `pango_layout_iter_get_run_readonly'
./.libs/libgtk-x11-2.0.so: undefined reference to `g_sequence_get'
./.libs/libgtk-x11-2.0.so: undefined reference to `g_sequence_iter_is_end'
./.libs/libgtk-x11-2.0.so: undefined reference to `pango_layout_get_lines_readonly'
./.libs/libgtk-x11-2.0.so: undefined reference to `g_slice_copy'
./.libs/libgtk-x11-2.0.so: undefined reference to `g_timeout_add_seconds_full'
./.libs/libgtk-x11-2.0.so: undefined reference to `g_get_user_special_dir'
./.libs/libgtk-x11-2.0.so: undefined reference to `g_once_init_leave'
./.libs/libgtk-x11-2.0.so: undefined reference to `g_sequence_foreach'
./.libs/libgtk-x11-2.0.so: undefined reference to `g_sequence_move'
./.libs/libgtk-x11-2.0.so: undefined reference to `g_sequence_iter_is_begin'
./.libs/libgtk-x11-2.0.so: undefined reference to `pango_layout_get_line_readonly'
collect2: ld returned 1 exit status
make[4]: *** [gtk-query-immodules-2.0] Error 1
make[4]: Leaving directory `/evo/checkout/gnome2/gtk+/gtk'
make[3]: *** [all-recursive] Error 1
make[3]: Leaving directory `/evo/checkout/gnome2/gtk+/gtk'
make[2]: *** [all] Error 2
make[2]: Leaving directory `/evo/checkout/gnome2/gtk+/gtk'
make[1]: *** [all-recursive] Error 1
make[1]: Leaving directory `/evo/checkout/gnome2/gtk+'
make: *** [all] Error 2
*** error during stage build of gtk+: ########## Error running make   *** [19/57]


  [1] rerun stage build
  [2] ignore error and continue to install
  [3] give up on module
  [4] start shell
  [5] go to stage force_checkout
  [6] go to stage configure
choice: