In file included from yuv2rgb.cpp:41:
/usr/lib/gcc/powerpc-linux-gnu/4.1.2/include/altivec.h:37:2: error: #error Use the "-maltivec" flag to enable PowerPC AltiVec support
yuv2rgb.cpp: In function void altivec_yuv420_2vuy(uint8_t*, uint8_t*, uint8_t*, uint8_t*, int, int, int, int, int):
yuv2rgb.cpp:877: error: __vector was not declared in this scope
yuv2rgb.cpp:877: error: expected `;' before unsigned
yuv2rgb.cpp:878: error: expected `;' before unsigned
yuv2rgb.cpp:879: error: expected `;' before unsigned
yuv2rgb.cpp:880: error: expected `;' before unsigned
yuv2rgb.cpp:890: error: u_vec was not declared in this scope
yuv2rgb.cpp:890: error: __builtin_vec_ld was not declared in this scope
yuv2rgb.cpp:890: error: v_vec was not declared in this scope
yuv2rgb.cpp:891: error: uv_vec was not declared in this scope
yuv2rgb.cpp:891: error: __builtin_vec_mergeh was not declared in this scope
yuv2rgb.cpp:891: error: y_vec was not declared in this scope
yuv2rgb.cpp:891: error: __builtin_vec_st was not declared in this scope
yuv2rgb.cpp:891: error: __builtin_vec_mergel was not declared in this scope
yuv2rgb.cpp:906: error: u_vec was not declared in this scope
yuv2rgb.cpp:906: error: __builtin_vec_ld was not declared in this scope
yuv2rgb.cpp:906: error: v_vec was not declared in this scope
yuv2rgb.cpp:907: error: uv_vec was not declared in this scope
yuv2rgb.cpp:907: error: __builtin_vec_mergeh was not declared in this scope
yuv2rgb.cpp:907: error: y_vec was not declared in this scope
yuv2rgb.cpp:907: error: __builtin_vec_st was not declared in this scope
yuv2rgb.cpp:907: error: __builtin_vec_mergel was not declared in this scope
yuv2rgb.cpp:912: error: u_vec was not declared in this scope
yuv2rgb.cpp:912: error: __builtin_vec_ld was not declared in this scope
yuv2rgb.cpp:912: error: v_vec was not declared in this scope
yuv2rgb.cpp:913: error: uv_vec was not declared in this scope
yuv2rgb.cpp:913: error: __builtin_vec_mergeh was not declared in this scope
yuv2rgb.cpp:913: error: y_vec was not declared in this scope
yuv2rgb.cpp:913: error: __builtin_vec_st was not declared in this scope
yuv2rgb.cpp:913: error: __builtin_vec_mergel was not declared in this scope
yuv2rgb.cpp: In function void altivec_2vuy_yuv420(uint8_t*, uint8_t*, uint8_t*, uint8_t*, int, int, int, int, int):
yuv2rgb.cpp:1038: error: __vector was not declared in this scope
yuv2rgb.cpp:1038: error: expected `;' before unsigned
yuv2rgb.cpp:1039: error: expected `;' before unsigned
yuv2rgb.cpp:1051: error: pa_vec was not declared in this scope
yuv2rgb.cpp:1051: error: __builtin_vec_ld was not declared in this scope
yuv2rgb.cpp:1051: error: pb_vec was not declared in this scope
yuv2rgb.cpp:1051: error: expected `)' before unsigned
yuv2rgb.cpp:1051: error: expected `)' before ; token
yuv2rgb.cpp:1051: error: uv1_vec was not declared in this scope
yuv2rgb.cpp:1051: error: expected `)' before unsigned
yuv2rgb.cpp:1051: error: expected `)' before ; token
yuv2rgb.cpp:1051: error: expected `)' before unsigned
yuv2rgb.cpp:1051: error: expected `)' before ; token
yuv2rgb.cpp:1051: error: uv2_vec was not declared in this scope
yuv2rgb.cpp:1051: error: expected `)' before unsigned
yuv2rgb.cpp:1051: error: expected `)' before ; token
yuv2rgb.cpp:1051: error: uva_vec was not declared in this scope
yuv2rgb.cpp:1051: error: __builtin_vec_avg was not declared in this scope
yuv2rgb.cpp:1052: error: expected `)' before unsigned
yuv2rgb.cpp:1052: error: expected `)' before ; token
yuv2rgb.cpp:1052: error: expected `)' before unsigned
yuv2rgb.cpp:1052: error: expected `)' before ; token
yuv2rgb.cpp:1052: error: expected `)' before unsigned
yuv2rgb.cpp:1052: error: expected `)' before ; token
yuv2rgb.cpp:1052: error: expected `)' before unsigned
yuv2rgb.cpp:1052: error: expected `)' before ; token
yuv2rgb.cpp:1052: error: uvb_vec was not declared in this scope
yuv2rgb.cpp:1053: error: expected `)' before unsigned
yuv2rgb.cpp:1053: error: expected `)' before ; token
yuv2rgb.cpp:1053: error: expected `)' before unsigned
yuv2rgb.cpp:1053: error: expected `)' before ; token
yuv2rgb.cpp:1067: error: pa_vec was not declared in this scope
yuv2rgb.cpp:1067: error: __builtin_vec_ld was not declared in this scope
yuv2rgb.cpp:1067: error: pb_vec was not declared in this scope
yuv2rgb.cpp:1067: error: expected `)' before unsigned
yuv2rgb.cpp:1067: error: expected `)' before ; token
yuv2rgb.cpp:1067: error: uv1_vec was not declared in this scope
yuv2rgb.cpp:1067: error: expected `)' before unsigned
yuv2rgb.cpp:1067: error: expected `)' before ; token
yuv2rgb.cpp:1067: error: expected `)' before unsigned
yuv2rgb.cpp:1067: error: expected `)' before ; token
yuv2rgb.cpp:1067: error: uv2_vec was not declared in this scope
yuv2rgb.cpp:1067: error: expected `)' before unsigned
yuv2rgb.cpp:1067: error: expected `)' before ; token
yuv2rgb.cpp:1067: error: uva_vec was not declared in this scope
yuv2rgb.cpp:1067: error: __builtin_vec_avg was not declared in this scope
yuv2rgb.cpp:1068: error: expected `)' before unsigned
yuv2rgb.cpp:1068: error: expected `)' before ; token
yuv2rgb.cpp:1068: error: expected `)' before unsigned
yuv2rgb.cpp:1068: error: expected `)' before ; token
yuv2rgb.cpp:1068: error: expected `)' before unsigned
yuv2rgb.cpp:1068: error: expected `)' before ; token
yuv2rgb.cpp:1068: error: expected `)' before unsigned
yuv2rgb.cpp:1068: error: expected `)' before ; token
yuv2rgb.cpp:1068: error: uvb_vec was not declared in this scope
yuv2rgb.cpp:1069: error: expected `)' before unsigned
yuv2rgb.cpp:1069: error: expected `)' before ; token
yuv2rgb.cpp:1069: error: expected `)' before unsigned
yuv2rgb.cpp:1069: error: expected `)' before ; token
yuv2rgb.cpp:1073: error: pa_vec was not declared in this scope
yuv2rgb.cpp:1073: error: __builtin_vec_ld was not declared in this scope
yuv2rgb.cpp:1073: error: pb_vec was not declared in this scope
yuv2rgb.cpp:1073: error: expected `)' before unsigned
yuv2rgb.cpp:1073: error: expected `)' before ; token
yuv2rgb.cpp:1073: error: uv1_vec was not declared in this scope
yuv2rgb.cpp:1073: error: expected `)' before unsigned
yuv2rgb.cpp:1073: error: expected `)' before ; token
yuv2rgb.cpp:1073: error: expected `)' before unsigned
yuv2rgb.cpp:1073: error: expected `)' before ; token
yuv2rgb.cpp:1073: error: uv2_vec was not declared in this scope
yuv2rgb.cpp:1073: error: expected `)' before unsigned
yuv2rgb.cpp:1073: error: expected `)' before ; token
yuv2rgb.cpp:1073: error: uva_vec was not declared in this scope
yuv2rgb.cpp:1073: error: __builtin_vec_avg was not declared in this scope
yuv2rgb.cpp:1077: error: expected `)' before unsigned
yuv2rgb.cpp:1077: error: expected `)' before ; token
yuv2rgb.cpp:1077: error: expected `)' before unsigned
yuv2rgb.cpp:1077: error: expected `)' before ; token
yuv2rgb.cpp:1077: error: expected `)' before unsigned
yuv2rgb.cpp:1077: error: expected `)' before ; token
yuv2rgb.cpp:1077: error: expected `)' before unsigned
yuv2rgb.cpp:1077: error: expected `)' before ; token
yuv2rgb.cpp:1077: error: uvb_vec was not declared in this scope
yuv2rgb.cpp:1078: error: expected `)' before unsigned
yuv2rgb.cpp:1078: error: expected `)' before ; token
yuv2rgb.cpp:1078: error: expected `)' before unsigned
yuv2rgb.cpp:1078: error: expected `)' before ; token
yuv2rgb.cpp:1083: error: expected `)' before unsigned
yuv2rgb.cpp:1083: error: expected `)' before ; token
yuv2rgb.cpp:1083: error: expected `)' before unsigned
yuv2rgb.cpp:1083: error: expected `)' before ; token
yuv2rgb.cpp:1083: error: expected `)' before unsigned
yuv2rgb.cpp:1083: error: expected `)' before ; token
yuv2rgb.cpp:1083: error: expected `)' before unsigned
yuv2rgb.cpp:1083: error: expected `)' before ; token
yuv2rgb.cpp:1084: error: expected `)' before unsigned
yuv2rgb.cpp:1084: error: expected `)' before ; token
yuv2rgb.cpp:1084: error: expected `)' before unsigned
yuv2rgb.cpp:1084: error: expected `)' before ; token
yuv2rgb.cpp:1084: error: expected `)' before unsigned
yuv2rgb.cpp:1084: error: expected `)' before ; token
yuv2rgb.cpp:1084: error: expected `)' before unsigned
yuv2rgb.cpp:1084: error: expected `)' before ; token
yuv2rgb.cpp:1085: error: expected `)' before unsigned
yuv2rgb.cpp:1085: error: expected `)' before ; token
yuv2rgb.cpp:1085: error: expected `)' before unsigned
yuv2rgb.cpp:1085: error: expected `)' before ; token
make[2]: *** [yuv2rgb.o] Error 1
make[1]: *** [sub-libmythtv] Error 2
make: *** [sub-libs] Error 2