rendered paste bodymake[3]: Nothing to be done for `all'.
make[3]: Leaving directory `/hoki/wl-153/jtag/jtag-0.6-cvs-20051228/src/bus'
Making all in cmd
make[3]: Entering directory `/hoki/wl-153/jtag/jtag-0.6-cvs-20051228/src/cmd'
make[3]: Nothing to be done for `all'.
make[3]: Leaving directory `/hoki/wl-153/jtag/jtag-0.6-cvs-20051228/src/cmd'
make[3]: Entering directory `/hoki/wl-153/jtag/jtag-0.6-cvs-20051228/src'
if gcc -DHAVE_CONFIG_H -I. -I. -I.. -DLOCALEDIR=\"/usr/local/share/locale\" -I/usr/local/include/openwince -I/usr/local/include/openwince/device -I/usr/local/include/openwince/arm -I.. -I../include -g -O2 -Wall -MT flash.o -MD -MP -MF ".deps/flash.Tpo" -c -o flash.o flash.c; \
then mv -f ".deps/flash.Tpo" ".deps/flash.Po"; else rm -f ".deps/flash.Tpo"; exit 1; fi
flash.c:67: error: static declaration of 'flash_driver' follows non-static declaration
../include/flash.h:31: error: previous declaration of 'flash_driver' was here
make[3]: *** [flash.o] Error 1
make[3]: Leaving directory `/hoki/wl-153/jtag/jtag-0.6-cvs-20051228/src'
make[2]: *** [all-recursive] Error 1
make[2]: Leaving directory `/hoki/wl-153/jtag/jtag-0.6-cvs-20051228/src'
make[1]: *** [all-recursive] Error 1
make[1]: Leaving directory `/hoki/wl-153/jtag/jtag-0.6-cvs-20051228'
make: *** [all] Error 2