root@navi:/usr/src/linux-source-2.6.20# make oldconfig && make prepare
HOSTCC scripts/basic/fixdep
scripts/basic/fixdep.c:105:23: error: sys/types.h: No such file or directory
scripts/basic/fixdep.c:106:22: error: sys/stat.h: No such file or directory
scripts/basic/fixdep.c:107:22: error: sys/mman.h: No such file or directory
scripts/basic/fixdep.c:108:20: error: unistd.h: No such file or directory
scripts/basic/fixdep.c:109:19: error: fcntl.h: No such file or directory
scripts/basic/fixdep.c:110:20: error: string.h: No such file or directory
scripts/basic/fixdep.c:111:20: error: stdlib.h: No such file or directory
scripts/basic/fixdep.c:112:19: error: stdio.h: No such file or directory
In file included from /usr/lib/gcc/i486-linux-gnu/4.1.2/include/syslimits.h:7,
from /usr/lib/gcc/i486-linux-gnu/4.1.2/include/limits.h:11,
from scripts/basic/fixdep.c:113:
/usr/lib/gcc/i486-linux-gnu/4.1.2/include/limits.h:122:61: error: limits.h: No such file or directory
scripts/basic/fixdep.c:114:19: error: ctype.h: No such file or directory
scripts/basic/fixdep.c:115:23: error: arpa/inet.h: No such file or directory
scripts/basic/fixdep.c: In Funktion »usage«:
scripts/basic/fixdep.c:129: Warnung: Implizite Deklaration der Funktion »fprintf«
scripts/basic/fixdep.c:129: Warnung: Unverträgliche implizite Deklaration der eingebauten Funktion »fprintf«
scripts/basic/fixdep.c:129: Fehler: »stderr« nicht deklariert (erste Benutzung in dieser Funktion)
scripts/basic/fixdep.c:129: Fehler: (Jeder nicht deklarierte Bezeichner wird nur einmal aufgeführt
scripts/basic/fixdep.c:129: Fehler: für jede Funktion in der er auftritt.)
scripts/basic/fixdep.c:130: Warnung: Implizite Deklaration der Funktion »exit«
scripts/basic/fixdep.c:130: Warnung: Unverträgliche implizite Deklaration der eingebauten Funktion »exit«
scripts/basic/fixdep.c: In Funktion »print_cmdline«:
scripts/basic/fixdep.c:138: Warnung: Implizite Deklaration der Funktion »printf«
scripts/basic/fixdep.c:138: Warnung: Unverträgliche implizite Deklaration der eingebauten Funktion »printf«
scripts/basic/fixdep.c: Auf höchster Ebene:
scripts/basic/fixdep.c:141: Fehler: »NULL« ist hier nicht deklariert (nicht in einer Funktion)
scripts/basic/fixdep.c: In Funktion »grow_config«:
scripts/basic/fixdep.c:154: Warnung: Implizite Deklaration der Funktion »realloc«
scripts/basic/fixdep.c:154: Warnung: Zuweisung erzeugt Zeiger von Ganzzahl ohne Typkonvertierung
scripts/basic/fixdep.c:156: Warnung: Implizite Deklaration der Funktion »perror«
scripts/basic/fixdep.c:156: Warnung: Unverträgliche implizite Deklaration der eingebauten Funktion »exit«
scripts/basic/fixdep.c: In Funktion »is_defined_config«:
scripts/basic/fixdep.c:172: Warnung: Implizite Deklaration der Funktion »memcmp«
scripts/basic/fixdep.c: In Funktion »define_config«:
scripts/basic/fixdep.c:185: Warnung: Implizite Deklaration der Funktion »memcpy«
scripts/basic/fixdep.c:185: Warnung: Unverträgliche implizite Deklaration der eingebauten Funktion »memcpy«
scripts/basic/fixdep.c: In Funktion »use_config«:
scripts/basic/fixdep.c:204: Fehler: »PATH_MAX« nicht deklariert (erste Benutzung in dieser Funktion)
scripts/basic/fixdep.c:212: Warnung: Unverträgliche implizite Deklaration der eingebauten Funktion »memcpy«
scripts/basic/fixdep.c:218: Warnung: Implizite Deklaration der Funktion »tolower«
scripts/basic/fixdep.c:220: Warnung: Unverträgliche implizite Deklaration der eingebauten Funktion »printf«
scripts/basic/fixdep.c:204: Warnung: Variable »s« wird nicht verwendet
scripts/basic/fixdep.c: Auf höchster Ebene:
scripts/basic/fixdep.c:223: Fehler: expected declaration specifiers or »...« before »size_t«
scripts/basic/fixdep.c: In Funktion »parse_config_file«:
scripts/basic/fixdep.c:225: Fehler: »len« nicht deklariert (erste Benutzung in dieser Funktion)
scripts/basic/fixdep.c:231: Warnung: Implizite Deklaration der Funktion »ntohl«
scripts/basic/fixdep.c:242: Warnung: Implizite Deklaration der Funktion »isalnum«
scripts/basic/fixdep.c: In Funktion »strrcmp«:
scripts/basic/fixdep.c:255: Warnung: Implizite Deklaration der Funktion »strlen«
scripts/basic/fixdep.c:255: Warnung: Unverträgliche implizite Deklaration der eingebauten Funktion »strlen«
scripts/basic/fixdep.c: In Funktion »do_config_file«:
scripts/basic/fixdep.c:266: Fehler: Speichergröße von »st« ist unbekannt
scripts/basic/fixdep.c:270: Warnung: Implizite Deklaration der Funktion »open«
scripts/basic/fixdep.c:270: Fehler: »O_RDONLY« nicht deklariert (erste Benutzung in dieser Funktion)
scripts/basic/fixdep.c:272: Warnung: Unverträgliche implizite Deklaration der eingebauten Funktion »fprintf«
scripts/basic/fixdep.c:272: Fehler: »stderr« nicht deklariert (erste Benutzung in dieser Funktion)
scripts/basic/fixdep.c:274: Warnung: Unverträgliche implizite Deklaration der eingebauten Funktion »exit«
scripts/basic/fixdep.c:276: Warnung: Implizite Deklaration der Funktion »fstat«
scripts/basic/fixdep.c:278: Warnung: Implizite Deklaration der Funktion »close«
scripts/basic/fixdep.c:281: Warnung: Implizite Deklaration der Funktion »mmap«
scripts/basic/fixdep.c:281: Fehler: »PROT_READ« nicht deklariert (erste Benutzung in dieser Funktion)
scripts/basic/fixdep.c:281: Fehler: »MAP_PRIVATE« nicht deklariert (erste Benutzung in dieser Funktion)
scripts/basic/fixdep.c:281: Warnung: Zuweisung erzeugt Zeiger von Ganzzahl ohne Typkonvertierung
scripts/basic/fixdep.c:288: Fehler: zu viele Argumente für Funktion »parse_config_file«
scripts/basic/fixdep.c:290: Warnung: Implizite Deklaration der Funktion »munmap«
scripts/basic/fixdep.c:266: Warnung: Variable »st« wird nicht verwendet
scripts/basic/fixdep.c: Auf höchster Ebene:
scripts/basic/fixdep.c:295: Fehler: expected declaration specifiers or »...« before »size_t«
scripts/basic/fixdep.c: In Funktion »parse_dep_file«:
scripts/basic/fixdep.c:298: Fehler: »len« nicht deklariert (erste Benutzung in dieser Funktion)
scripts/basic/fixdep.c:300: Fehler: »PATH_MAX« nicht deklariert (erste Benutzung in dieser Funktion)
scripts/basic/fixdep.c:302: Warnung: Implizite Deklaration der Funktion »strchr«
scripts/basic/fixdep.c:302: Warnung: Unverträgliche implizite Deklaration der eingebauten Funktion »strchr«
scripts/basic/fixdep.c:304: Warnung: Unverträgliche implizite Deklaration der eingebauten Funktion »fprintf«
scripts/basic/fixdep.c:304: Fehler: »stderr« nicht deklariert (erste Benutzung in dieser Funktion)
scripts/basic/fixdep.c:305: Warnung: Unverträgliche implizite Deklaration der eingebauten Funktion »exit«
scripts/basic/fixdep.c:307: Warnung: Unverträgliche implizite Deklaration der eingebauten Funktion »memcpy«
scripts/basic/fixdep.c:308: Warnung: Unverträgliche implizite Deklaration der eingebauten Funktion »printf«
scripts/basic/fixdep.c:300: Warnung: Variable »s« wird nicht verwendet
scripts/basic/fixdep.c: In Funktion »print_deps«:
scripts/basic/fixdep.c:337: Fehler: Speichergröße von »st« ist unbekannt
scripts/basic/fixdep.c:341: Fehler: »O_RDONLY« nicht deklariert (erste Benutzung in dieser Funktion)
scripts/basic/fixdep.c:343: Warnung: Unverträgliche implizite Deklaration der eingebauten Funktion »fprintf«
scripts/basic/fixdep.c:343: Fehler: »stderr« nicht deklariert (erste Benutzung in dieser Funktion)
scripts/basic/fixdep.c:345: Warnung: Unverträgliche implizite Deklaration der eingebauten Funktion »exit«
scripts/basic/fixdep.c:349: Warnung: Unverträgliche implizite Deklaration der eingebauten Funktion »fprintf«
scripts/basic/fixdep.c:353: Fehler: »PROT_READ« nicht deklariert (erste Benutzung in dieser Funktion)
scripts/basic/fixdep.c:353: Fehler: »MAP_PRIVATE« nicht deklariert (erste Benutzung in dieser Funktion)
scripts/basic/fixdep.c:353: Warnung: Zuweisung erzeugt Zeiger von Ganzzahl ohne Typkonvertierung
scripts/basic/fixdep.c:360: Fehler: zu viele Argumente für Funktion »parse_dep_file«
scripts/basic/fixdep.c:337: Warnung: Variable »st« wird nicht verwendet
scripts/basic/fixdep.c: In Funktion »traps«:
scripts/basic/fixdep.c:372: Warnung: Unverträgliche implizite Deklaration der eingebauten Funktion »fprintf«
scripts/basic/fixdep.c:372: Fehler: »stderr« nicht deklariert (erste Benutzung in dieser Funktion)
scripts/basic/fixdep.c:374: Warnung: Unverträgliche implizite Deklaration der eingebauten Funktion »exit«
make[1]: *** [scripts/basic/fixdep] Fehler 1
make: *** [scripts_basic] Fehler 2
root@navi:/usr/src/linux-source-2.6.20#