CFLAGS="-O2 -pipe -march=i486 -funit-at-a-time -I/home/ubuntu/x86/staging_dir_i386/usr/include -I/home/ubuntu/x86/staging_dir_i386/include" CXXFLAGS="-O2 -pipe -march=i486 -funit-at-a-time -I/home/ubuntu/x86/staging_dir_i386/usr/include -I/home/ubuntu/x86/staging_dir_i386/include" LDFLAGS="-L/home/ubuntu/x86/staging_dir_i386/usr/lib -L/home/ubuntu/x86/staging_dir_i386/lib " make -C /home/ubuntu/x86/build_i386/inadyn/. AR=i386-linux-uclibc-ar AS="ccache i386-linux-uclibc-gcc -c -O2 -pipe -march=i486 -funit-at-a-time" LD=i386-linux-uclibc-ld NM=i386-linux-uclibc-nm CC="ccache i386-linux-uclibc-gcc" GCC="ccache i386-linux-uclibc-gcc" CXX=i386-linux-uclibc-g++ RANLIB=i386-linux-uclibc-ranlib STRIP=i386-linux-uclibc-strip OBJCOPY=i386-linux-uclibc-objcopy OBJDUMP=i386-linux-uclibc-objdump SIZE=i386-linux-uclibc-size CROSS="i386-linux-uclibc-" ARCH="i386" ;
make[3]: Entering directory `/home/ubuntu/x86/build_i386/inadyn'
gcc -Wall -pedantic -c -O2 -pipe -march=i486 -funit-at-a-time -I/home/ubuntu/x86/staging_dir_i386/usr/include -I/home/ubuntu/x86/staging_dir_i386/include -o "bin/base64utils.o" "src/base64utils.c"
In file included from /home/ubuntu/x86/staging_dir_i386/include/features.h:303,
from /home/ubuntu/x86/staging_dir_i386/include/stdlib.h:25,
from src/base64utils.c:28:
/home/ubuntu/x86/staging_dir_i386/include/sys/cdefs.h:45:8: warning: C++ style comments are not allowed in ISO C90
/home/ubuntu/x86/staging_dir_i386/include/sys/cdefs.h:45:8: warning: (this will be reported only once per input file)
In file included from /home/ubuntu/x86/staging_dir_i386/include/bits/types.h:30,
from /home/ubuntu/x86/staging_dir_i386/include/sys/types.h:30,
from /home/ubuntu/x86/staging_dir_i386/include/stdlib.h:317,
from src/base64utils.c:28:
/home/ubuntu/x86/staging_dir_i386/include/bits/kernel_types.h:35: warning: ISO C90 does not support 'long long'
In file included from src/base64utils.c:28:
/home/ubuntu/x86/staging_dir_i386/include/stdlib.h:417: warning: ISO C90 does not support 'long long'
src/base64utils.c:39: error: redefinition of typedef 'uint'
/home/ubuntu/x86/staging_dir_i386/include/sys/types.h:152: error: previous declaration of 'uint' was here
make[3]: *** [bin/base64utils.o] Error 1
make[3]: Leaving directory `/home/ubuntu/x86/build_i386/inadyn'
make[2]: *** [/home/ubuntu/x86/build_i386/inadyn/.built] Error 2
make[2]: Leaving directory `/home/ubuntu/x86/feeds/packages/net/inadyn'
*** inadyn compile failed
make[1]: *** [inadyn-compile] Error 1
make[1]: Leaving directory `/home/ubuntu/x86/package'
Build failed. Please re-run make with V=99 to see what's going on
make: *** [package/inadyn-compile] Fehler 1