All pastes #627679 Raw Edit

Someone

public text v1 · immutable
·published 2007-07-20 13:30 UTC
rendered paste body
  transformation: 0.010998, building DFA: 2.029692
  DFA minimization: 0.448932, making insn equivalence: 0.000000
 all automaton generation: 2.599605, output: 0.056991
/var/tmp/paludis/sys-devel/gcc-4.2.0/work/gcc-4.2.0/gcc/recog.c: In function 'rest_of_handle_peephole2':
/var/tmp/paludis/sys-devel/gcc-4.2.0/work/gcc-4.2.0/gcc/recog.c:3460: internal compiler error: Segmentation fault
Please submit a full bug report,
with preprocessed source if appropriate.
See <URL:http://bugs.gentoo.org/> for instructions.
The bug is not reproducible, so it is likely a hardware or OS problem.
make[3]: *** [recog.o] Error 1
make[2]: *** [all-stagefeedback-gcc] Error 2
make[1]: *** [stagefeedback-bubble] Error 2
make: *** [profiledbootstrap] Error 2

!!! ERROR in sys-devel/gcc-4.2.0:
!!! In gcc_do_make at line 3552
!!! emake failed with profiledbootstrap

!!! Call stack:
!!!    * gcc_do_make (/var/tmp/paludis/sys-devel/gcc-4.2.0/temp/loadsaveenv:3552)
!!!    * gcc_src_compile (/var/tmp/paludis/sys-devel/gcc-4.2.0/temp/loadsaveenv:3722)
!!!    * toolchain_src_compile (/var/tmp/paludis/sys-devel/gcc-4.2.0/temp/loadsaveenv:6001)
!!!    * src_compile (/var/tmp/paludis/sys-devel/gcc-4.2.0/temp/loadsaveenv:5543)
!!!    * ebuild_f_compile (/usr/libexec/paludis/src_compile.bash:51)
!!!    * ebuild_main (/usr/libexec/paludis/ebuild.bash:363)
!!!    * main (/usr/libexec/paludis/ebuild.bash:381)

die trap: exiting with error.