rendered paste body/usr/src/hmm0/buildroot/build_mipsel/staging_dir/bin/sym/bfin-uclinux-gcc -g -o asterisk -Wl,"-elf2flt=-s 1500000" -static io.o sched.o logger.o frame.o loader.o config.o channel.o translate.o file.o say.o pbx.o cli.o md5.o term.o ulaw.o alaw.o callerid.o fskmodem.o image.o app.o cdr.o tdd.o acl.o rtp.o manager.o asterisk.o ast_expr.o dsp.o chanvars.o indications.o autoservice.o db.o privacy.o astmm.o enum.o srv.o dns.o aescrypt.o aestab.o aeskey.o utils.o -Wl,-elf2flt channels/.libs/chan_sip.a channels/.libs/chan_iax2.a channels/.libs/chan_agent.a channels/.libs/chan_local.a channels/.libs/chan_skinny.a channels/.libs/chan_modem.a channels/.libs/chan_zap.a res/.libs/res_adsi.a res/.libs/res_features.a res/.libs/res_crypto.a res/.libs/res_musiconhold.a res/.libs/res_indications.a res/.libs/res_monitor.a res/.libs/res_agi.a pbx/.libs/pbx_config.a pbx/.libs/pbx_wilcalu.a pbx/.libs/pbx_spool.a apps/.libs/app_dial.a apps/.libs/app_playback.a apps/.libs/app_voicemail.a apps/.libs/app_directory.a apps/.libs/app_mp3.a apps/.libs/app_system.a apps/.libs/app_echo.a apps/.libs/app_record.a apps/.libs/app_image.a apps/.libs/app_url.a apps/.libs/app_disa.a apps/.libs/app_qcall.a apps/.libs/app_adsiprog.a apps/.libs/app_getcpeid.a apps/.libs/app_milliwatt.a apps/.libs/app_zapateller.a apps/.libs/app_setcallerid.a apps/.libs/app_festival.a apps/.libs/app_queue.a apps/.libs/app_senddtmf.a apps/.libs/app_parkandannounce.a apps/.libs/app_striplsd.a apps/.libs/app_setcidname.a apps/.libs/app_lookupcidname.a apps/.libs/app_substring.a apps/.libs/app_macro.a apps/.libs/app_authenticate.a apps/.libs/app_softhangup.a apps/.libs/app_lookupblacklist.a apps/.libs/app_waitforring.a apps/.libs/app_privacy.a apps/.libs/app_db.a apps/.libs/app_chanisavail.a apps/.libs/app_enumlookup.a apps/.libs/app_transfer.a apps/.libs/app_setcidnum.a apps/.libs/app_cdr.a apps/.libs/app_hasnewvoicemail.a apps/.libs/app_sayunixtime.a apps/.libs/app_cut.a apps/.libs/app_read.a apps/.libs/app_setcdruserfield.a apps/.libs/app_random.a apps/.libs/app_ices.a apps/.libs/app_eval.a apps/.libs/app_nbscat.a apps/.libs/app_sendtext.a apps/.libs/app_exec.a apps/.libs/app_sms.a apps/.libs/app_groupcount.a apps/.libs/app_txtcidname.a apps/.libs/app_controlplayback.a apps/.libs/app_talkdetect.a apps/.libs/app_alarmreceiver.a apps/.libs/app_userevent.a apps/.libs/app_verbose.a apps/.libs/app_test.a apps/.libs/app_forkcdr.a formats/.libs/format_gsm.a formats/.libs/format_wav.a formats/.libs/format_wav_gsm.a formats/.libs/format_vox.a formats/.libs/format_pcm.a formats/.libs/format_g729.a formats/.libs/format_pcm_alaw.a formats/.libs/format_h263.a formats/.libs/format_g726.a formats/.libs/format_ilbc.a formats/.libs/format_sln.a cdr/.libs/cdr_csv.a cdr/.libs/cdr_manager.a editline/libedit.a db1-ast/libdb1.a stdtime/libtime.a -lltdl -lm -lncurses -lssl -lz -lcrypto -ltonezone -lpthread -L/usr/src/hmm0/uCasterisk-0.1.3.1/staging-bfin-uclinux/usr/lib
/usr/src/hmm0/buildroot/build_mipsel/staging_dir/lib/gcc/mipsel-linux-uclibc/3.4.3/../../../../mipsel-linux-uclibc/bin/ld: warning: cannot find entry symbol lf2flt; defaulting to 0000000000400140
frame.o(.text+0x45b4): In function `ast_parse_allow_disallow':
/usr/src/hmm0/uCasterisk-0.1.3.1/build-bfin-uclinux/asterisk-1.0.9/frame.c:979: undefined reference to `_stack_start'
channel.o(.text+0x3d44): In function `ast_waitfor_n_fd':
/usr/src/hmm0/uCasterisk-0.1.3.1/build-bfin-uclinux/asterisk-1.0.9/channel.c:879: undefined reference to `_stack_start'
channel.o(.text+0x438c): In function `ast_waitfor_nandfds':
/usr/src/hmm0/uCasterisk-0.1.3.1/build-bfin-uclinux/asterisk-1.0.9/channel.c:944: undefined reference to `_stack_start'
channel.o(.text+0x8c08): In function `__ast_request_and_dial':
/usr/src/hmm0/uCasterisk-0.1.3.1/build-bfin-uclinux/asterisk-1.0.9/channel.c:1771: undefined reference to `_stack_start'
channel.o(.text+0xe958): In function `ast_get_group':
/usr/src/hmm0/uCasterisk-0.1.3.1/build-bfin-uclinux/asterisk-1.0.9/channel.c:2909: undefined reference to `_stack_start'
file.o(.text+0x3108):/usr/src/hmm0/uCasterisk-0.1.3.1/build-bfin-uclinux/asterisk-1.0.9/file.c:681: more undefined references to `_stack_start' follow
asterisk.o(.text+0x7e10): In function `main':
/usr/src/hmm0/uCasterisk-0.1.3.1/build-bfin-uclinux/asterisk-1.0.9/asterisk.c:1591: undefined reference to `lt_preloaded_symbols'
ast_expr.o(.text+0x1b8): In function `ast_yyparse':
/usr/src/hmm0/uCasterisk-0.1.3.1/build-bfin-uclinux/asterisk-1.0.9/ast_expr.c:1019: undefined reference to `_stack_start'
dsp.o(.text+0x405c): In function `ast_dsp_process':
/usr/src/hmm0/uCasterisk-0.1.3.1/build-bfin-uclinux/asterisk-1.0.9/dsp.c:1451: undefined reference to `_stack_start'
dsp.o(.text+0x41e4):/usr/src/hmm0/uCasterisk-0.1.3.1/build-bfin-uclinux/asterisk-1.0.9/dsp.c:1460: undefined reference to `_stack_start'
indications.o(.text+0xa40): In function `ast_playtones_start':
/usr/src/hmm0/uCasterisk-0.1.3.1/build-bfin-uclinux/asterisk-1.0.9/indications.c:152: undefined reference to `_stack_start'
db.o(.text+0x74): In function `dbinit':
/usr/src/hmm0/uCasterisk-0.1.3.1/build-bfin-uclinux/asterisk-1.0.9/db.c:47: undefined reference to `dbopen'
utils.o(.text+0x1154): In function `ast_strcasestr':
/usr/src/hmm0/uCasterisk-0.1.3.1/build-bfin-uclinux/asterisk-1.0.9/utils.c:397: undefined reference to `_stack_start'
utils.o(.text+0x11b4):/usr/src/hmm0/uCasterisk-0.1.3.1/build-bfin-uclinux/asterisk-1.0.9/utils.c:398: undefined reference to `_stack_start'
editline/libedit.a(readline.o_a)(.text+0xb04): In function `_history_expand_command':
/usr/src/hmm0/uCasterisk-0.1.3.1/build-bfin-uclinux/asterisk-1.0.9/editline/readline.c:396: undefined reference to `_stack_start'
editline/libedit.a(readline.o_a)(.text+0xc68):/usr/src/hmm0/uCasterisk-0.1.3.1/build-bfin-uclinux/asterisk-1.0.9/editline/readline.c:429: undefined reference to `_stack_start'
editline/libedit.a(readline.o_a)(.text+0x1a70): In function `history_expand':
/usr/src/hmm0/uCasterisk-0.1.3.1/build-bfin-uclinux/asterisk-1.0.9/editline/readline.c:669: undefined reference to `_stack_start'
editline/libedit.a(readline.o_a)(.text+0x3ea8):/usr/src/hmm0/uCasterisk-0.1.3.1/build-bfin-uclinux/asterisk-1.0.9/editline/readline.c:1462: more undefined references to `_stack_start' follow
/usr/src/hmm0/uCasterisk-0.1.3.1/staging-bfin-uclinux/usr/lib/libltdl.a(ltdl.o)(.text+0x800): In function `sys_dl_open':
/usr/src/hmm0/uCasterisk-0.1.3.1/build-bfin-uclinux/libtool-1.5.20/libltdl/ltdl.c:1110: undefined reference to `dlopen'
/usr/src/hmm0/uCasterisk-0.1.3.1/staging-bfin-uclinux/usr/lib/libltdl.a(ltdl.o)(.text+0x8a8): In function `sys_dl_close':
/usr/src/hmm0/uCasterisk-0.1.3.1/build-bfin-uclinux/libtool-1.5.20/libltdl/ltdl.c:1127: undefined reference to `dlclose'
/usr/src/hmm0/uCasterisk-0.1.3.1/staging-bfin-uclinux/usr/lib/libltdl.a(ltdl.o)(.text+0x944): In function `sys_dl_sym':
/usr/src/hmm0/uCasterisk-0.1.3.1/build-bfin-uclinux/libtool-1.5.20/libltdl/ltdl.c:1142: undefined reference to `dlsym'
collect2: ld returned 1 exit status
make[2]: *** [asterisk] Error 1
make[2]: Leaving directory `/usr/src/hmm0/uCasterisk-0.1.3.1/build-bfin-uclinux/asterisk-1.0.9'
make[1]: *** [asterisk] Error 2
make[1]: Leaving directory `/usr/src/hmm0/uCasterisk-0.1.3.1/package/asterisk'
make: *** [ast] Error 2
debian:/usr/src/hmm0/uCasterisk-0.1.3.1#