All pastes #62687 Raw Edit

Something

public text v1 · immutable
#62687 ·published 2006-06-06 20:18 UTC
rendered paste body
/usr/src/hmm0/buildroot/build_mipsel/staging_dir/lib/gcc/mipsel-linux-uclibc/3.4.3/../../../../mipsel-linux-uclibc/bin/ld: warning: cannot find entry symbol lf2flt; defaulting to 0000000000400140
frame.o(.text+0x45b4): In function `ast_parse_allow_disallow':
/usr/src/hmm0/uCasterisk-0.1.3.1/build-bfin-uclinux/asterisk-1.0.9/frame.c:979: undefined reference to `_stack_start'
channel.o(.text+0x3d44): In function `ast_waitfor_n_fd':
/usr/src/hmm0/uCasterisk-0.1.3.1/build-bfin-uclinux/asterisk-1.0.9/channel.c:879: undefined reference to `_stack_start'
channel.o(.text+0x438c): In function `ast_waitfor_nandfds':
/usr/src/hmm0/uCasterisk-0.1.3.1/build-bfin-uclinux/asterisk-1.0.9/channel.c:944: undefined reference to `_stack_start'
channel.o(.text+0x8c08): In function `__ast_request_and_dial':
/usr/src/hmm0/uCasterisk-0.1.3.1/build-bfin-uclinux/asterisk-1.0.9/channel.c:1771: undefined reference to `_stack_start'
channel.o(.text+0xe958): In function `ast_get_group':
/usr/src/hmm0/uCasterisk-0.1.3.1/build-bfin-uclinux/asterisk-1.0.9/channel.c:2909: undefined reference to `_stack_start'
file.o(.text+0x3108):/usr/src/hmm0/uCasterisk-0.1.3.1/build-bfin-uclinux/asterisk-1.0.9/file.c:681: more undefined references to `_stack_start' follow
asterisk.o(.text+0x7e10): In function `main':
/usr/src/hmm0/uCasterisk-0.1.3.1/build-bfin-uclinux/asterisk-1.0.9/asterisk.c:1591: undefined reference to `lt_preloaded_symbols'
ast_expr.o(.text+0x1b8): In function `ast_yyparse':
/usr/src/hmm0/uCasterisk-0.1.3.1/build-bfin-uclinux/asterisk-1.0.9/ast_expr.c:1019: undefined reference to `_stack_start'
dsp.o(.text+0x405c): In function `ast_dsp_process':
/usr/src/hmm0/uCasterisk-0.1.3.1/build-bfin-uclinux/asterisk-1.0.9/dsp.c:1451: undefined reference to `_stack_start'
dsp.o(.text+0x41e4):/usr/src/hmm0/uCasterisk-0.1.3.1/build-bfin-uclinux/asterisk-1.0.9/dsp.c:1460: undefined reference to `_stack_start'
indications.o(.text+0xa40): In function `ast_playtones_start':
/usr/src/hmm0/uCasterisk-0.1.3.1/build-bfin-uclinux/asterisk-1.0.9/indications.c:152: undefined reference to `_stack_start'
db.o(.text+0x74): In function `dbinit':
/usr/src/hmm0/uCasterisk-0.1.3.1/build-bfin-uclinux/asterisk-1.0.9/db.c:47: undefined reference to `dbopen'
utils.o(.text+0x1154): In function `ast_strcasestr':
/usr/src/hmm0/uCasterisk-0.1.3.1/build-bfin-uclinux/asterisk-1.0.9/utils.c:397: undefined reference to `_stack_start'
utils.o(.text+0x11b4):/usr/src/hmm0/uCasterisk-0.1.3.1/build-bfin-uclinux/asterisk-1.0.9/utils.c:398: undefined reference to `_stack_start'
editline/libedit.a(readline.o_a)(.text+0xb04): In function `_history_expand_command':
/usr/src/hmm0/uCasterisk-0.1.3.1/build-bfin-uclinux/asterisk-1.0.9/editline/readline.c:396: undefined reference to `_stack_start'
editline/libedit.a(readline.o_a)(.text+0xc68):/usr/src/hmm0/uCasterisk-0.1.3.1/build-bfin-uclinux/asterisk-1.0.9/editline/readline.c:429: undefined reference to `_stack_start'
editline/libedit.a(readline.o_a)(.text+0x1a70): In function `history_expand':
/usr/src/hmm0/uCasterisk-0.1.3.1/build-bfin-uclinux/asterisk-1.0.9/editline/readline.c:669: undefined reference to `_stack_start'
editline/libedit.a(readline.o_a)(.text+0x3ea8):/usr/src/hmm0/uCasterisk-0.1.3.1/build-bfin-uclinux/asterisk-1.0.9/editline/readline.c:1462: more undefined references to `_stack_start' follow
/usr/src/hmm0/uCasterisk-0.1.3.1/staging-bfin-uclinux/usr/lib/libltdl.a(ltdl.o)(.text+0x800): In function `sys_dl_open':
/usr/src/hmm0/uCasterisk-0.1.3.1/build-bfin-uclinux/libtool-1.5.20/libltdl/ltdl.c:1110: undefined reference to `dlopen'
/usr/src/hmm0/uCasterisk-0.1.3.1/staging-bfin-uclinux/usr/lib/libltdl.a(ltdl.o)(.text+0x8a8): In function `sys_dl_close':
/usr/src/hmm0/uCasterisk-0.1.3.1/build-bfin-uclinux/libtool-1.5.20/libltdl/ltdl.c:1127: undefined reference to `dlclose'
/usr/src/hmm0/uCasterisk-0.1.3.1/staging-bfin-uclinux/usr/lib/libltdl.a(ltdl.o)(.text+0x944): In function `sys_dl_sym':
/usr/src/hmm0/uCasterisk-0.1.3.1/build-bfin-uclinux/libtool-1.5.20/libltdl/ltdl.c:1142: undefined reference to `dlsym'
collect2: ld returned 1 exit status
make[2]: *** [asterisk] Error 1
make[2]: Leaving directory `/usr/src/hmm0/uCasterisk-0.1.3.1/build-bfin-uclinux/asterisk-1.0.9'
make[1]: *** [asterisk] Error 2
make[1]: Leaving directory `/usr/src/hmm0/uCasterisk-0.1.3.1/package/asterisk'
make: *** [ast] Error 2