All pastes #626732 Raw Edit

Someone

public text v1 · immutable
·published 2007-07-19 21:06 UTC
rendered paste body
./auto-str auto_usera `head -1 conf-users` > auto_usera.c
./compile auto_usera.c
./load qmail-getpw case.a substdio.a error.a str.a fs.a \
        auto_break.o auto_usera.o
./compile qmail-remote.c
qmail-remote.c:36:25: error: openssl/ssl.h: No such file or directory
qmail-remote.c:37: error: expected â=â, â,â, â;â, âasmâ or â__attribute__â be                                                 fore â*â token
qmail-remote.c: In function âssl_timeoutreadâ:
qmail-remote.c:132: error: âsslâ undeclared (first use in this function)
qmail-remote.c:132: error: (Each undeclared identifier is reported only once
qmail-remote.c:132: error: for each function it appears in.)
qmail-remote.c:134: error: âSSL_ERROR_WANT_READâ undeclared (first use in thi                                                 s function)
qmail-remote.c:135: error: âSSL_ERROR_NONEâ undeclared (first use in this fun                                                 ction)
qmail-remote.c: In function âssl_timeoutwriteâ:
qmail-remote.c:157: error: âsslâ undeclared (first use in this function)
qmail-remote.c:159: error: âSSL_ERROR_WANT_WRITEâ undeclared (first use in th                                                 is function)
qmail-remote.c:160: error: âSSL_ERROR_NONEâ undeclared (first use in this fun                                                 ction)
qmail-remote.c: At top level:
qmail-remote.c:177: error: expected â)â before â*â token
qmail-remote.c:183: error: expected declaration specifiers or â...â before âX                                                 509_STORE_CTXâ
qmail-remote.c: In function âsmtpâ:
qmail-remote.c:346: error: âSSL_CTXâ undeclared (first use in this function)
qmail-remote.c:346: error: âctxâ undeclared (first use in this function)
qmail-remote.c:400: error: âsslâ undeclared (first use in this function)
qmail-remote.c:404: error: âSSL_FILETYPE_PEMâ undeclared (first use in this f                                                 unction)
qmail-remote.c:409: error: âclient_cert_cbâ undeclared (first use in this fun                                                 ction)
qmail-remote.c:418: error: âSSL_VERIFY_PEERâ undeclared (first use in this fu                                                 nction)
qmail-remote.c:454: error: âX509_V_OKâ undeclared (first use in this function                                                 )
qmail-remote.c:462: error: âNID_commonNameâ undeclared (first use in this fun                                                 ction)
qmail-remote.c: In function âmainâ:
qmail-remote.c:590: warning: return type of âmainâ is not âintâ
make: *** [qmail-remote.o] Error 1