All pastes #625052 Raw Edit

Unnamed

public text v1 · immutable
·published 2007-07-18 18:41 UTC
rendered paste body
/usr/include/osg/Group:51: note: candidates are: virtual bool osg::Group::addChild(osg::Node*)
pt_lights.cxx:521: error: no matching function for call to ‘osg::Sequence::addChild(osg::Group*, double)’
/usr/include/osg/Group:51: note: candidates are: virtual bool osg::Group::addChild(osg::Node*)
pt_lights.cxx:525: error: ‘class osg::Sequence’ has no member named ‘setSync’
pt_lights.cxx: In static member function ‘static osg::Node* SGLightFactory::getOdal(const SGLightBin&)’:
pt_lights.cxx:560: error: ‘class osg::Sequence’ has no member named ‘setDefaultTime’
pt_lights.cxx:564: error: no matching function for call to ‘osg::Sequence::addChild(osg::Node*, float&)’
/usr/include/osg/Group:51: note: candidates are: virtual bool osg::Group::addChild(osg::Node*)
pt_lights.cxx:570: error: no matching function for call to ‘osg::Sequence::addChild(osg::Group*&, float&)’
/usr/include/osg/Group:51: note: candidates are: virtual bool osg::Group::addChild(osg::Node*)
pt_lights.cxx:573: error: no matching function for call to ‘osg::Sequence::addChild(osg::Group*, double)’
/usr/include/osg/Group:51: note: candidates are: virtual bool osg::Group::addChild(osg::Node*)
pt_lights.cxx:577: error: ‘class osg::Sequence’ has no member named ‘setSync’
make[4]: *** [pt_lights.o] Error 1
make[4]: Leaving directory `/home/adam/flightgear-dev/simgear/source/simgear/scene/tgdb'
make[3]: *** [all-recursive] Error 1
make[3]: Leaving directory `/home/adam/flightgear-dev/simgear/source/simgear/scene'