rendered paste bodynvidia-installer log file '/var/log/nvidia-installer.log'
creation time: Tue Jul 17 14:10:10 2007
option status:
license pre-accepted : false
update : false
force update : false
expert : false
uninstall : false
driver info : false
precompiled interfaces : true
no ncurses color : false
query latest version : false
OpenGL header files : true
no questions : false
silent : false
no recursion : false
no backup : false
kernel module only : false
sanity : false
add this kernel : false
no runlevel check : false
no network : false
no ABI note : false
no RPMs : false
no kernel module : false
force SELinux : default
no X server check : false
force tls : (not specified)
X install prefix : (not specified)
X library install path : (not specified)
X module install path : (not specified)
OpenGL install prefix : (not specified)
OpenGL install libdir : (not specified)
utility install prefix : (not specified)
utility install libdir : (not specified)
doc install prefix : (not specified)
kernel name : (not specified)
kernel include path : (not specified)
kernel source path : (not specified)
kernel output path : (not specified)
kernel install path : (not specified)
proc mount point : /proc
ui : (not specified)
tmpdir : /tmp
ftp mirror : ftp://download.nvidia.com
RPM file list : (not specified)
Using: nvidia-installer ncurses user interface
-> License accepted.
-> No precompiled kernel interface was found to match your kernel; would you li
ke the installer to attempt to download a kernel interface for your kernel f
rom the NVIDIA ftp site (ftp://download.nvidia.com)? (Answer: Yes)
-> No matching precompiled kernel interface was found on the NVIDIA ftp site;
this means that the installer will need to compile a kernel interface for
your kernel.
-> Performing CC sanity check with CC="cc".
-> Performing CC version check with CC="cc".
-> Kernel source path: '/lib/modules/2.6.21-2-686/build'
-> Kernel output path: '/lib/modules/2.6.21-2-686/build'
-> Performing rivafb check.
-> Performing nvidiafb check.
-> Cleaning kernel module build directory.
executing: 'cd ./usr/src/nv; make clean'...
rm -f -f nv.o nv-vm.o os-agp.o os-interface.o os-registry.o nv.o nv-vm.o os-
agp.o os-interface.o os-registry.o nvidia.mod.o
rm -f -f build-in.o nv-linux.o *.d .*.{cmd,flags}
rm -f -f nvidia.{o,ko,mod.{o,c}} nv_compiler.h *~
rm -f -rf .tmp_versions
-> Building kernel module:
executing: 'cd ./usr/src/nv; make module SYSSRC=/lib/modules/2.6.21-2-686/bu
ild SYSOUT=/lib/modules/2.6.21-2-686/build'...
NVIDIA: calling KBUILD...
make CC=cc KBUILD_VERBOSE=1 -C /lib/modules/2.6.21-2-686/build SUBDIRS=/tmp
/selfgz3430/NVIDIA-Linux-x86-1.0-7184-pkg1/usr/src/nv modules
test -e include/linux/autoconf.h -a -e include/config/auto.conf || ( \
echo; \
echo " ERROR: Kernel configuration is invalid."; \
echo " include/linux/autoconf.h or include/config/auto.conf are mis
sing."; \
echo " Run 'make oldconfig && make prepare' on kernel src to fix it
."; \
echo; \
/bin/false)
mkdir -p /tmp/selfgz3430/NVIDIA-Linux-x86-1.0-7184-pkg1/usr/src/nv/.tmp_vers
ions
rm -f /tmp/selfgz3430/NVIDIA-Linux-x86-1.0-7184-pkg1/usr/src/nv/.tmp_version
s/*
make -f scripts/Makefile.build obj=/tmp/selfgz3430/NVIDIA-Linux-x86-1.0-7184
-pkg1/usr/src/nv
echo \#define NV_COMPILER \"`cc -v 2>&1 | tail -n 1`\" > /tmp/selfgz3430/NVI
DIA-Linux-x86-1.0-7184-pkg1/usr/src/nv/nv_compiler.h
cc -Wp,-MD,/tmp/selfgz3430/NVIDIA-Linux-x86-1.0-7184-pkg1/usr/src/nv/.nv.o
.d -nostdinc -isystem /usr/lib/gcc/i486-linux-gnu/4.1.3/include -D__KERNEL_
_ -Iinclude -include include/linux/autoconf.h -Wall -Wundef -Wstrict-protot
ypes -Wno-trigraphs -fno-strict-aliasing -fno-common -Os -pipe -msoft-float
-mregparm=3 -freg-struct-return -mpreferred-stack-boundary=2 -march=i686 -f
freestanding -maccumulate-outgoing-args -DCONFIG_AS_CFI=1 -DCONFIG_AS_CFI_SI
GNAL_FRAME=1 -Iinclude/asm-i386/mach-default -fomit-frame-pointer -fno-stac
k-protector -Wdeclaration-after-statement -Wno-pointer-sign -I/tmp/selfgz343
0/NVIDIA-Linux-x86-1.0-7184-pkg1/usr/src/nv -Wall -Wimplicit -Wreturn-type -
Wswitch -Wformat -Wchar-subscripts -Wparentheses -Wpointer-arith -Wno-multi
char -Werror -O -fno-common -MD -Wsign-compare -Wno-cast-qual -Wno-error
-D_LOOSE_KERNEL_NAMES -D__KERNEL__ -DMODULE -DNTRM -D_GNU_SOURCE -D_LOOSE_K
ERNEL_NAMES -D__KERNEL__ -DMODULE -DNV_MAJOR_VERSION=1 -DNV_MINOR_VERSION=0
-DNV_PATCHLEVEL=7184 -DNV_UNIX -DNV_LINUX -DNV_INT64_OK -DNVCPU_X86
-UDEBUG -U_DEBUG -DNDEBUG -DNV_SIGNAL_STRUCT_RLIM -DNV_MULTIPLE_BRIDGE_AG
PGART_PRESENT -DN
V_PCI_GET_CLASS_PRESENT -DNV_PM_MESSAGE_T_PRESENT -DNV_PCI_CHOOSE_STATE_PRES
ENT -DNV_VM_INSERT_PAGE_PRESENT -DNV_REMAP_PFN_RANGE_PRESENT -DNV_CHANGE_PAG
E_ATTR_PRESENT -DNV_VMAP_4_PRESENT -DMODULE -D"KBUILD_STR(s)=#s" -D"KBUILD_
BASENAME=KBUILD_STR(nv)" -D"KBUILD_MODNAME=KBUILD_STR(nvidia)" -c -o /tmp/s
elfgz3430/NVIDIA-Linux-x86-1.0-7184-pkg1/usr/src/nv/.tmp_nv.o /tmp/selfgz343
0/NVIDIA-Linux-x86-1.0-7184-pkg1/usr/src/nv/nv.c
In file included from /tmp/selfgz3430/NVIDIA-Linux-x86-1.0-7184-pkg1/usr/src
/nv/nv.c:14:
/tmp/selfgz3430/NVIDIA-Linux-x86-1.0-7184-pkg1/usr/src/nv/nv-linux.h:17:26:
error: linux/config.h: Datei oder Verzeichnis nicht gefunden
In file included from include/linux/list.h:8,
from include/linux/wait.h:22,
from include/asm/semaphore.h:41,
from include/linux/sched.h:59,
from include/linux/utsname.h:35,
from /tmp/selfgz3430/NVIDIA-Linux-x86-1.0-7184-pkg1/usr/src
/nv/nv-linux.h:19,
from /tmp/selfgz3430/NVIDIA-Linux-x86-1.0-7184-pkg1/usr/src
/nv/nv.c:14:
include/linux/prefetch.h: In function ‘prefetch_range’:
include/linux/prefetch.h:62: warning: pointer of type ‘void *’ used in a
rithmetic
/tmp/selfgz3430/NVIDIA-Linux-x86-1.0-7184-pkg1/usr/src/nv/nv.c: At top level
:
/tmp/selfgz3430/NVIDIA-Linux-x86-1.0-7184-pkg1/usr/src/nv/nv.c:93: warning:
‘kmem_cache_t’ is deprecated
/tmp/selfgz3430/NVIDIA-Linux-x86-1.0-7184-pkg1/usr/src/nv/nv.c: In function
‘nv_kern_open’:
/tmp/selfgz3430/NVIDIA-Linux-x86-1.0-7184-pkg1/usr/src/nv/nv.c:1764: warning
: passing argument 2 of ‘request_irq’ from incompatible pointer type
make[3]: *** [/tmp/selfgz3430/NVIDIA-Linux-x86-1.0-7184-pkg1/usr/src/nv/nv.o
] Fehler 1
make[2]: *** [_module_/tmp/selfgz3430/NVIDIA-Linux-x86-1.0-7184-pkg1/usr/src
/nv] Fehler 2
NVIDIA: left KBUILD.
nvidia.ko failed to build!
make[1]: *** [module] Fehler 1
make: *** [module] Fehler 2
-> Error.
ERROR: Unable to build the NVIDIA kernel module.
ERROR: Installation has failed. Please see the file
'/var/log/nvidia-installer.log' for details. You may find suggestions
on fixing installation problems in the README available on the Linux
driver download page at www.nvidia.com.