In file included from e-component-listener.c:18:
e-component-listener.h:15:27: error: bonobo/Bonobo.h: No such file or directory
In file included from e-component-listener.c:18:
e-component-listener.h:39: error: expected ')' before 'comp'
e-component-listener.h:41: error: expected '=', ',', ';', 'asm' or '__attribute__' before 'e_component_listener_get_component'
e-component-listener.h:43: error: expected declaration specifiers or '...' before 'Bonobo_Unknown'
e-component-listener.c:21: error: expected specifier-qualifier-list before 'Bonobo_Unknown'
e-component-listener.c: In function 'connection_listen_cb':
e-component-listener.c:45: warning: implicit declaration of function 'ORBit_small_get_connection_status'
e-component-listener.c:45: error: 'EComponentListenerPrivate' has no member named 'component'
e-component-listener.c:46: error: 'ORBIT_CONNECTION_DISCONNECTED' undeclared (first use in this function)
e-component-listener.c:46: error: (Each undeclared identifier is reported only once
e-component-listener.c:46: error: for each function it appears in.)
e-component-listener.c:51: error: 'EComponentListenerPrivate' has no member named 'component'
e-component-listener.c:51: error: 'CORBA_OBJECT_NIL' undeclared (first use in this function)
e-component-listener.c: In function 'e_component_listener_init':
e-component-listener.c:85: error: 'EComponentListenerPrivate' has no member named 'component'
e-component-listener.c:85: error: 'CORBA_OBJECT_NIL' undeclared (first use in this function)
e-component-listener.c: In function 'e_component_listener_finalize':
e-component-listener.c:97: error: 'EComponentListenerPrivate' has no member named 'component'
e-component-listener.c:97: error: 'CORBA_OBJECT_NIL' undeclared (first use in this function)
e-component-listener.c:98: error: 'EComponentListenerPrivate' has no member named 'component'
e-component-listener.c: At top level:
e-component-listener.c:118: error: expected ')' before 'comp'
e-component-listener.c:135: error: expected '=', ',', ';', 'asm' or '__attribute__' before 'e_component_listener_get_component'
e-component-listener.c:142: error: expected declaration specifiers or '...' before 'Bonobo_Unknown'
e-component-listener.c: In function 'e_component_listener_set_component':
e-component-listener.c:146: error: 'EComponentListenerPrivate' has no member named 'component'
e-component-listener.c:146: error: 'comp' undeclared (first use in this function)
e-component-listener.c:147: warning: implicit declaration of function 'ORBit_small_listen_for_broken'
make[2]: *** [e-component-listener.lo] Error 1
make[2]: Leaving directory `/home/evolution/src/jhbuild-evo/evolution-data-server/libedataserver'
make[1]: *** [all-recursive] Error 1
make[1]: Leaving directory `/home/evolution/src/jhbuild-evo/evolution-data-server'
make: *** [all] Error 2
*** error during stage build of evolution-data-server: ########## Error running make *** [1/6]
[1] rerun stage build
[2] ignore error and continue to install
[3] give up on module
[4] start shell
[5] go to stage force_checkout
[6] go to stage configure