rendered paste bodyBuilding target “AppleSMBIOS” of project “AppleSMBIOS” with configuration “Development” — (14 errors)
cd "/Users/user/Documents/KernelBuilding/SMBIOS/Source/Netkas/Version 3/AppleSMBIOS-4"
setenv ASCII_OUTPUT_ANNOTATION YES
setenv ENABLE_APPLE_JAM_EXTENSIONS YES
setenv ENABLE_APPLE_JAM_OUTPUT_ANNOTATION YES
setenv GROUP user
setenv NATIVE_ARCH i386
setenv USER user
/Developer/Private/jam -d1 -j2 JAMBASE=/Developer/Makefiles/pbx_jamfiles/ProjectBuilderJambase JAMFILE=/Users/user/Documents/KernelBuilding/SMBIOS/Source/Netkas/Version\ 3/AppleSMBIOS-4/build/AppleSMBIOS.build/Development/AppleSMBIOS.build/AppleSMBIOS.jam build ACTION=build _DEFAULT_GCC_VERSION=4.0 GCC_VERSION_IDENTIFIER=4_0 CONFIGURATION=Development BUILD_STYLE=Development CPP_HEADERMAP_FILE=/Users/user/Documents/KernelBuilding/SMBIOS/Source/Netkas/Version\ 3/AppleSMBIOS-4/build/AppleSMBIOS.build/Development/AppleSMBIOS.build/AppleSMBIOS.hmap SRCROOT=/Users/user/Documents/KernelBuilding/SMBIOS/Source/Netkas/Version\ 3/AppleSMBIOS-4 OBJROOT=/Users/user/Documents/KernelBuilding/SMBIOS/Source/Netkas/Version\ 3/AppleSMBIOS-4/build SYMROOT=/Users/user/Documents/KernelBuilding/SMBIOS/Source/Netkas/Version\ 3/AppleSMBIOS-4/build DSTROOT=/tmp/AppleSMBIOS.dst
cd "/Users/user/Documents/KernelBuilding/SMBIOS/Source/Netkas/Version 3/AppleSMBIOS-4"
setenv ASCII_OUTPUT_ANNOTATION YES
setenv ENABLE_APPLE_JAM_EXTENSIONS YES
setenv ENABLE_APPLE_JAM_OUTPUT_ANNOTATION YES
setenv GROUP user
setenv NATIVE_ARCH i386
setenv USER user
/Developer/Private/jam -d1 -j2 JAMBASE=/Developer/Makefiles/pbx_jamfiles/ProjectBuilderJambase JAMFILE=/Users/user/Documents/KernelBuilding/SMBIOS/Source/Netkas/Version\ 3/AppleSMBIOS-4/build/AppleSMBIOS.build/Development/AppleSMBIOS.build/AppleSMBIOS.jam build ACTION=build _DEFAULT_GCC_VERSION=4.0 GCC_VERSION_IDENTIFIER=4_0 CONFIGURATION=Development BUILD_STYLE=Development CPP_HEADERMAP_FILE=/Users/user/Documents/KernelBuilding/SMBIOS/Source/Netkas/Version\ 3/AppleSMBIOS-4/build/AppleSMBIOS.build/Development/AppleSMBIOS.build/AppleSMBIOS.hmap SRCROOT=/Users/user/Documents/KernelBuilding/SMBIOS/Source/Netkas/Version\ 3/AppleSMBIOS-4 OBJROOT=/Users/user/Documents/KernelBuilding/SMBIOS/Source/Netkas/Version\ 3/AppleSMBIOS-4/build SYMROOT=/Users/user/Documents/KernelBuilding/SMBIOS/Source/Netkas/Version\ 3/AppleSMBIOS-4/build DSTROOT=/tmp/AppleSMBIOS.dst
/usr/bin/g++-4.0 -c "-I/Users/user/Documents/KernelBuilding/SMBIOS/Source/Netkas/Version 3/AppleSMBIOS-4/build/AppleSMBIOS.build/Development/AppleSMBIOS.build/AppleSMBIOS.hmap" -F"/Users/user/Documents/KernelBuilding/SMBIOS/Source/Netkas/Version 3/AppleSMBIOS-4/build/Development" -I"/Users/user/Documents/KernelBuilding/SMBIOS/Source/Netkas/Version 3/AppleSMBIOS-4/build/Development/include" -arch i386 -fno-common -nostdinc -O0 -Wmost -Wno-four-char-constants -Wno-unknown-pragmas -I/System/Library/Frameworks/Kernel.framework/PrivateHeaders -I/System/Library/Frameworks/Kernel.framework/Headers -fno-builtin -finline -fno-keep-inline-functions -force_cpusubtype_ALL -fno-rtti -fno-exceptions -fcheck-new -msoft-float -fapple-kext -static -DKERNEL -DKERNEL_PRIVATE -DDRIVER_PRIVATE -DAPPLE -DNeXT -pipe "-fmessage-length=0" -g -I"/Users/user/Documents/KernelBuilding/SMBIOS/Source/Netkas/Version 3/AppleSMBIOS-4/build/AppleSMBIOS.build/Development/AppleSMBIOS.build/DerivedSources" -I"/Users/user/Documents/KernelBuilding/SMBIOS/Source/Netkas/Version 3/AppleSMBIOS-4/build/AppleSMBIOS.build/Development/AppleSMBIOS.build/DerivedSources" AppleSMBIOS.cpp -o "/Users/user/Documents/KernelBuilding/SMBIOS/Source/Netkas/Version 3/AppleSMBIOS-4/build/AppleSMBIOS.build/Development/AppleSMBIOS.build/Objects-normal/i386/AppleSMBIOS.o"
AppleSMBIOS.cpp: In member function 'virtual bool AppleSMBIOS::start(IOService*)':
AppleSMBIOS.cpp:170: error: 'memSpeedData' was not declared in this scope
AppleSMBIOS.cpp:171: error: 'memInfoData' was not declared in this scope
AppleSMBIOS.cpp: In member function 'virtual void AppleSMBIOS::free()':
AppleSMBIOS.cpp:202: error: 'memSpeedData' was not declared in this scope
AppleSMBIOS.cpp:203: error: 'memInfoData' was not declared in this scope
AppleSMBIOS.cpp: In member function 'void AppleSMBIOS::processSMBIOSStructure(const SMBStructSystemInformation*, SMBPackedStrings*)':
AppleSMBIOS.cpp:427: error: 'kIOPlatformSerialNumberKey' was not declared in this scope
AppleSMBIOS.cpp: In member function 'void AppleSMBIOS::processSMBIOSStructure(const SMBStructMemoryDevice*, SMBPackedStrings*)':
AppleSMBIOS.cpp:628: error: 'memSpeedData' was not declared in this scope
AppleSMBIOS.cpp:629: error: 'memInfoData' was not declared in this scope
AppleSMBIOS.cpp: In member function 'void AppleSMBIOS::updateDeviceTree()':
AppleSMBIOS.cpp:722: error: 'memSpeedData' was not declared in this scope
AppleSMBIOS.cpp:724: error: no matching function for call to 'IOService::setProperty(const char [12], <type error>)'
/System/Library/Frameworks/Kernel.framework/Headers/IOKit/IORegistryEntry.h:265: note: candidates are: virtual bool IORegistryEntry::setProperty(const OSSymbol*, OSObject*)
/System/Library/Frameworks/Kernel.framework/Headers/IOKit/IORegistryEntry.h:274: note: virtual bool IORegistryEntry::setProperty(const OSString*, OSObject*)
/System/Library/Frameworks/Kernel.framework/Headers/IOKit/IORegistryEntry.h:283: note: virtual bool IORegistryEntry::setProperty(const char*, OSObject*)
/System/Library/Frameworks/Kernel.framework/Headers/IOKit/IORegistryEntry.h:292: note: virtual bool IORegistryEntry::setProperty(const char*, const char*)
/System/Library/Frameworks/Kernel.framework/Headers/IOKit/IORegistryEntry.h:301: note: virtual bool IORegistryEntry::setProperty(const char*, bool)
/System/Library/Frameworks/Kernel.framework/Headers/IOKit/IORegistryEntry.h:313: note: virtual bool IORegistryEntry::setProperty(const char*, long long unsigned int, unsigned int)
/System/Library/Frameworks/Kernel.framework/Headers/IOKit/IORegistryEntry.h:325: note: virtual bool IORegistryEntry::setProperty(const char*, void*, unsigned int)
AppleSMBIOS.cpp:725: error: 'memInfoData' was not declared in this scope
AppleSMBIOS.cpp:732: error: 'memInfoData' was not declared in this scope
AppleSMBIOS.cpp:733: error: no matching function for call to 'IOService::setProperty(const char [12], <type error>)'
/System/Library/Frameworks/Kernel.framework/Headers/IOKit/IORegistryEntry.h:265: note: candidates are: virtual bool IORegistryEntry::setProperty(const OSSymbol*, OSObject*)
/System/Library/Frameworks/Kernel.framework/Headers/IOKit/IORegistryEntry.h:274: note: virtual bool IORegistryEntry::setProperty(const OSString*, OSObject*)
/System/Library/Frameworks/Kernel.framework/Headers/IOKit/IORegistryEntry.h:283: note: virtual bool IORegistryEntry::setProperty(const char*, OSObject*)
/System/Library/Frameworks/Kernel.framework/Headers/IOKit/IORegistryEntry.h:292: note: virtual bool IORegistryEntry::setProperty(const char*, const char*)
/System/Library/Frameworks/Kernel.framework/Headers/IOKit/IORegistryEntry.h:301: note: virtual bool IORegistryEntry::setProperty(const char*, bool)
/System/Library/Frameworks/Kernel.framework/Headers/IOKit/IORegistryEntry.h:313: note: virtual bool IORegistryEntry::setProperty(const char*, long long unsigned int, unsigned int)
/System/Library/Frameworks/Kernel.framework/Headers/IOKit/IORegistryEntry.h:325: note: virtual bool IORegistryEntry::setProperty(const char*, void*, unsigned int)
AppleSMBIOS.cpp:734: error: no matching function for call to 'IOService::setProperty(const char [10], <type error>)'
/System/Library/Frameworks/Kernel.framework/Headers/IOKit/IORegistryEntry.h:265: note: candidates are: virtual bool IORegistryEntry::setProperty(const OSSymbol*, OSObject*)
/System/Library/Frameworks/Kernel.framework/Headers/IOKit/IORegistryEntry.h:274: note: virtual bool IORegistryEntry::setProperty(const OSString*, OSObject*)
/System/Library/Frameworks/Kernel.framework/Headers/IOKit/IORegistryEntry.h:283: note: virtual bool IORegistryEntry::setProperty(const char*, OSObject*)
/System/Library/Frameworks/Kernel.framework/Headers/IOKit/IORegistryEntry.h:292: note: virtual bool IORegistryEntry::setProperty(const char*, const char*)
/System/Library/Frameworks/Kernel.framework/Headers/IOKit/IORegistryEntry.h:301: note: virtual bool IORegistryEntry::setProperty(const char*, bool)
/System/Library/Frameworks/Kernel.framework/Headers/IOKit/IORegistryEntry.h:313: note: virtual bool IORegistryEntry::setProperty(const char*, long long unsigned int, unsigned int)
/System/Library/Frameworks/Kernel.framework/Headers/IOKit/IORegistryEntry.h:325: note: virtual bool IORegistryEntry::setProperty(const char*, void*, unsigned int)
AppleSMBIOS.cpp:170: error: 'memSpeedData' was not declared in this scope
AppleSMBIOS.cpp:171: error: 'memInfoData' was not declared in this scope
AppleSMBIOS.cpp:202: error: 'memSpeedData' was not declared in this scope
AppleSMBIOS.cpp:203: error: 'memInfoData' was not declared in this scope
AppleSMBIOS.cpp:427: error: 'kIOPlatformSerialNumberKey' was not declared in this scope
AppleSMBIOS.cpp:628: error: 'memSpeedData' was not declared in this scope
AppleSMBIOS.cpp:629: error: 'memInfoData' was not declared in this scope
AppleSMBIOS.cpp:722: error: 'memSpeedData' was not declared in this scope
AppleSMBIOS.cpp:724: error: no matching function for call to 'IOService::setProperty(const char [12], <type error>)'
/System/Library/Frameworks/Kernel.framework/Headers/IOKit/IORegistryEntry.h:265: note: candidates are: virtual bool IORegistryEntry::setProperty(const OSSymbol*, OSObject*)
/System/Library/Frameworks/Kernel.framework/Headers/IOKit/IORegistryEntry.h:274: note: virtual bool IORegistryEntry::setProperty(const OSString*, OSObject*)
/System/Library/Frameworks/Kernel.framework/Headers/IOKit/IORegistryEntry.h:283: note: virtual bool IORegistryEntry::setProperty(const char*, OSObject*)
/System/Library/Frameworks/Kernel.framework/Headers/IOKit/IORegistryEntry.h:292: note: virtual bool IORegistryEntry::setProperty(const char*, const char*)
/System/Library/Frameworks/Kernel.framework/Headers/IOKit/IORegistryEntry.h:301: note: virtual bool IORegistryEntry::setProperty(const char*, bool)
/System/Library/Frameworks/Kernel.framework/Headers/IOKit/IORegistryEntry.h:313: note: virtual bool IORegistryEntry::setProperty(const char*, long long unsigned int, unsigned int)
/System/Library/Frameworks/Kernel.framework/Headers/IOKit/IORegistryEntry.h:325: note: virtual bool IORegistryEntry::setProperty(const char*, void*, unsigned int)
AppleSMBIOS.cpp:725: error: 'memInfoData' was not declared in this scope
AppleSMBIOS.cpp:732: error: 'memInfoData' was not declared in this scope
AppleSMBIOS.cpp:733: error: no matching function for call to 'IOService::setProperty(const char [12], <type error>)'
/System/Library/Frameworks/Kernel.framework/Headers/IOKit/IORegistryEntry.h:265: note: candidates are: virtual bool IORegistryEntry::setProperty(const OSSymbol*, OSObject*)
/System/Library/Frameworks/Kernel.framework/Headers/IOKit/IORegistryEntry.h:274: note: virtual bool IORegistryEntry::setProperty(const OSString*, OSObject*)
/System/Library/Frameworks/Kernel.framework/Headers/IOKit/IORegistryEntry.h:283: note: virtual bool IORegistryEntry::setProperty(const char*, OSObject*)
/System/Library/Frameworks/Kernel.framework/Headers/IOKit/IORegistryEntry.h:292: note: virtual bool IORegistryEntry::setProperty(const char*, const char*)
/System/Library/Frameworks/Kernel.framework/Headers/IOKit/IORegistryEntry.h:301: note: virtual bool IORegistryEntry::setProperty(const char*, bool)
/System/Library/Frameworks/Kernel.framework/Headers/IOKit/IORegistryEntry.h:313: note: virtual bool IORegistryEntry::setProperty(const char*, long long unsigned int, unsigned int)
/System/Library/Frameworks/Kernel.framework/Headers/IOKit/IORegistryEntry.h:325: note: virtual bool IORegistryEntry::setProperty(const char*, void*, unsigned int)
AppleSMBIOS.cpp:734: error: no matching function for call to 'IOService::setProperty(const char [10], <type error>)'
/System/Library/Frameworks/Kernel.framework/Headers/IOKit/IORegistryEntry.h:265: note: candidates are: virtual bool IORegistryEntry::setProperty(const OSSymbol*, OSObject*)
/System/Library/Frameworks/Kernel.framework/Headers/IOKit/IORegistryEntry.h:274: note: virtual bool IORegistryEntry::setProperty(const OSString*, OSObject*)
/System/Library/Frameworks/Kernel.framework/Headers/IOKit/IORegistryEntry.h:283: note: virtual bool IORegistryEntry::setProperty(const char*, OSObject*)
/System/Library/Frameworks/Kernel.framework/Headers/IOKit/IORegistryEntry.h:292: note: virtual bool IORegistryEntry::setProperty(const char*, const char*)
/System/Library/Frameworks/Kernel.framework/Headers/IOKit/IORegistryEntry.h:301: note: virtual bool IORegistryEntry::setProperty(const char*, bool)
/System/Library/Frameworks/Kernel.framework/Headers/IOKit/IORegistryEntry.h:313: note: virtual bool IORegistryEntry::setProperty(const char*, long long unsigned int, unsigned int)
/System/Library/Frameworks/Kernel.framework/Headers/IOKit/IORegistryEntry.h:325: note: virtual bool IORegistryEntry::setProperty(const char*, void*, unsigned int)
Build failed (14 errors)