rendered paste body[ 43%] Building CXX object okular/CMakeFiles/okularpart.dir/part.o
/usr/bin/c++ -Dokularpart_EXPORTS -Wnon-virtual-dtor -Wno-long-long -ansi -Wundef -Wcast-align -Wchar-subscripts -Wall -W -Wpointer-arith -Wformat-security -fno-exceptions -fno-check-new -fno-common -fvisibility=hidden -g3 -fno-inline -fPIC -I/home/dev/build/KDE/kdegraphics/okular -I/home/dev/src/KDE/kdegraphics/okular -I/home/dev/src/KDE/kdegraphics -I/home/dev/build/KDE/kdegraphics -I/home/dev/src/KDE/kdegraphics/okular/ui/painter_agg2 -I/home/dev/src/qt-copy/include -I/home/dev/src/qt-copy/include/Qt -I/home/dev/src/qt-copy/mkspecs/default -I/home/dev/src/qt-copy/include/QtCore -I/home/dev/src/qt-copy/include/QtGui -I/home/dev/src/qt-copy/include/Qt3Support -I/home/dev/src/qt-copy/include/QtAssistant -I/home/dev/src/qt-copy/include/QtDesigner -I/home/dev/src/qt-copy/include/QtNetwork -I/home/dev/src/qt-copy/include/QtOpenGL -I/home/dev/src/qt-copy/include/QtSql -I/home/dev/src/qt-copy/include/QtXml -I/home/dev/src/qt-copy/include/QtSvg -I/home/dev/src/qt-copy/include/QtScript -I/home/dev/src/qt-copy/include/QtUiTools -I/home/dev/src/qt-copy/include/QtTest -I/home/dev/src/qt-copy/include/QtDBus -I/home/dev/kde/include -I/home/dev/kde/include/KDE -I/usr/local/include -D_BSD_SOURCE -D_XOPEN_SOURCE=500 -D_BSD_SOURCE -D_GNU_SOURCE -DQT_NO_STL -DQT_NO_CAST_TO_ASCII -D_REENTRANT -DKDE_DEPRECATED_WARNINGS -o okular/CMakeFiles/okularpart.dir/part.o -c /home/dev/src/KDE/kdegraphics/okular/part.cpp
/home/dev/src/KDE/kdegraphics/okular/generators/poppler/generator_pdf.cpp: In function ?Okular::Action* createLinkFromPopplerLink(const Poppler::Link*, const Poppler::Document*)?:
/home/dev/src/KDE/kdegraphics/okular/generators/poppler/generator_pdf.cpp:183: warning: enumeration value ?Sound? not handled in switch
/home/dev/src/KDE/kdegraphics/okular/generators/poppler/generator_pdf.cpp: In member function ?virtual void PDFGenerator::generatePixmap(Okular::PixmapRequest*)?:
/home/dev/src/KDE/kdegraphics/okular/generators/poppler/generator_pdf.cpp:786: error: ?class Poppler::Page? has no member named ?splashRenderToPixmap?
/home/dev/src/KDE/kdegraphics/okular/generators/poppler/generator_pdf.cpp: In member function ?virtual bool PDFGenerator::print(KPrinter&)?:
/home/dev/src/KDE/kdegraphics/okular/generators/poppler/generator_pdf.cpp:927: error: ?class Poppler::Document? has no member named ?print?
/home/dev/src/KDE/kdegraphics/okular/generators/poppler/generator_pdf.cpp: In member function ?virtual void PDFPixmapGeneratorThread::run()?:
/home/dev/src/KDE/kdegraphics/okular/generators/poppler/generator_pdf.cpp:1727: error: ?class Poppler::Page? has no member named ?splashRenderToImage?
make[2]: *** [okular/generators/poppler/CMakeFiles/okularGenerator_poppler.dir/generator_pdf.o] Error 1
make[2]: Leaving directory `/home/dev/build/KDE/kdegraphics'
make[1]: *** [okular/generators/poppler/CMakeFiles/okularGenerator_poppler.dir/all] Error 2
make[1]: *** Waiting for unfinished jobs....
/usr/bin/cmake -E cmake_progress_report /home/dev/build/KDE/kdegraphics/CMakeFiles 41