All pastes #622613 Raw Edit

y_o_u

public text v1 · immutable
·published 2007-07-16 23:45 UTC
rendered paste body

root@workstation:/usr/hydra-5.4-src# ./configure

Starting hydra auto configuration ...

Checking for openssl (libssl/ssl.h) ...
                                    ... found
Checking for Postgres (libpq) ...
                              ... NOT found, module postgres disabled
Checking for SVN (ibsvn_client-1 libapr-0.so libaprutil-0.so) ...
                              ... found
Checking for SAP/R3 (librfc/saprfc.h) ...
                                      ... NOT found, module sapr3 disabled
Get it from http://www.sap.com/solutions/netweaver/linux/eval/index.asp
Checking for libssh (libssh/libssh.h) ...
                                      ... found
NOTE: ensure that you have libssh v0.11 installed!! Get it from http://0xbadc0de.be !

Hydra will be installed into .../bin of: /usr/local
  (change this by running ./configure --prefix=path)

Writing Makefile.in ...

NOTES NOTES NOTES NOTES NOTES NOTES NOTES NOTES NOTES NOTES NOTES NOTES
=======================================================================
ARM/PalmPilot users: please run ./configure-arm or ./configure-palm respectivly

now type "make"
root@workstation:/usr/hydra-5.4-src# make
gcc -I. -Wall -O2 -c hydra-svn.c -DLIBOPENSSL -DLIBSVN -DLIBSSH -I/usr/local/include -I/usr/include/subversion-1 -I/usr/include/subversion-1
In file included from hydra-svn.c:17:
/usr/include/subversion-1/svn_client.h:35:24: error: apr_tables.h: No such file or directory
In file included from /usr/include/subversion-1/svn_client.h:37,
                 from hydra-svn.c:17:
/usr/include/subversion-1/svn_types.h:28:45: error: apr.h: No such file or directory
/usr/include/subversion-1/svn_types.h:29:23: error: apr_pools.h: No such file or directory
/usr/include/subversion-1/svn_types.h:30:22: error: apr_hash.h: No such file or directory
/usr/include/subversion-1/svn_types.h:32:22: error: apr_time.h: No such file or directory
In file included from /usr/include/subversion-1/svn_client.h:37,
                 from hydra-svn.c:17:
/usr/include/subversion-1/svn_types.h:48: error: expected specifier-qualifier-list before 'apr_status_t'
/usr/include/subversion-1/svn_types.h:165: error: expected '=', ',', ';', 'asm' or '__attribute__' before 'svn_filesize_t'
/usr/include/subversion-1/svn_types.h:242: error: expected specifier-qualifier-list before 'svn_filesize_t'
/usr/include/subversion-1/svn_types.h:265: error: expected declaration specifiers or '...' before 'apr_pool_t'
/usr/include/subversion-1/svn_types.h:379: error: expected ')' before '*' token
/usr/include/subversion-1/svn_types.h:389: error: expected declaration specifiers or '...' before 'apr_pool_t'
/usr/include/subversion-1/svn_types.h:414: error: expected declaration specifiers or '...' before 'apr_pool_t'
/usr/include/subversion-1/svn_types.h:450: error: expected declaration specifiers or '...' before 'apr_hash_t'
/usr/include/subversion-1/svn_types.h:455: error: expected declaration specifiers or '...' before 'apr_pool_t'
/usr/include/subversion-1/svn_types.h:469: error: expected declaration specifiers or '...' before 'apr_pool_t'
/usr/include/subversion-1/svn_types.h:496: error: expected declaration specifiers or '...' before 'apr_pool_t'
/usr/include/subversion-1/svn_types.h:547: error: expected declaration specifiers or '...' before 'apr_pool_t'
/usr/include/subversion-1/svn_types.h:594: error: expected specifier-qualifier-list before 'apr_time_t'
/usr/include/subversion-1/svn_types.h:609: error: expected ')' before '*' token
/usr/include/subversion-1/svn_types.h:617: error: expected declaration specifiers or '...' before 'apr_pool_t'
/usr/include/subversion-1/svn_types.h:625: error: expected ')' before '*' token
In file included from /usr/include/subversion-1/svn_wc.h:42,
                 from /usr/include/subversion-1/svn_client.h:38,
                 from hydra-svn.c:17:
/usr/include/subversion-1/svn_string.h:71:25: error: apr_strings.h: No such file or directory
In file included from /usr/include/subversion-1/svn_wc.h:42,
                 from /usr/include/subversion-1/svn_client.h:38,
                 from hydra-svn.c:17:
/usr/include/subversion-1/svn_string.h:86: error: expected specifier-qualifier-list before 'apr_size_t'
/usr/include/subversion-1/svn_string.h:97: error: expected specifier-qualifier-list before 'apr_pool_t'
/usr/include/subversion-1/svn_string.h:118: error: expected declaration specifiers or '...' before 'apr_pool_t'
/usr/include/subversion-1/svn_string.h:123: error: expected declaration specifiers or '...' before 'apr_size_t'
/usr/include/subversion-1/svn_string.h:124: error: expected declaration specifiers or '...' before 'apr_pool_t'
/usr/include/subversion-1/svn_string.h:128: error: expected declaration specifiers or '...' before 'apr_pool_t'
/usr/include/subversion-1/svn_string.h:133: error: expected ')' before '*' token
/usr/include/subversion-1/svn_string.h:141: error: expected ')' before '*' token
/usr/include/subversion-1/svn_string.h:151: error: expected declaration specifiers or '...' before 'apr_pool_t'
/usr/include/subversion-1/svn_string.h:160: error: expected '=', ',', ';', 'asm' or '__attribute__' before 'svn_string_first_non_whitespace'
/usr/include/subversion-1/svn_string.h:165: error: expected '=', ',', ';', 'asm' or '__attribute__' before 'svn_string_find_char_backward'
/usr/include/subversion-1/svn_string.h:178: error: expected declaration specifiers or '...' before 'apr_pool_t'
/usr/include/subversion-1/svn_string.h:183: error: expected declaration specifiers or '...' before 'apr_size_t'
/usr/include/subversion-1/svn_string.h:184: error: expected declaration specifiers or '...' before 'apr_pool_t'
/usr/include/subversion-1/svn_string.h:188: error: expected declaration specifiers or '...' before 'apr_pool_t'
/usr/include/subversion-1/svn_string.h:193: error: expected ')' before '*' token
/usr/include/subversion-1/svn_string.h:201: error: expected ')' before '*' token
/usr/include/subversion-1/svn_string.h:212: error: expected declaration specifiers or '...' before 'apr_size_t'
/usr/include/subversion-1/svn_string.h:224: error: expected declaration specifiers or '...' before 'apr_size_t'
/usr/include/subversion-1/svn_string.h:235: error: expected declaration specifiers or '...' before 'apr_size_t'
/usr/include/subversion-1/svn_string.h:253: error: expected declaration specifiers or '...' before 'apr_pool_t'
/usr/include/subversion-1/svn_string.h:263: error: expected '=', ',', ';', 'asm' or '__attribute__' before 'svn_stringbuf_first_non_whitespace'
/usr/include/subversion-1/svn_string.h:271: error: expected '=', ',', ';', 'asm' or '__attribute__' before 'svn_stringbuf_find_char_backward'
/usr/include/subversion-1/svn_string.h:299: error: expected '=', ',', ';', 'asm' or '__attribute__' before '*' token
/usr/include/subversion-1/svn_string.h:308: error: expected ')' before '*' token
/usr/include/subversion-1/svn_string.h:321: error: expected declaration specifiers or '...' before 'apr_array_header_t'
/usr/include/subversion-1/svn_string.h:339: error: expected ')' before '*' token
In file included from /usr/include/subversion-1/svn_delta.h:34,
                 from /usr/include/subversion-1/svn_wc.h:43,
                 from /usr/include/subversion-1/svn_client.h:38,
                 from hydra-svn.c:17:
/usr/include/subversion-1/svn_error.h:29:52: error: apr_errno.h: No such file or directory
/usr/include/subversion-1/svn_error.h:35:22: error: apr_want.h: No such file or directory
In file included from /usr/include/subversion-1/svn_error_codes.h:48,
                 from /usr/include/subversion-1/svn_error.h:48,
                 from /usr/include/subversion-1/svn_delta.h:34,
                 from /usr/include/subversion-1/svn_wc.h:43,
                 from /usr/include/subversion-1/svn_client.h:38,
                 from hydra-svn.c:17:
/usr/include/subversion-1/svn_props.h:62: error: expected declaration specifiers or '...' before 'apr_pool_t'
/usr/include/subversion-1/svn_props.h:70: error: expected '=', ',', ';', 'asm' or '__attribute__' before '*' token
/usr/include/subversion-1/svn_props.h:134: warning: type defaults to 'int' in declaration of 'apr_array_header_t'
/usr/include/subversion-1/svn_props.h:134: error: expected ';', ',' or ')' before '*' token
/usr/include/subversion-1/svn_props.h:155: error: expected ')' before '*' token
In file included from /usr/include/subversion-1/svn_error.h:48,
                 from /usr/include/subversion-1/svn_delta.h:34,
                 from /usr/include/subversion-1/svn_wc.h:43,
                 from /usr/include/subversion-1/svn_client.h:38,
                 from hydra-svn.c:17:
/usr/include/subversion-1/svn_error_codes.h:148: error: 'APR_OS_START_USERERR' undeclared here (not in a function)
In file included from /usr/include/subversion-1/svn_delta.h:34,
                 from /usr/include/subversion-1/svn_wc.h:43,
                 from /usr/include/subversion-1/svn_client.h:38,
                 from hydra-svn.c:17:
/usr/include/subversion-1/svn_error.h:57: error: expected ')' before 'statcode'
/usr/include/subversion-1/svn_error.h:70: error: expected declaration specifiers or '...' before 'apr_size_t'
/usr/include/subversion-1/svn_error.h:98: error: expected ')' before 'apr_err'
/usr/include/subversion-1/svn_error.h:110: error: expected ')' before 'apr_err'
/usr/include/subversion-1/svn_error.h:128: error: expected ')' before 'status'
In file included from /usr/include/subversion-1/svn_delta.h:35,
                 from /usr/include/subversion-1/svn_wc.h:43,
                 from /usr/include/subversion-1/svn_client.h:38,
                 from hydra-svn.c:17:
/usr/include/subversion-1/svn_io.h:30:25: error: apr_file_io.h: No such file or directory
/usr/include/subversion-1/svn_io.h:31:29: error: apr_thread_proc.h: No such file or directory
In file included from /usr/include/subversion-1/svn_delta.h:35,
                 from /usr/include/subversion-1/svn_wc.h:43,
                 from /usr/include/subversion-1/svn_client.h:38,
                 from hydra-svn.c:17:
/usr/include/subversion-1/svn_io.h:93: error: expected declaration specifiers or '...' before 'apr_pool_t'
/usr/include/subversion-1/svn_io.h:104: error: expected declaration specifiers or '...' before 'apr_pool_t'
/usr/include/subversion-1/svn_io.h:110: error: expected declaration specifiers or '...' before 'apr_pool_t'
/usr/include/subversion-1/svn_io.h:164: error: expected ')' before '*' token
/usr/include/subversion-1/svn_io.h:180: error: expected ')' before '*' token
/usr/include/subversion-1/svn_io.h:197: error: expected declaration specifiers or '...' before 'apr_pool_t'
/usr/include/subversion-1/svn_io.h:208: error: expected declaration specifiers or '...' before 'apr_pool_t'
/usr/include/subversion-1/svn_io.h:215: error: expected declaration specifiers or '...' before 'apr_pool_t'
/usr/include/subversion-1/svn_io.h:226: error: expected declaration specifiers or '...' before 'apr_pool_t'
/usr/include/subversion-1/svn_io.h:238: error: expected declaration specifiers or '...' before 'apr_pool_t'
/usr/include/subversion-1/svn_io.h:257: error: expected declaration specifiers or '...' before 'apr_pool_t'
/usr/include/subversion-1/svn_io.h:268: error: expected declaration specifiers or '...' before 'apr_pool_t'
/usr/include/subversion-1/svn_io.h:278: error: expected declaration specifiers or '...' before 'apr_pool_t'
/usr/include/subversion-1/svn_io.h:286: error: expected declaration specifiers or '...' before 'apr_pool_t'
/usr/include/subversion-1/svn_io.h:295: error: expected declaration specifiers or '...' before 'apr_pool_t'
/usr/include/subversion-1/svn_io.h:307: error: expected declaration specifiers or '...' before 'apr_pool_t'
/usr/include/subversion-1/svn_io.h:335: error: expected declaration specifiers or '...' before 'apr_pool_t'
/usr/include/subversion-1/svn_io.h:359: error: expected declaration specifiers or '...' before 'apr_pool_t'
/usr/include/subversion-1/svn_io.h:369: error: expected declaration specifiers or '...' before 'apr_pool_t'
/usr/include/subversion-1/svn_io.h:381: error: expected ')' before '*' token
/usr/include/subversion-1/svn_io.h:391: error: expected ')' before '*' token
/usr/include/subversion-1/svn_io.h:401: error: expected ')' before 'apr_time'
/usr/include/subversion-1/svn_io.h:419: error: expected declaration specifiers or '...' before 'apr_pool_t'
/usr/include/subversion-1/svn_io.h:428: error: expected declaration specifiers or '...' before 'apr_pool_t'
/usr/include/subversion-1/svn_io.h:437: error: expected declaration specifiers or '...' before 'apr_pool_t'
/usr/include/subversion-1/svn_io.h:445: error: expected declaration specifiers or '...' before 'apr_pool_t'
/usr/include/subversion-1/svn_io.h:457: error: expected declaration specifiers or '...' before 'apr_pool_t'
/usr/include/subversion-1/svn_io.h:474: error: expected declaration specifiers or '...' before 'apr_pool_t'
/usr/include/subversion-1/svn_io.h:481: error: expected ')' before '*' token
/usr/include/subversion-1/svn_io.h:490: error: expected declaration specifiers or '...' before 'apr_pool_t'
/usr/include/subversion-1/svn_io.h:529: error: expected declaration specifiers or '...' before 'apr_size_t'
/usr/include/subversion-1/svn_io.h:534: error: expected declaration specifiers or '...' before 'apr_size_t'
/usr/include/subversion-1/svn_io.h:541: error: expected declaration specifiers or '...' before 'apr_pool_t'
/usr/include/subversion-1/svn_io.h:557: error: expected ')' before '*' token
/usr/include/subversion-1/svn_io.h:566: error: expected declaration specifiers or '...' before 'apr_pool_t'
/usr/include/subversion-1/svn_io.h:579: error: expected ')' before '*' token
/usr/include/subversion-1/svn_io.h:592: error: expected ')' before '*' token
/usr/include/subversion-1/svn_io.h:598: error: expected declaration specifiers or '...' before 'apr_pool_t'
/usr/include/subversion-1/svn_io.h:604: error: expected declaration specifiers or '...' before 'apr_pool_t'
/usr/include/subversion-1/svn_io.h:615: error: expected declaration specifiers or '...' before 'apr_pool_t'
/usr/include/subversion-1/svn_io.h:641: error: expected declaration specifiers or '...' before 'apr_pool_t'
/usr/include/subversion-1/svn_io.h:645: error: expected declaration specifiers or '...' before 'apr_size_t'
/usr/include/subversion-1/svn_io.h:649: error: expected declaration specifiers or '...' before 'apr_size_t'
/usr/include/subversion-1/svn_io.h:659: error: expected declaration specifiers or '...' before 'apr_pool_t'
/usr/include/subversion-1/svn_io.h:662: error: format string argument not a string type
/usr/include/subversion-1/svn_io.h:675: error: expected declaration specifiers or '...' before 'apr_pool_t'
/usr/include/subversion-1/svn_io.h:678: error: format string argument not a string type
/usr/include/subversion-1/svn_io.h:693: error: expected declaration specifiers or '...' before 'apr_pool_t'
/usr/include/subversion-1/svn_io.h:702: error: expected declaration specifiers or '...' before 'apr_pool_t'
/usr/include/subversion-1/svn_io.h:713: error: expected declaration specifiers or '...' before 'apr_pool_t'
/usr/include/subversion-1/svn_io.h:731: error: expected declaration specifiers or '...' before 'apr_pool_t'
/usr/include/subversion-1/svn_io.h:738: error: expected declaration specifiers or '...' before 'apr_file_t'
/usr/include/subversion-1/svn_io.h:739: error: expected declaration specifiers or '...' before 'apr_pool_t'
/usr/include/subversion-1/svn_io.h:744: error: expected declaration specifiers or '...' before 'apr_pool_t'
/usr/include/subversion-1/svn_io.h:747: error: expected declaration specifiers or '...' before 'apr_pool_t'
/usr/include/subversion-1/svn_io.h:758: error: expected ')' before '*' token
/usr/include/subversion-1/svn_io.h:771: error: expected ')' before '*' token
/usr/include/subversion-1/svn_io.h:780: error: expected ')' before '*' token
/usr/include/subversion-1/svn_io.h:788: warning: type defaults to 'int' in declaration of 'apr_finfo_t'
/usr/include/subversion-1/svn_io.h:788: error: expected ';', ',' or ')' before '*' token
/usr/include/subversion-1/svn_io.h:805: error: expected declaration specifiers or '...' before 'apr_int32_t'
/usr/include/subversion-1/svn_io.h:806: error: expected declaration specifiers or '...' before 'svn_io_walk_func_t'
/usr/include/subversion-1/svn_io.h:808: error: expected declaration specifiers or '...' before 'apr_pool_t'
/usr/include/subversion-1/svn_io.h:831: error: expected ')' before '*' token
/usr/include/subversion-1/svn_io.h:854: error: expected ')' before '*' token
/usr/include/subversion-1/svn_io.h:868: error: expected declaration specifiers or '...' before 'apr_exit_why_e'
/usr/include/subversion-1/svn_io.h:870: error: expected declaration specifiers or '...' before 'apr_file_t'
/usr/include/subversion-1/svn_io.h:871: error: expected declaration specifiers or '...' before 'apr_file_t'
/usr/include/subversion-1/svn_io.h:872: error: expected declaration specifiers or '...' before 'apr_file_t'
/usr/include/subversion-1/svn_io.h:873: error: expected declaration specifiers or '...' before 'apr_pool_t'
/usr/include/subversion-1/svn_io.h:901: error: expected declaration specifiers or '...' before 'apr_file_t'
/usr/include/subversion-1/svn_io.h:902: error: expected declaration specifiers or '...' before 'apr_file_t'
/usr/include/subversion-1/svn_io.h:904: error: expected declaration specifiers or '...' before 'apr_pool_t'
/usr/include/subversion-1/svn_io.h:948: error: expected declaration specifiers or '...' before 'apr_file_t'
/usr/include/subversion-1/svn_io.h:950: warning: type defaults to 'int' in declaration of 'apr_array_header_t'
/usr/include/subversion-1/svn_io.h:950: error: expected ';', ',' or ')' before '*' token
/usr/include/subversion-1/svn_io.h:964: error: expected declaration specifiers or '...' before 'apr_file_t'
/usr/include/subversion-1/svn_io.h:967: error: expected declaration specifiers or '...' before 'apr_pool_t'
/usr/include/subversion-1/svn_io.h:978: error: expected declaration specifiers or '...' before 'apr_pool_t'
/usr/include/subversion-1/svn_io.h:983: error: expected ')' before '*' token
/usr/include/subversion-1/svn_io.h:990: error: expected ')' before '*' token
/usr/include/subversion-1/svn_io.h:995: error: expected declaration specifiers or '...' before 'apr_file_t'
/usr/include/subversion-1/svn_io.h:995: error: expected declaration specifiers or '...' before 'apr_pool_t'
/usr/include/subversion-1/svn_io.h:1000: error: expected ')' before '*' token
/usr/include/subversion-1/svn_io.h:1006: error: expected ')' before '*' token
/usr/include/subversion-1/svn_io.h:1012: error: expected ')' before '*' token
/usr/include/subversion-1/svn_io.h:1019: error: expected ')' before '*' token
/usr/include/subversion-1/svn_io.h:1025: error: expected ')' before '*' token
/usr/include/subversion-1/svn_io.h:1031: error: expected ')' before '*' token
/usr/include/subversion-1/svn_io.h:1038: error: expected ')' before '*' token
/usr/include/subversion-1/svn_io.h:1047: error: expected declaration specifiers or '...' before 'apr_pool_t'
/usr/include/subversion-1/svn_io.h:1060: error: expected declaration specifiers or '...' before 'apr_pool_t'
/usr/include/subversion-1/svn_io.h:1065: error: expected declaration specifiers or '...' before 'apr_fileperms_t'
/usr/include/subversion-1/svn_io.h:1065: error: expected declaration specifiers or '...' before 'apr_pool_t'
/usr/include/subversion-1/svn_io.h:1070: error: expected declaration specifiers or '...' before 'apr_fileperms_t'
/usr/include/subversion-1/svn_io.h:1071: error: expected declaration specifiers or '...' before 'apr_pool_t'
/usr/include/subversion-1/svn_io.h:1084: error: expected declaration specifiers or '...' before 'apr_fileperms_t'
/usr/include/subversion-1/svn_io.h:1085: error: expected declaration specifiers or '...' before 'apr_pool_t'
/usr/include/subversion-1/svn_io.h:1089: error: expected ')' before '*' token
/usr/include/subversion-1/svn_io.h:1097: error: expected declaration specifiers or '...' before 'apr_pool_t'
/usr/include/subversion-1/svn_io.h:1106: error: expected ')' before '*' token
/usr/include/subversion-1/svn_io.h:1125: error: expected declaration specifiers or '...' before 'apr_pool_t'
/usr/include/subversion-1/svn_io.h:1133: error: expected declaration specifiers or '...' before 'apr_pool_t'
In file included from /usr/include/subversion-1/svn_delta.h:36,
                 from /usr/include/subversion-1/svn_wc.h:43,
                 from /usr/include/subversion-1/svn_client.h:38,
                 from hydra-svn.c:17:
/usr/include/subversion-1/svn_version.h:30:25: error: apr_general.h: No such file or directory
In file included from /usr/include/subversion-1/svn_wc.h:43,
                 from /usr/include/subversion-1/svn_client.h:38,
                 from hydra-svn.c:17:
/usr/include/subversion-1/svn_delta.h:125: error: expected specifier-qualifier-list before 'apr_size_t'
/usr/include/subversion-1/svn_delta.h:152: error: expected specifier-qualifier-list before 'svn_filesize_t'
/usr/include/subversion-1/svn_delta.h:185: error: expected declaration specifiers or '...' before 'apr_pool_t'
/usr/include/subversion-1/svn_delta.h:196: error: expected declaration specifiers or '...' before 'apr_pool_t'
/usr/include/subversion-1/svn_delta.h:216: error: expected declaration specifiers or '...' before 'apr_size_t'
/usr/include/subversion-1/svn_delta.h:247: error: expected declaration specifiers or '...' before 'apr_pool_t'
/usr/include/subversion-1/svn_delta.h:271: error: expected declaration specifiers or '...' before 'apr_pool_t'
/usr/include/subversion-1/svn_delta.h:281: error: expected declaration specifiers or '...' before 'apr_pool_t'
/usr/include/subversion-1/svn_delta.h:303: error: expected declaration specifiers or '...' before 'apr_pool_t'
/usr/include/subversion-1/svn_delta.h:319: error: expected declaration specifiers or '...' before 'apr_pool_t'
/usr/include/subversion-1/svn_delta.h:331: error: expected declaration specifiers or '...' before 'apr_pool_t'
/usr/include/subversion-1/svn_delta.h:347: error: expected declaration specifiers or '...' before 'apr_pool_t'
/usr/include/subversion-1/svn_delta.h:357: error: expected declaration specifiers or '...' before 'apr_pool_t'
/usr/include/subversion-1/svn_delta.h:384: error: expected declaration specifiers or '...' before 'apr_pool_t'
/usr/include/subversion-1/svn_delta.h:405: error: expected declaration specifiers or '...' before 'apr_pool_t'
/usr/include/subversion-1/svn_delta.h:413: error: expected declaration specifiers or '...' before 'apr_pool_t'
/usr/include/subversion-1/svn_delta.h:427: error: expected declaration specifiers or '...' before 'apr_pool_t'
/usr/include/subversion-1/svn_delta.h:443: error: expected declaration specifiers or '...' before 'apr_pool_t'
/usr/include/subversion-1/svn_delta.h:456: error: expected ')' before '*' token
/usr/include/subversion-1/svn_delta.h:696: error: expected declaration specifiers or '...' before 'apr_pool_t'
/usr/include/subversion-1/svn_delta.h:712: error: expected declaration specifiers or '...' before 'apr_pool_t'
/usr/include/subversion-1/svn_delta.h:726: error: expected declaration specifiers or '...' before 'apr_pool_t'
/usr/include/subversion-1/svn_delta.h:745: error: expected declaration specifiers or '...' before 'apr_pool_t'
/usr/include/subversion-1/svn_delta.h:762: error: expected declaration specifiers or '...' before 'apr_pool_t'
/usr/include/subversion-1/svn_delta.h:779: error: expected declaration specifiers or '...' before 'apr_pool_t'
/usr/include/subversion-1/svn_delta.h:787: error: expected declaration specifiers or '...' before 'apr_pool_t'
/usr/include/subversion-1/svn_delta.h:797: error: expected declaration specifiers or '...' before 'apr_pool_t'
/usr/include/subversion-1/svn_delta.h:815: error: expected declaration specifiers or '...' before 'apr_pool_t'
/usr/include/subversion-1/svn_delta.h:833: error: expected declaration specifiers or '...' before 'apr_pool_t'
/usr/include/subversion-1/svn_delta.h:860: error: expected declaration specifiers or '...' before 'apr_pool_t'
/usr/include/subversion-1/svn_delta.h:878: error: expected declaration specifiers or '...' before 'apr_pool_t'
/usr/include/subversion-1/svn_delta.h:893: error: expected declaration specifiers or '...' before 'apr_pool_t'
/usr/include/subversion-1/svn_delta.h:902: error: expected declaration specifiers or '...' before 'apr_pool_t'
/usr/include/subversion-1/svn_delta.h:908: error: expected declaration specifiers or '...' before 'apr_pool_t'
/usr/include/subversion-1/svn_delta.h:914: error: expected declaration specifiers or '...' before 'apr_pool_t'
/usr/include/subversion-1/svn_delta.h:932: error: expected ')' before '*' token
/usr/include/subversion-1/svn_delta.h:958: error: expected declaration specifiers or '...' before 'apr_pool_t'
/usr/include/subversion-1/svn_delta.h:995: error: expected declaration specifiers or '...' before 'apr_pool_t'
/usr/include/subversion-1/svn_delta.h:1013: error: expected declaration specifiers or '...' before 'apr_array_header_t'
/usr/include/subversion-1/svn_delta.h:1016: error: expected declaration specifiers or '...' before 'apr_pool_t'
In file included from /usr/include/subversion-1/svn_wc.h:45,
                 from /usr/include/subversion-1/svn_client.h:38,
                 from hydra-svn.c:17:
/usr/include/subversion-1/svn_opt.h:27:24: error: apr_getopt.h: No such file or directory
In file included from /usr/include/subversion-1/svn_wc.h:45,
                 from /usr/include/subversion-1/svn_client.h:38,
                 from hydra-svn.c:17:
/usr/include/subversion-1/svn_opt.h:52: error: expected ')' before '*' token
/usr/include/subversion-1/svn_opt.h:77: error: expected specifier-qualifier-list before 'svn_opt_subcommand_t'
/usr/include/subversion-1/svn_opt.h:111: error: expected specifier-qualifier-list before 'svn_opt_subcommand_t'
/usr/include/subversion-1/svn_opt.h:163: error: expected '=', ',', ';', 'asm' or '__attribute__' before '*' token
/usr/include/subversion-1/svn_opt.h:177: error: expected '=', ',', ';', 'asm' or '__attribute__' before '*' token
/usr/include/subversion-1/svn_opt.h:224: warning: type defaults to 'int' in declaration of 'apr_getopt_option_t'
/usr/include/subversion-1/svn_opt.h:224: error: expected ';', ',' or ')' before '*' token
/usr/include/subversion-1/svn_opt.h:238: warning: type defaults to 'int' in declaration of 'apr_getopt_option_t'
/usr/include/subversion-1/svn_opt.h:238: error: expected ';', ',' or ')' before '*' token
/usr/include/subversion-1/svn_opt.h:251: warning: type defaults to 'int' in declaration of 'apr_getopt_option_t'
/usr/include/subversion-1/svn_opt.h:251: error: expected ';', ',' or ')' before '*' token
/usr/include/subversion-1/svn_opt.h:269: warning: type defaults to 'int' in declaration of 'apr_getopt_option_t'
/usr/include/subversion-1/svn_opt.h:269: error: expected ';', ',' or ')' before '*' token
/usr/include/subversion-1/svn_opt.h:282: warning: type defaults to 'int' in declaration of 'apr_getopt_option_t'
/usr/include/subversion-1/svn_opt.h:282: error: expected ';', ',' or ')' before '*' token
/usr/include/subversion-1/svn_opt.h:336: error: expected specifier-qualifier-list before 'apr_time_t'
/usr/include/subversion-1/svn_opt.h:371: error: expected declaration specifiers or '...' before 'apr_pool_t'
/usr/include/subversion-1/svn_opt.h:393: error: expected ')' before '*' token
/usr/include/subversion-1/svn_opt.h:414: error: expected ')' before '*' token
/usr/include/subversion-1/svn_opt.h:430: error: expected ')' before '*' token
/usr/include/subversion-1/svn_opt.h:440: error: expected ')' before '*' token
/usr/include/subversion-1/svn_opt.h:452: error: expected ')' before '*' token
/usr/include/subversion-1/svn_opt.h:495: error: expected declaration specifiers or '...' before 'apr_pool_t'
/usr/include/subversion-1/svn_opt.h:524: error: expected ')' before '*' token
/usr/include/subversion-1/svn_opt.h:541: error: expected ')' before '*' token
In file included from /usr/include/subversion-1/svn_ra.h:33,
                 from /usr/include/subversion-1/svn_wc.h:46,
                 from /usr/include/subversion-1/svn_client.h:38,
                 from hydra-svn.c:17:
/usr/include/subversion-1/svn_auth.h:104: error: expected declaration specifiers or '...' before 'apr_hash_t'
/usr/include/subversion-1/svn_auth.h:106: error: expected declaration specifiers or '...' before 'apr_pool_t'
/usr/include/subversion-1/svn_auth.h:122: error: expected declaration specifiers or '...' before 'apr_hash_t'
/usr/include/subversion-1/svn_auth.h:124: error: expected declaration specifiers or '...' before 'apr_pool_t'
/usr/include/subversion-1/svn_auth.h:140: error: expected declaration specifiers or '...' before 'apr_hash_t'
/usr/include/subversion-1/svn_auth.h:142: error: expected declaration specifiers or '...' before 'apr_pool_t'
/usr/include/subversion-1/svn_auth.h:304: error: expected declaration specifiers or '...' before 'apr_pool_t'
/usr/include/subversion-1/svn_auth.h:315: error: expected specifier-qualifier-list before 'apr_uint32_t'
/usr/include/subversion-1/svn_auth.h:358: error: expected declaration specifiers or '...' before 'apr_pool_t'
/usr/include/subversion-1/svn_auth.h:377: error: expected declaration specifiers or '...' before 'apr_pool_t'
/usr/include/subversion-1/svn_auth.h:419: error: expected declaration specifiers or '...' before 'apr_uint32_t'
/usr/include/subversion-1/svn_auth.h:422: error: expected declaration specifiers or '...' before 'apr_pool_t'
/usr/include/subversion-1/svn_auth.h:440: error: expected declaration specifiers or '...' before 'apr_pool_t'
/usr/include/subversion-1/svn_auth.h:458: error: expected declaration specifiers or '...' before 'apr_pool_t'
/usr/include/subversion-1/svn_auth.h:473: error: expected declaration specifiers or '...' before 'apr_array_header_t'
/usr/include/subversion-1/svn_auth.h:474: error: expected declaration specifiers or '...' before 'apr_pool_t'
/usr/include/subversion-1/svn_auth.h:571: error: expected declaration specifiers or '...' before 'apr_pool_t'
/usr/include/subversion-1/svn_auth.h:585: error: expected declaration specifiers or '...' before 'apr_pool_t'
/usr/include/subversion-1/svn_auth.h:595: error: expected declaration specifiers or '...' before 'apr_pool_t'
/usr/include/subversion-1/svn_auth.h:618: error: expected declaration specifiers or '...' before 'apr_pool_t'
/usr/include/subversion-1/svn_auth.h:639: error: expected declaration specifiers or '...' before 'apr_pool_t'
/usr/include/subversion-1/svn_auth.h:656: error: expected declaration specifiers or '...' before 'apr_pool_t'
/usr/include/subversion-1/svn_auth.h:716: error: expected declaration specifiers or '...' before 'apr_pool_t'
/usr/include/subversion-1/svn_auth.h:730: error: expected declaration specifiers or '...' before 'apr_pool_t'
/usr/include/subversion-1/svn_auth.h:744: error: expected declaration specifiers or '...' before 'apr_pool_t'
/usr/include/subversion-1/svn_auth.h:758: error: expected declaration specifiers or '...' before 'apr_pool_t'
/usr/include/subversion-1/svn_auth.h:774: error: expected declaration specifiers or '...' before 'apr_pool_t'
/usr/include/subversion-1/svn_auth.h:792: error: expected declaration specifiers or '...' before 'apr_pool_t'
/usr/include/subversion-1/svn_auth.h:810: error: expected declaration specifiers or '...' before 'apr_pool_t'
In file included from /usr/include/subversion-1/svn_wc.h:46,
                 from /usr/include/subversion-1/svn_client.h:38,
                 from hydra-svn.c:17:
/usr/include/subversion-1/svn_ra.h:68: error: expected declaration specifiers or '...' before 'apr_pool_t'
/usr/include/subversion-1/svn_ra.h:80: error: expected declaration specifiers or '...' before 'apr_pool_t'
/usr/include/subversion-1/svn_ra.h:100: error: expected declaration specifiers or '...' before 'apr_pool_t'
/usr/include/subversion-1/svn_ra.h:112: error: expected declaration specifiers or '...' before 'apr_pool_t'
/usr/include/subversion-1/svn_ra.h:140: error: expected declaration specifiers or '...' before 'apr_hash_t'
/usr/include/subversion-1/svn_ra.h:143: error: expected declaration specifiers or '...' before 'apr_array_header_t'
/usr/include/subversion-1/svn_ra.h:144: error: expected declaration specifiers or '...' before 'apr_pool_t'
/usr/include/subversion-1/svn_ra.h:170: error: expected declaration specifiers or '...' before 'apr_pool_t'
/usr/include/subversion-1/svn_ra.h:181: error: expected ')' before 'progress'
/usr/include/subversion-1/svn_ra.h:230: error: expected declaration specifiers or '...' before 'apr_pool_t'
/usr/include/subversion-1/svn_ra.h:238: error: expected declaration specifiers or '...' before 'apr_pool_t'
/usr/include/subversion-1/svn_ra.h:259: error: expected declaration specifiers or '...' before 'apr_pool_t'
/usr/include/subversion-1/svn_ra.h:268: error: expected declaration specifiers or '...' before 'apr_pool_t'
/usr/include/subversion-1/svn_ra.h:275: error: expected declaration specifiers or '...' before 'apr_pool_t'
/usr/include/subversion-1/svn_ra.h:292: error: expected declaration specifiers or '...' before 'apr_pool_t'
/usr/include/subversion-1/svn_ra.h:297: error: expected declaration specifiers or '...' before 'apr_pool_t'
/usr/include/subversion-1/svn_ra.h:306: error: expected declaration specifiers or '...' before 'apr_pool_t'
/usr/include/subversion-1/svn_ra.h:310: error: expected declaration specifiers or '...' before 'apr_pool_t'
/usr/include/subversion-1/svn_ra.h:314: error: expected declaration specifiers or '...' before 'apr_pool_t'
/usr/include/subversion-1/svn_ra.h:336: error: expected ')' before '*' token
/usr/include/subversion-1/svn_ra.h:343: error: expected ';' before 'svn_auth_baton_t'
/usr/include/subversion-1/svn_ra.h:385: error: expected ')' before '*' token
/usr/include/subversion-1/svn_ra.h:389: error: expected ';' before 'svn_auth_baton_t'
/usr/include/subversion-1/svn_ra.h:417: error: expected ')' before '*' token
/usr/include/subversion-1/svn_ra.h:429: error: expected declaration specifiers or '...' before 'apr_pool_t'
/usr/include/subversion-1/svn_ra.h:461: error: expected declaration specifiers or '...' before 'apr_hash_t'
/usr/include/subversion-1/svn_ra.h:462: error: expected declaration specifiers or '...' before 'apr_pool_t'
/usr/include/subversion-1/svn_ra.h:473: error: expected declaration specifiers or '...' before 'apr_hash_t'
/usr/include/subversion-1/svn_ra.h:474: error: expected declaration specifiers or '...' before 'apr_pool_t'
/usr/include/subversion-1/svn_ra.h:487: error: expected declaration specifiers or '...' before 'apr_pool_t'
/usr/include/subversion-1/svn_ra.h:498: error: expected declaration specifiers or '...' before 'apr_pool_t'
/usr/include/subversion-1/svn_ra.h:510: error: expected declaration specifiers or '...' before 'apr_time_t'
/usr/include/subversion-1/svn_ra.h:511: error: expected declaration specifiers or '...' before 'apr_pool_t'
/usr/include/subversion-1/svn_ra.h:529: error: expected declaration specifiers or '...' before 'apr_pool_t'
/usr/include/subversion-1/svn_ra.h:542: error: expected declaration specifiers or '...' before 'apr_hash_t'
/usr/include/subversion-1/svn_ra.h:543: error: expected declaration specifiers or '...' before 'apr_pool_t'
/usr/include/subversion-1/svn_ra.h:558: error: expected declaration specifiers or '...' before 'apr_pool_t'
/usr/include/subversion-1/svn_ra.h:600: error: expected declaration specifiers or '...' before 'apr_hash_t'
/usr/include/subversion-1/svn_ra.h:602: error: expected declaration specifiers or '...' before 'apr_pool_t'
/usr/include/subversion-1/svn_ra.h:617: error: expected declaration specifiers or '...' before 'apr_hash_t'
/usr/include/subversion-1/svn_ra.h:619: error: expected declaration specifiers or '...' before 'apr_pool_t'
/usr/include/subversion-1/svn_ra.h:651: error: expected declaration specifiers or '...' before 'apr_hash_t'
/usr/include/subversion-1/svn_ra.h:652: error: expected declaration specifiers or '...' before 'apr_pool_t'
/usr/include/subversion-1/svn_ra.h:682: error: expected declaration specifiers or '...' before 'apr_hash_t'
/usr/include/subversion-1/svn_ra.h:684: error: expected declaration specifiers or '...' before 'apr_hash_t'
/usr/include/subversion-1/svn_ra.h:687: error: expected declaration specifiers or '...' before 'apr_uint32_t'
/usr/include/subversion-1/svn_ra.h:688: error: expected declaration specifiers or '...' before 'apr_pool_t'
/usr/include/subversion-1/svn_ra.h:701: error: expected declaration specifiers or '...' before 'apr_hash_t'
/usr/include/subversion-1/svn_ra.h:703: error: expected declaration specifiers or '...' before 'apr_hash_t'
/usr/include/subversion-1/svn_ra.h:704: error: expected declaration specifiers or '...' before 'apr_pool_t'
/usr/include/subversion-1/svn_ra.h:753: error: expected declaration specifiers or '...' before 'apr_pool_t'
/usr/include/subversion-1/svn_ra.h:805: error: expected declaration specifiers or '...' before 'apr_pool_t'
/usr/include/subversion-1/svn_ra.h:852: error: expected declaration specifiers or '...' before 'apr_pool_t'
/usr/include/subversion-1/svn_ra.h:921: error: expected declaration specifiers or '...' before 'apr_pool_t'
/usr/include/subversion-1/svn_ra.h:938: error: expected declaration specifiers or '...' before 'apr_pool_t'
/usr/include/subversion-1/svn_ra.h:981: warning: type defaults to 'int' in declaration of 'apr_array_header_t'
/usr/include/subversion-1/svn_ra.h:981: error: expected ';', ',' or ')' before '*' token
/usr/include/subversion-1/svn_ra.h:1004: error: expected declaration specifiers or '...' before 'apr_pool_t'
/usr/include/subversion-1/svn_ra.h:1019: error: expected declaration specifiers or '...' before 'apr_pool_t'
/usr/include/subversion-1/svn_ra.h:1033: error: expected declaration specifiers or '...' before 'apr_pool_t'
/usr/include/subversion-1/svn_ra.h:1048: error: expected declaration specifiers or '...' before 'apr_pool_t'
/usr/include/subversion-1/svn_ra.h:1068: error: expected declaration specifiers or '...' before 'apr_hash_t'
/usr/include/subversion-1/svn_ra.h:1071: error: expected declaration specifiers or '...' before 'apr_array_header_t'
/usr/include/subversion-1/svn_ra.h:1072: error: expected declaration specifiers or '...' before 'apr_pool_t'
/usr/include/subversion-1/svn_ra.h:1105: error: expected declaration specifiers or '...' before 'apr_pool_t'
/usr/include/subversion-1/svn_ra.h:1139: error: expected declaration specifiers or '...' before 'apr_hash_t'
/usr/include/subversion-1/svn_ra.h:1144: error: expected declaration specifiers or '...' before 'apr_pool_t'
/usr/include/subversion-1/svn_ra.h:1170: error: expected declaration specifiers or '...' before 'apr_hash_t'
/usr/include/subversion-1/svn_ra.h:1174: error: expected declaration specifiers or '...' before 'apr_pool_t'
/usr/include/subversion-1/svn_ra.h:1186: error: expected declaration specifiers or '...' before 'apr_pool_t'
/usr/include/subversion-1/svn_ra.h:1206: error: expected declaration specifiers or '...' before 'apr_hash_t'
/usr/include/subversion-1/svn_ra.h:1208: error: expected declaration specifiers or '...' before 'apr_pool_t'
/usr/include/subversion-1/svn_ra.h:1236: error: expected declaration specifiers or '...' before 'apr_pool_t'
/usr/include/subversion-1/svn_ra.h:1245: error: expected declaration specifiers or '...' before 'apr_pool_t'
/usr/include/subversion-1/svn_ra.h:1256: error: expected declaration specifiers or '...' before 'apr_pool_t'
/usr/include/subversion-1/svn_ra.h:1283: error: expected declaration specifiers or '...' before 'apr_hash_t'
/usr/include/subversion-1/svn_ra.h:1284: error: expected declaration specifiers or '...' before 'apr_pool_t'
/usr/include/subversion-1/svn_ra.h:1291: error: expected declaration specifiers or '...' before 'apr_pool_t'
/usr/include/subversion-1/svn_ra.h:1298: error: expected declaration specifiers or '...' before 'apr_time_t'
/usr/include/subversion-1/svn_ra.h:1299: error: expected declaration specifiers or '...' before 'apr_pool_t'
/usr/include/subversion-1/svn_ra.h:1308: error: expected declaration specifiers or '...' before 'apr_pool_t'
/usr/include/subversion-1/svn_ra.h:1315: error: expected declaration specifiers or '...' before 'apr_hash_t'
/usr/include/subversion-1/svn_ra.h:1316: error: expected declaration specifiers or '...' before 'apr_pool_t'
/usr/include/subversion-1/svn_ra.h:1325: error: expected declaration specifiers or '...' before 'apr_pool_t'
/usr/include/subversion-1/svn_ra.h:1337: error: expected declaration specifiers or '...' before 'apr_pool_t'
/usr/include/subversion-1/svn_ra.h:1347: error: expected declaration specifiers or '...' before 'apr_hash_t'
/usr/include/subversion-1/svn_ra.h:1348: error: expected declaration specifiers or '...' before 'apr_pool_t'
/usr/include/subversion-1/svn_ra.h:1356: error: expected declaration specifiers or '...' before 'apr_hash_t'
/usr/include/subversion-1/svn_ra.h:1358: error: expected declaration specifiers or '...' before 'apr_hash_t'
/usr/include/subversion-1/svn_ra.h:1359: error: expected declaration specifiers or '...' before 'apr_pool_t'
/usr/include/subversion-1/svn_ra.h:1372: error: expected declaration specifiers or '...' before 'apr_pool_t'
/usr/include/subversion-1/svn_ra.h:1386: error: expected declaration specifiers or '...' before 'apr_pool_t'
/usr/include/subversion-1/svn_ra.h:1399: error: expected declaration specifiers or '...' before 'apr_pool_t'
/usr/include/subversion-1/svn_ra.h:1414: error: expected declaration specifiers or '...' before 'apr_pool_t'
/usr/include/subversion-1/svn_ra.h:1420: warning: type defaults to 'int' in declaration of 'apr_array_header_t'
/usr/include/subversion-1/svn_ra.h:1420: error: expected ';', ',' or ')' before '*' token
/usr/include/subversion-1/svn_ra.h:1432: error: expected ';' before 'svn_error_t'
/usr/include/subversion-1/svn_ra.h:1507: error: expected declaration specifiers or '...' before 'apr_pool_t'
/usr/include/subversion-1/svn_ra.h:1508: error: expected declaration specifiers or '...' before 'apr_hash_t'
/usr/include/subversion-1/svn_ra.h:1543: error: expected declaration specifiers or '...' before 'apr_pool_t'
/usr/include/subversion-1/svn_ra.h:1544: error: expected declaration specifiers or '...' before 'apr_hash_t'
/usr/include/subversion-1/svn_ra.h:1550: error: expected declaration specifiers or '...' before 'apr_pool_t'
/usr/include/subversion-1/svn_ra.h:1551: error: expected declaration specifiers or '...' before 'apr_hash_t'
/usr/include/subversion-1/svn_ra.h:1557: error: expected declaration specifiers or '...' before 'apr_pool_t'
/usr/include/subversion-1/svn_ra.h:1558: error: expected declaration specifiers or '...' before 'apr_hash_t'
/usr/include/subversion-1/svn_ra.h:1565: error: expected declaration specifiers or '...' before 'apr_pool_t'
/usr/include/subversion-1/svn_ra.h:1566: error: expected declaration specifiers or '...' before 'apr_hash_t'
/usr/include/subversion-1/svn_ra.h:1575: error: expected declaration specifiers or '...' before 'apr_pool_t'
/usr/include/subversion-1/svn_ra.h:1588: error: expected declaration specifiers or '...' before 'apr_pool_t'
In file included from /usr/include/subversion-1/svn_client.h:38,
                 from hydra-svn.c:17:
/usr/include/subversion-1/svn_wc.h:175: error: expected declaration specifiers or '...' before 'apr_pool_t'
/usr/include/subversion-1/svn_wc.h:187: error: expected declaration specifiers or '...' before 'apr_pool_t'
/usr/include/subversion-1/svn_wc.h:200: error: expected declaration specifiers or '...' before 'apr_pool_t'
/usr/include/subversion-1/svn_wc.h:222: error: expected declaration specifiers or '...' before 'apr_pool_t'
/usr/include/subversion-1/svn_wc.h:235: error: expected declaration specifiers or '...' before 'apr_pool_t'
/usr/include/subversion-1/svn_wc.h:248: error: expected declaration specifiers or '...' before 'apr_pool_t'
/usr/include/subversion-1/svn_wc.h:278: error: expected declaration specifiers or '...' before 'apr_pool_t'
/usr/include/subversion-1/svn_wc.h:292: error: expected declaration specifiers or '...' before 'apr_pool_t'
/usr/include/subversion-1/svn_wc.h:304: error: expected declaration specifiers or '...' before 'apr_pool_t'
/usr/include/subversion-1/svn_wc.h:337: error: expected declaration specifiers or '...' before 'apr_pool_t'
/usr/include/subversion-1/svn_wc.h:350: error: expected declaration specifiers or '...' before 'apr_pool_t'
/usr/include/subversion-1/svn_wc.h:363: error: expected declaration specifiers or '...' before 'apr_pool_t'
/usr/include/subversion-1/svn_wc.h:378: error: expected '=', ',', ';', 'asm' or '__attribute__' before '*' token
/usr/include/subversion-1/svn_wc.h:389: error: expected declaration specifiers or '...' before 'apr_pool_t'
/usr/include/subversion-1/svn_wc.h:403: error: expected declaration specifiers or '...' before 'apr_pool_t'
/usr/include/subversion-1/svn_wc.h:415: error: expected ')' before '*' token
/usr/include/subversion-1/svn_wc.h:431: error: expected declaration specifiers or '...' before 'apr_pool_t'
/usr/include/subversion-1/svn_wc.h:447: error: expected ')' before '*' token
/usr/include/subversion-1/svn_wc.h:469: error: expected ')' before '*' token
/usr/include/subversion-1/svn_wc.h:506: error: expected declaration specifiers or '...' before 'apr_pool_t'
/usr/include/subversion-1/svn_wc.h:528: error: expected ')' before '*' token
/usr/include/subversion-1/svn_wc.h:543: error: expected ')' before '*' token
/usr/include/subversion-1/svn_wc.h:773: error: expected declaration specifiers or '...' before 'apr_pool_t'
/usr/include/subversion-1/svn_wc.h:781: error: expected declaration specifiers or '...' before 'apr_pool_t'
/usr/include/subversion-1/svn_wc.h:800: error: expected declaration specifiers or '...' before 'apr_pool_t'
/usr/include/subversion-1/svn_wc.h:866: warning: type defaults to 'int' in declaration of 'apr_array_header_t'
/usr/include/subversion-1/svn_wc.h:866: error: expected ';', ',' or ')' before '*' token
/usr/include/subversion-1/svn_wc.h:897: error: expected ';' before 'svn_error_t'
/usr/include/subversion-1/svn_wc.h:1060: warning: type defaults to 'int' in declaration of 'apr_array_header_t'
/usr/include/subversion-1/svn_wc.h:1060: error: expected ';', ',' or ')' before '*' token
/usr/include/subversion-1/svn_wc.h:1064: warning: no semicolon at end of struct or union
/usr/include/subversion-1/svn_wc.h:1075: error: expected declaration specifiers or '...' before 'apr_pool_t'
/usr/include/subversion-1/svn_wc.h:1085: error: expected declaration specifiers or '...' before 'apr_pool_t'
/usr/include/subversion-1/svn_wc.h:1110: error: expected declaration specifiers or '...' before 'apr_pool_t'
/usr/include/subversion-1/svn_wc.h:1120: error: expected declaration specifiers or '...' before 'apr_pool_t'
/usr/include/subversion-1/svn_wc.h:1225: error: expected specifier-qualifier-list before 'apr_time_t'
/usr/include/subversion-1/svn_wc.h:1329: error: expected declaration specifiers or '...' before 'apr_pool_t'
/usr/include/subversion-1/svn_wc.h:1362: error: expected ')' before '*' token
/usr/include/subversion-1/svn_wc.h:1372: error: expected declaration specifiers or '...' before 'apr_pool_t'
/usr/include/subversion-1/svn_wc.h:1386: error: expected declaration specifiers or '...' before 'apr_pool_t'
/usr/include/subversion-1/svn_wc.h:1398: error: expected declaration specifiers or '...' before 'apr_pool_t'
/usr/include/subversion-1/svn_wc.h:1408: error: expected declaration specifiers or '...' before 'apr_pool_t'
/usr/include/subversion-1/svn_wc.h:1450: error: expected declaration specifiers or '...' before 'apr_pool_t'
/usr/include/subversion-1/svn_wc.h:1463: error: expected declaration specifiers or '...' before 'apr_pool_t'
/usr/include/subversion-1/svn_wc.h:1472: error: expected declaration specifiers or '...' before 'apr_pool_t'
/usr/include/subversion-1/svn_wc.h:1501: error: expected declaration specifiers or '...' before 'apr_pool_t'
/usr/include/subversion-1/svn_wc.h:1512: error: expected declaration specifiers or '...' before 'apr_pool_t'
/usr/include/subversion-1/svn_wc.h:1534: error: expected declaration specifiers or '...' before 'apr_pool_t'
/usr/include/subversion-1/svn_wc.h:1684: error: expected specifier-qualifier-list before 'apr_time_t'
/usr/include/subversion-1/svn_wc.h:1754: error: expected declaration specifiers or '...' before 'apr_pool_t'
/usr/include/subversion-1/svn_wc.h:1763: error: expected declaration specifiers or '...' before 'apr_pool_t'
/usr/include/subversion-1/svn_wc.h:1796: error: expected declaration specifiers or '...' before 'apr_pool_t'
/usr/include/subversion-1/svn_wc.h:1807: error: expected declaration specifiers or '...' before 'apr_pool_t'
/usr/include/subversion-1/svn_wc.h:1888: error: expected declaration specifiers or '...' before 'apr_hash_t'
/usr/include/subversion-1/svn_wc.h:1897: error: expected declaration specifiers or '...' before 'apr_pool_t'
/usr/include/subversion-1/svn_wc.h:1911: error: expected declaration specifiers or '...' before 'apr_hash_t'
/usr/include/subversion-1/svn_wc.h:1920: error: expected declaration specifiers or '...' before 'apr_pool_t'
/usr/include/subversion-1/svn_wc.h:1938: error: expected declaration specifiers or '...' before 'apr_hash_t'
/usr/include/subversion-1/svn_wc.h:1940: error: expected declaration specifiers or '...' before 'apr_pool_t'
/usr/include/subversion-1/svn_wc.h:1977: error: expected declaration specifiers or '...' before 'apr_pool_t'
/usr/include/subversion-1/svn_wc.h:1991: error: expected declaration specifiers or '...' before 'apr_pool_t'
/usr/include/subversion-1/svn_wc.h:2021: error: expected declaration specifiers or '...' before 'apr_pool_t'
/usr/include/subversion-1/svn_wc.h:2034: error: expected declaration specifiers or '...' before 'apr_pool_t'
/usr/include/subversion-1/svn_wc.h:2100: error: expected declaration specifiers or '...' before 'apr_pool_t'
/usr/include/subversion-1/svn_wc.h:2115: error: expected declaration specifiers or '...' before 'apr_pool_t'
/usr/include/subversion-1/svn_wc.h:2160: error: expected declaration specifiers or '...' before 'apr_hash_t'
/usr/include/subversion-1/svn_wc.h:2161: error: expected declaration specifiers or '...' before 'apr_hash_t'
/usr/include/subversion-1/svn_wc.h:2164: error: expected declaration specifiers or '...' before 'apr_pool_t'
/usr/include/subversion-1/svn_wc.h:2176: error: expected declaration specifiers or '...' before 'apr_hash_t'
/usr/include/subversion-1/svn_wc.h:2179: error: expected declaration specifiers or '...' before 'apr_pool_t'
/usr/include/subversion-1/svn_wc.h:2218: error: expected declaration specifiers or '...' before 'apr_pool_t'
/usr/include/subversion-1/svn_wc.h:2260: error: expected declaration specifiers or '...' before 'apr_pool_t'
/usr/include/subversion-1/svn_wc.h:2275: error: expected declaration specifiers or '...' before 'apr_pool_t'
/usr/include/subversion-1/svn_wc.h:2309: error: expected declaration specifiers or '...' before 'apr_array_header_t'
/usr/include/subversion-1/svn_wc.h:2312: error: expected declaration specifiers or '...' before 'apr_pool_t'
/usr/include/subversion-1/svn_wc.h:2327: error: expected declaration specifiers or '...' before 'apr_array_header_t'
/usr/include/subversion-1/svn_wc.h:2329: error: expected declaration specifiers or '...' before 'apr_pool_t'
/usr/include/subversion-1/svn_wc.h:2343: error: expected declaration specifiers or '...' before 'apr_array_header_t'
/usr/include/subversion-1/svn_wc.h:2344: error: expected declaration specifiers or '...' before 'apr_pool_t'
/usr/include/subversion-1/svn_wc.h:2391: error: expected declaration specifiers or '...' before 'apr_pool_t'
/usr/include/subversion-1/svn_wc.h:2410: error: expected declaration specifiers or '...' before 'apr_pool_t'
/usr/include/subversion-1/svn_wc.h:2426: error: expected declaration specifiers or '...' before 'apr_pool_t'
/usr/include/subversion-1/svn_wc.h:2443: error: expected declaration specifiers or '...' before 'apr_pool_t'
/usr/include/subversion-1/svn_wc.h:2497: error: expected declaration specifiers or '...' before 'apr_pool_t'
/usr/include/subversion-1/svn_wc.h:2518: error: expected declaration specifiers or '...' before 'apr_pool_t'
/usr/include/subversion-1/svn_wc.h:2573: error: expected declaration specifiers or '...' before 'apr_pool_t'
/usr/include/subversion-1/svn_wc.h:2595: error: expected declaration specifiers or '...' before 'apr_pool_t'
/usr/include/subversion-1/svn_wc.h:2623: error: expected ')' before '*' token
/usr/include/subversion-1/svn_wc.h:2639: error: expected declaration specifiers or '...' before 'apr_pool_t'
/usr/include/subversion-1/svn_wc.h:2666: error: expected declaration specifiers or '...' before 'apr_pool_t'
/usr/include/subversion-1/svn_wc.h:2678: error: expected declaration specifiers or '...' before 'apr_pool_t'
/usr/include/subversion-1/svn_wc.h:2751: error: expected declaration specifiers or '...' before 'apr_pool_t'
/usr/include/subversion-1/svn_wc.h:2772: error: expected declaration specifiers or '...' before 'apr_pool_t'
/usr/include/subversion-1/svn_wc.h:2792: error: expected declaration specifiers or '...' before 'apr_pool_t'
/usr/include/subversion-1/svn_wc.h:2820: error: expected declaration specifiers or '...' before 'apr_pool_t'
/usr/include/subversion-1/svn_wc.h:2834: error: expected declaration specifiers or '...' before 'apr_pool_t'
/usr/include/subversion-1/svn_wc.h:2847: error: expected declaration specifiers or '...' before 'apr_pool_t'
/usr/include/subversion-1/svn_wc.h:2865: error: expected ')' before '*' token
/usr/include/subversion-1/svn_wc.h:2967: warning: type defaults to 'int' in declaration of 'apr_array_header_t'
/usr/include/subversion-1/svn_wc.h:2967: error: expected ';', ',' or ')' before '*' token
/usr/include/subversion-1/svn_wc.h:2985: error: expected declaration specifiers or '...' before 'apr_pool_t'
/usr/include/subversion-1/svn_wc.h:3016: error: expected declaration specifiers or '...' before 'apr_hash_t'
/usr/include/subversion-1/svn_wc.h:3017: warning: type defaults to 'int' in declaration of 'apr_array_header_t'
/usr/include/subversion-1/svn_wc.h:3017: error: expected ';', ',' or ')' before '*' token
/usr/include/subversion-1/svn_wc.h:3036: warning: type defaults to 'int' in declaration of 'apr_array_header_t'
/usr/include/subversion-1/svn_wc.h:3036: error: expected ';', ',' or ')' before '*' token
/usr/include/subversion-1/svn_wc.h:3050: error: expected declaration specifiers or '...' before 'apr_pool_t'
/usr/include/subversion-1/svn_wc.h:3074: error: expected declaration specifiers or '...' before 'apr_pool_t'
/usr/include/subversion-1/svn_wc.h:3088: error: expected declaration specifiers or '...' before 'apr_pool_t'
/usr/include/subversion-1/svn_wc.h:3109: error: expected declaration specifiers or '...' before 'apr_pool_t'
/usr/include/subversion-1/svn_wc.h:3137: error: expected declaration specifiers or '...' before 'apr_pool_t'
/usr/include/subversion-1/svn_wc.h:3150: error: expected declaration specifiers or '...' before 'apr_pool_t'
/usr/include/subversion-1/svn_wc.h:3188: error: expected declaration specifiers or '...' before 'apr_pool_t'
/usr/include/subversion-1/svn_wc.h:3204: error: expected declaration specifiers or '...' before 'apr_pool_t'
/usr/include/subversion-1/svn_wc.h:3222: error: expected ')' before '*' token
/usr/include/subversion-1/svn_wc.h:3235: error: expected ')' before '*' token
/usr/include/subversion-1/svn_wc.h:3280: error: expected declaration specifiers or '...' before 'apr_uint32_t'
/usr/include/subversion-1/svn_wc.h:3281: error: expected declaration specifiers or '...' before 'apr_pool_t'
/usr/include/subversion-1/svn_wc.h:3293: error: expected declaration specifiers or '...' before 'apr_pool_t'
/usr/include/subversion-1/svn_wc.h:3334: error: expected declaration specifiers or '...' before 'apr_pool_t'
/usr/include/subversion-1/svn_wc.h:3346: error: expected declaration specifiers or '...' before 'apr_pool_t'
/usr/include/subversion-1/svn_wc.h:3364: error: expected declaration specifiers or '...' before 'apr_pool_t'
/usr/include/subversion-1/svn_wc.h:3371: error: expected ')' before '*' token
/usr/include/subversion-1/svn_wc.h:3382: error: expected ')' before '*' token
/usr/include/subversion-1/svn_wc.h:3394: error: expected declaration specifiers or '...' before 'apr_pool_t'
/usr/include/subversion-1/svn_wc.h:3402: error: expected declaration specifiers or '...' before 'apr_pool_t'
/usr/include/subversion-1/svn_wc.h:3457: error: expected declaration specifiers or '...' before 'apr_pool_t'
In file included from /usr/include/subversion-1/svn_client.h:44,
                 from hydra-svn.c:17:
/usr/include/subversion-1/svn_diff.h:117: error: expected ')' before '*' token
/usr/include/subversion-1/svn_diff.h:127: error: expected ';' before 'svn_error_t'
/usr/include/subversion-1/svn_diff.h:150: error: expected declaration specifiers or '...' before 'apr_pool_t'
/usr/include/subversion-1/svn_diff.h:160: error: expected declaration specifiers or '...' before 'apr_pool_t'
/usr/include/subversion-1/svn_diff.h:171: error: expected declaration specifiers or '...' before 'apr_pool_t'
/usr/include/subversion-1/svn_diff.h:221: error: expected declaration specifiers or '...' before 'apr_off_t'
/usr/include/subversion-1/svn_diff.h:222: error: expected declaration specifiers or '...' before 'apr_off_t'
/usr/include/subversion-1/svn_diff.h:223: error: expected declaration specifiers or '...' before 'apr_off_t'
/usr/include/subversion-1/svn_diff.h:224: error: expected declaration specifiers or '...' before 'apr_off_t'
/usr/include/subversion-1/svn_diff.h:225: error: expected declaration specifiers or '...' before 'apr_off_t'
/usr/include/subversion-1/svn_diff.h:226: error: expected declaration specifiers or '...' before 'apr_off_t'
/usr/include/subversion-1/svn_diff.h:240: error: expected declaration specifiers or '...' before 'apr_off_t'
/usr/include/subversion-1/svn_diff.h:241: error: expected declaration specifiers or '...' before 'apr_off_t'
/usr/include/subversion-1/svn_diff.h:242: error: expected declaration specifiers or '...' before 'apr_off_t'
/usr/include/subversion-1/svn_diff.h:243: error: expected declaration specifiers or '...' before 'apr_off_t'
/usr/include/subversion-1/svn_diff.h:244: error: expected declaration specifiers or '...' before 'apr_off_t'
/usr/include/subversion-1/svn_diff.h:245: error: expected declaration specifiers or '...' before 'apr_off_t'
/usr/include/subversion-1/svn_diff.h:254: error: expected declaration specifiers or '...' before 'apr_off_t'
/usr/include/subversion-1/svn_diff.h:255: error: expected declaration specifiers or '...' before 'apr_off_t'
/usr/include/subversion-1/svn_diff.h:256: error: expected declaration specifiers or '...' before 'apr_off_t'
/usr/include/subversion-1/svn_diff.h:257: error: expected declaration specifiers or '...' before 'apr_off_t'
/usr/include/subversion-1/svn_diff.h:258: error: expected declaration specifiers or '...' before 'apr_off_t'
/usr/include/subversion-1/svn_diff.h:259: error: expected declaration specifiers or '...' before 'apr_off_t'
/usr/include/subversion-1/svn_diff.h:266: error: expected declaration specifiers or '...' before 'apr_off_t'
/usr/include/subversion-1/svn_diff.h:267: error: expected declaration specifiers or '...' before 'apr_off_t'
/usr/include/subversion-1/svn_diff.h:268: error: expected declaration specifiers or '...' before 'apr_off_t'
/usr/include/subversion-1/svn_diff.h:269: error: expected declaration specifiers or '...' before 'apr_off_t'
/usr/include/subversion-1/svn_diff.h:270: error: expected declaration specifiers or '...' before 'apr_off_t'
/usr/include/subversion-1/svn_diff.h:271: error: expected declaration specifiers or '...' before 'apr_off_t'
/usr/include/subversion-1/svn_diff.h:283: error: expected declaration specifiers or '...' before 'apr_off_t'
/usr/include/subversion-1/svn_diff.h:284: error: expected declaration specifiers or '...' before 'apr_off_t'
/usr/include/subversion-1/svn_diff.h:285: error: expected declaration specifiers or '...' before 'apr_off_t'
/usr/include/subversion-1/svn_diff.h:286: error: expected declaration specifiers or '...' before 'apr_off_t'
/usr/include/subversion-1/svn_diff.h:287: error: expected declaration specifiers or '...' before 'apr_off_t'
/usr/include/subversion-1/svn_diff.h:288: error: expected declaration specifiers or '...' before 'apr_off_t'
/usr/include/subversion-1/svn_diff.h:346: error: expected ')' before '*' token
/usr/include/subversion-1/svn_diff.h:363: warning: type defaults to 'int' in declaration of 'apr_array_header_t'
/usr/include/subversion-1/svn_diff.h:363: error: expected ';', ',' or ')' before '*' token
/usr/include/subversion-1/svn_diff.h:382: error: expected declaration specifiers or '...' before 'apr_pool_t'
/usr/include/subversion-1/svn_diff.h:393: error: expected declaration specifiers or '...' before 'apr_pool_t'
/usr/include/subversion-1/svn_diff.h:411: error: expected declaration specifiers or '...' before 'apr_pool_t'
/usr/include/subversion-1/svn_diff.h:423: error: expected declaration specifiers or '...' before 'apr_pool_t'
/usr/include/subversion-1/svn_diff.h:442: error: expected declaration specifiers or '...' before 'apr_pool_t'
/usr/include/subversion-1/svn_diff.h:455: error: expected declaration specifiers or '...' before 'apr_pool_t'
/usr/include/subversion-1/svn_diff.h:477: error: expected declaration specifiers or '...' before 'apr_pool_t'
/usr/include/subversion-1/svn_diff.h:491: error: expected declaration specifiers or '...' before 'apr_pool_t'
/usr/include/subversion-1/svn_diff.h:518: error: expected declaration specifiers or '...' before 'apr_pool_t'
In file included from hydra-svn.c:17:
/usr/include/subversion-1/svn_client.h:98: error: expected declaration specifiers or '...' before 'apr_pool_t'
/usr/include/subversion-1/svn_client.h:119: error: expected declaration specifiers or '...' before 'apr_pool_t'
/usr/include/subversion-1/svn_client.h:136: error: expected declaration specifiers or '...' before 'apr_pool_t'
/usr/include/subversion-1/svn_client.h:178: error: expected declaration specifiers or '...' before 'apr_pool_t'
/usr/include/subversion-1/svn_client.h:192: error: expected declaration specifiers or '...' before 'apr_pool_t'
/usr/include/subversion-1/svn_client.h:206: error: expected declaration specifiers or '...' before 'apr_pool_t'
/usr/include/subversion-1/svn_client.h:220: error: expected declaration specifiers or '...' before 'apr_pool_t'
/usr/include/subversion-1/svn_client.h:236: error: expected declaration specifiers or '...' before 'apr_pool_t'
/usr/include/subversion-1/svn_client.h:254: error: expected declaration specifiers or '...' before 'apr_pool_t'
/usr/include/subversion-1/svn_client.h:272: error: expected declaration specifiers or '...' before 'apr_pool_t'
/usr/include/subversion-1/svn_client.h:285: error: expected specifier-qualifier-list before 'apr_hash_t'
/usr/include/subversion-1/svn_client.h:297: error: expected declaration specifiers or '...' before 'apr_pool_t'
/usr/include/subversion-1/svn_client.h:358: error: expected specifier-qualifier-list before 'apr_byte_t'
/usr/include/subversion-1/svn_client.h:380: error: expected declaration specifiers or '...' before 'apr_pool_t'
/usr/include/subversion-1/svn_client.h:404: error: expected specifier-qualifier-list before 'apr_byte_t'
/usr/include/subversion-1/svn_client.h:443: warning: type defaults to 'int' in declaration of 'apr_array_header_t'
/usr/include/subversion-1/svn_client.h:443: error: expected ';', ',' or ')' before '*' token
/usr/include/subversion-1/svn_client.h:470: error: expected declaration specifiers or '...' before 'apr_array_header_t'
/usr/include/subversion-1/svn_client.h:472: error: expected declaration specifiers or '...' before 'apr_pool_t'
/usr/include/subversion-1/svn_client.h:491: error: expected declaration specifiers or '...' before 'apr_int64_t'
/usr/include/subversion-1/svn_client.h:496: error: expected declaration specifiers or '...' before 'apr_pool_t'
/usr/include/subversion-1/svn_client.h:551: error: expected declaration specifiers or '...' before 'apr_pool_t'
/usr/include/subversion-1/svn_client.h:567: error: expected declaration specifiers or '...' before 'apr_pool_t'
/usr/include/subversion-1/svn_client.h:604: error: expected specifier-qualifier-list before 'apr_hash_t'
/usr/include/subversion-1/svn_client.h:671: error: expected declaration specifiers or '...' before 'apr_pool_t'
/usr/include/subversion-1/svn_client.h:716: error: expected declaration specifiers or '...' before 'apr_pool_t'
/usr/include/subversion-1/svn_client.h:733: error: expected declaration specifiers or '...' before 'apr_pool_t'
/usr/include/subversion-1/svn_client.h:772: error: expected ')' before '*' token
/usr/include/subversion-1/svn_client.h:793: error: expected declaration specifiers or '...' before 'apr_pool_t'
/usr/include/subversion-1/svn_client.h:827: error: expected declaration specifiers or '...' before 'apr_pool_t'
/usr/include/subversion-1/svn_client.h:864: error: expected declaration specifiers or '...' before 'apr_pool_t'
/usr/include/subversion-1/svn_client.h:877: error: expected declaration specifiers or '...' before 'apr_pool_t'
/usr/include/subversion-1/svn_client.h:889: error: expected declaration specifiers or '...' before 'apr_pool_t'
/usr/include/subversion-1/svn_client.h:915: warning: type defaults to 'int' in declaration of 'apr_array_header_t'
/usr/include/subversion-1/svn_client.h:915: error: expected ';', ',' or ')' before '*' token
/usr/include/subversion-1/svn_client.h:927: warning: type defaults to 'int' in declaration of 'apr_array_header_t'
/usr/include/subversion-1/svn_client.h:927: error: expected ';', ',' or ')' before '*' token
/usr/include/subversion-1/svn_client.h:965: warning: type defaults to 'int' in declaration of 'apr_array_header_t'
/usr/include/subversion-1/svn_client.h:965: error: expected ';', ',' or ')' before '*' token
/usr/include/subversion-1/svn_client.h:978: warning: type defaults to 'int' in declaration of 'apr_array_header_t'
/usr/include/subversion-1/svn_client.h:978: error: expected ';', ',' or ')' before '*' token
/usr/include/subversion-1/svn_client.h:1032: error: expected declaration specifiers or '...' before 'apr_pool_t'
/usr/include/subversion-1/svn_client.h:1046: error: expected declaration specifiers or '...' before 'apr_pool_t'
/usr/include/subversion-1/svn_client.h:1081: warning: type defaults to 'int' in declaration of 'apr_array_header_t'
/usr/include/subversion-1/svn_client.h:1081: error: expected ';', ',' or ')' before '*' token
/usr/include/subversion-1/svn_client.h:1096: warning: type defaults to 'int' in declaration of 'apr_array_header_t'
/usr/include/subversion-1/svn_client.h:1096: error: expected ';', ',' or ')' before '*' token
/usr/include/subversion-1/svn_client.h:1110: warning: type defaults to 'int' in declaration of 'apr_array_header_t'
/usr/include/subversion-1/svn_client.h:1110: error: expected ';', ',' or ')' before '*' token
/usr/include/subversion-1/svn_client.h:1155: error: expected declaration specifiers or '...' before 'apr_pool_t'
/usr/include/subversion-1/svn_client.h:1177: error: expected declaration specifiers or '...' before 'apr_pool_t'
/usr/include/subversion-1/svn_client.h:1221: warning: type defaults to 'int' in declaration of 'apr_array_header_t'
/usr/include/subversion-1/svn_client.h:1221: error: expected ';', ',' or ')' before '*' token
/usr/include/subversion-1/svn_client.h:1242: warning: type defaults to 'int' in declaration of 'apr_array_header_t'
/usr/include/subversion-1/svn_client.h:1242: error: expected ';', ',' or ')' before '*' token
/usr/include/subversion-1/svn_client.h:1275: warning: type defaults to 'int' in declaration of 'apr_array_header_t'
/usr/include/subversion-1/svn_client.h:1275: error: expected ';', ',' or ')' before '*' token
/usr/include/subversion-1/svn_client.h:1320: error: expected declaration specifiers or '...' before 'apr_pool_t'
/usr/include/subversion-1/svn_client.h:1338: error: expected declaration specifiers or '...' before 'apr_pool_t'
/usr/include/subversion-1/svn_client.h:1353: error: expected declaration specifiers or '...' before 'apr_pool_t'
/usr/include/subversion-1/svn_client.h:1398: warning: type defaults to 'int' in declaration of 'apr_array_header_t'
/usr/include/subversion-1/svn_client.h:1398: error: expected ';', ',' or ')' before '*' token
/usr/include/subversion-1/svn_client.h:1421: warning: type defaults to 'int' in declaration of 'apr_array_header_t'
/usr/include/subversion-1/svn_client.h:1421: error: expected ';', ',' or ')' before '*' token
/usr/include/subversion-1/svn_client.h:1441: warning: type defaults to 'int' in declaration of 'apr_array_header_t'
/usr/include/subversion-1/svn_client.h:1441: error: expected ';', ',' or ')' before '*' token
/usr/include/subversion-1/svn_client.h:1468: warning: type defaults to 'int' in declaration of 'apr_array_header_t'
/usr/include/subversion-1/svn_client.h:1468: error: expected ';', ',' or ')' before '*' token
/usr/include/subversion-1/svn_client.h:1491: warning: type defaults to 'int' in declaration of 'apr_array_header_t'
/usr/include/subversion-1/svn_client.h:1491: error: expected ';', ',' or ')' before '*' token
/usr/include/subversion-1/svn_client.h:1512: warning: type defaults to 'int' in declaration of 'apr_array_header_t'
/usr/include/subversion-1/svn_client.h:1512: error: expected ';', ',' or ')' before '*' token
/usr/include/subversion-1/svn_client.h:1551: error: expected declaration specifiers or '...' before 'apr_pool_t'
/usr/include/subversion-1/svn_client.h:1583: error: expected declaration specifiers or '...' before 'apr_pool_t'
/usr/include/subversion-1/svn_client.h:1642: warning: type defaults to 'int' in declaration of 'apr_array_header_t'
/usr/include/subversion-1/svn_client.h:1642: error: expected ';', ',' or ')' before '*' token
/usr/include/subversion-1/svn_client.h:1661: error: expected declaration specifiers or '...' before 'apr_pool_t'
/usr/include/subversion-1/svn_client.h:1683: warning: type defaults to 'int' in declaration of 'apr_array_header_t'
/usr/include/subversion-1/svn_client.h:1683: error: expected ';', ',' or ')' before '*' token
/usr/include/subversion-1/svn_client.h:1705: error: expected declaration specifiers or '...' before 'apr_pool_t'
/usr/include/subversion-1/svn_client.h:1719: error: expected declaration specifiers or '...' before 'apr_pool_t'
/usr/include/subversion-1/svn_client.h:1740: error: expected declaration specifiers or '...' before 'apr_pool_t'
/usr/include/subversion-1/svn_client.h:1757: warning: type defaults to 'int' in declaration of 'apr_array_header_t'
/usr/include/subversion-1/svn_client.h:1757: error: expected ';', ',' or ')' before '*' token
/usr/include/subversion-1/svn_client.h:1777: error: expected declaration specifiers or '...' before 'apr_pool_t'
/usr/include/subversion-1/svn_client.h:1819: error: expected declaration specifiers or '...' before 'apr_pool_t'
/usr/include/subversion-1/svn_client.h:1836: error: expected declaration specifiers or '...' before 'apr_pool_t'
/usr/include/subversion-1/svn_client.h:1850: error: expected declaration specifiers or '...' before 'apr_pool_t'
/usr/include/subversion-1/svn_client.h:1909: error: expected declaration specifiers or '...' before 'apr_pool_t'
/usr/include/subversion-1/svn_client.h:1925: error: expected declaration specifiers or '...' before 'apr_pool_t'
/usr/include/subversion-1/svn_client.h:1940: error: expected declaration specifiers or '...' before 'apr_pool_t'
/usr/include/subversion-1/svn_client.h:1957: error: expected declaration specifiers or '...' before 'apr_pool_t'
/usr/include/subversion-1/svn_client.h:2008: error: expected declaration specifiers or '...' before 'apr_pool_t'
/usr/include/subversion-1/svn_client.h:2021: error: expected declaration specifiers or '...' before 'apr_pool_t'
/usr/include/subversion-1/svn_client.h:2052: error: expected declaration specifiers or '...' before 'apr_pool_t'
/usr/include/subversion-1/svn_client.h:2084: error: expected ')' before '*' token
/usr/include/subversion-1/svn_client.h:2100: error: expected ')' before '*' token
/usr/include/subversion-1/svn_client.h:2126: error: expected declaration specifiers or '...' before 'apr_pool_t'
/usr/include/subversion-1/svn_client.h:2159: error: expected ')' before '*' token
/usr/include/subversion-1/svn_client.h:2174: error: expected ')' before '*' token
/usr/include/subversion-1/svn_client.h:2194: error: expected ')' before '*' token
/usr/include/subversion-1/svn_client.h:2262: error: expected declaration specifiers or '...' before 'apr_pool_t'
/usr/include/subversion-1/svn_client.h:2282: error: expected declaration specifiers or '...' before 'apr_pool_t'
/usr/include/subversion-1/svn_client.h:2298: error: expected declaration specifiers or '...' before 'apr_pool_t'
/usr/include/subversion-1/svn_client.h:2312: error: expected declaration specifiers or '...' before 'apr_pool_t'
/usr/include/subversion-1/svn_client.h:2350: error: expected declaration specifiers or '...' before 'apr_uint32_t'
/usr/include/subversion-1/svn_client.h:2355: error: expected declaration specifiers or '...' before 'apr_pool_t'
/usr/include/subversion-1/svn_client.h:2374: error: expected ')' before '*' token
/usr/include/subversion-1/svn_client.h:2391: error: expected ')' before '*' token
/usr/include/subversion-1/svn_client.h:2406: error: expected ')' before '*' token
/usr/include/subversion-1/svn_client.h:2442: error: expected declaration specifiers or '...' before 'apr_pool_t'
/usr/include/subversion-1/svn_client.h:2456: error: expected declaration specifiers or '...' before 'apr_pool_t'
/usr/include/subversion-1/svn_client.h:2489: warning: type defaults to 'int' in declaration of 'apr_array_header_t'
/usr/include/subversion-1/svn_client.h:2489: error: expected ';', ',' or ')' before '*' token
/usr/include/subversion-1/svn_client.h:2525: warning: type defaults to 'int' in declaration of 'apr_array_header_t'
/usr/include/subversion-1/svn_client.h:2525: error: expected ';', ',' or ')' before '*' token
/usr/include/subversion-1/svn_client.h:2565: error: expected specifier-qualifier-list before 'apr_time_t'
/usr/include/subversion-1/svn_client.h:2609: error: expected declaration specifiers or '...' before 'apr_pool_t'
/usr/include/subversion-1/svn_client.h:2618: error: expected declaration specifiers or '...' before 'apr_pool_t'
/usr/include/subversion-1/svn_client.h:2660: error: expected declaration specifiers or '...' before 'apr_pool_t'
/usr/include/subversion-1/svn_client.h:2678: error: expected declaration specifiers or '...' before 'apr_pool_t'
/usr/include/subversion-1/svn_client.h:2696: error: expected declaration specifiers or '...' before 'apr_pool_t'
/usr/include/subversion-1/svn_client.h:2714: error: expected declaration specifiers or '...' before 'apr_pool_t'
/usr/include/subversion-1/svn_client.h:2733: error: expected declaration specifiers or '...' before 'apr_pool_t'
In file included from hydra-svn.c:18:
/usr/include/subversion-1/svn_pools.h:53: error: expected '=', ',', ';', 'asm' or '__attribute__' before '*' token
/usr/include/subversion-1/svn_pools.h:57: error: expected '=', ',', ';', 'asm' or '__attribute__' before '*' token
In file included from hydra-svn.c:19:
/usr/include/subversion-1/svn_config.h:135: error: expected ')' before '*' token
/usr/include/subversion-1/svn_config.h:149: error: expected declaration specifiers or '...' before 'apr_pool_t'
/usr/include/subversion-1/svn_config.h:233: error: expected declaration specifiers or '...' before 'apr_pool_t'
/usr/include/subversion-1/svn_config.h:249: error: expected declaration specifiers or '...' before 'apr_pool_t'
/usr/include/subversion-1/svn_config.h:279: error: expected declaration specifiers or '...' before 'apr_pool_t'
/usr/include/subversion-1/svn_config.h:301: error: expected declaration specifiers or '...' before 'apr_pool_t'
/usr/include/subversion-1/svn_config.h:317: error: expected declaration specifiers or '...' before 'apr_pool_t'
/usr/include/subversion-1/svn_config.h:341: error: expected declaration specifiers or '...' before 'apr_int64_t'
/usr/include/subversion-1/svn_config.h:342: error: expected declaration specifiers or '...' before 'apr_int64_t'
/usr/include/subversion-1/svn_config.h:343: error: expected declaration specifiers or '...' before 'apr_pool_t'
/usr/include/subversion-1/svn_config.h:360: error: expected declaration specifiers or '...' before 'apr_pool_t'
/usr/include/subversion-1/svn_config.h:392: error: expected ')' before '*' token
/usr/include/subversion-1/svn_config.h:410: error: expected ')' before '*' token
In file included from /usr/include/subversion-1/svn_cmdline.h:34,
                 from hydra-svn.c:20:
/usr/include/subversion-1/svn_utf.h:27:23: error: apr_xlate.h: No such file or directory
In file included from /usr/include/subversion-1/svn_cmdline.h:34,
                 from hydra-svn.c:20:
/usr/include/subversion-1/svn_utf.h:58: error: expected ')' before '*' token
/usr/include/subversion-1/svn_utf.h:65: error: expected declaration specifiers or '...' before 'apr_pool_t'
/usr/include/subversion-1/svn_utf.h:73: error: expected declaration specifiers or '...' before 'apr_pool_t'
/usr/include/subversion-1/svn_utf.h:81: error: expected declaration specifiers or '...' before 'apr_pool_t'
/usr/include/subversion-1/svn_utf.h:92: error: expected declaration specifiers or '...' before 'apr_pool_t'
/usr/include/subversion-1/svn_utf.h:104: error: expected declaration specifiers or '...' before 'apr_pool_t'
/usr/include/subversion-1/svn_utf.h:112: error: expected declaration specifiers or '...' before 'apr_pool_t'
/usr/include/subversion-1/svn_utf.h:120: error: expected declaration specifiers or '...' before 'apr_pool_t'
/usr/include/subversion-1/svn_utf.h:128: error: expected declaration specifiers or '...' before 'apr_pool_t'
/usr/include/subversion-1/svn_utf.h:139: error: expected declaration specifiers or '...' before 'apr_pool_t'
/usr/include/subversion-1/svn_utf.h:151: error: expected declaration specifiers or '...' before 'apr_pool_t'
/usr/include/subversion-1/svn_utf.h:188: error: expected declaration specifiers or '...' before 'apr_pool_t'
/usr/include/subversion-1/svn_utf.h:196: error: expected declaration specifiers or '...' before 'apr_pool_t'
/usr/include/subversion-1/svn_utf.h:204: error: expected declaration specifiers or '...' before 'apr_pool_t'
In file included from hydra-svn.c:20:
/usr/include/subversion-1/svn_cmdline.h:59: error: expected declaration specifiers or '...' before 'apr_pool_t'
/usr/include/subversion-1/svn_cmdline.h:64: error: expected declaration specifiers or '...' before 'apr_pool_t'
/usr/include/subversion-1/svn_cmdline.h:71: error: expected declaration specifiers or '...' before 'apr_pool_t'
/usr/include/subversion-1/svn_cmdline.h:78: error: expected declaration specifiers or '...' before 'apr_pool_t'
/usr/include/subversion-1/svn_cmdline.h:87: error: expected ')' before '*' token
/usr/include/subversion-1/svn_cmdline.h:100: error: expected declaration specifiers or '...' before 'apr_pool_t'
/usr/include/subversion-1/svn_cmdline.h:103: error: format string argument not a string type
/usr/include/subversion-1/svn_cmdline.h:112: error: expected declaration specifiers or '...' before 'apr_pool_t'
/usr/include/subversion-1/svn_cmdline.h:128: error: expected ')' before '*' token
/usr/include/subversion-1/svn_cmdline.h:139: error: expected declaration specifiers or '...' before 'apr_pool_t'
/usr/include/subversion-1/svn_cmdline.h:150: error: expected declaration specifiers or '...' before 'apr_pool_t'
/usr/include/subversion-1/svn_cmdline.h:175: error: expected declaration specifiers or '...' before 'apr_pool_t'
/usr/include/subversion-1/svn_cmdline.h:190: error: expected declaration specifiers or '...' before 'apr_pool_t'
/usr/include/subversion-1/svn_cmdline.h:205: error: expected declaration specifiers or '...' before 'apr_uint32_t'
/usr/include/subversion-1/svn_cmdline.h:208: error: expected declaration specifiers or '...' before 'apr_pool_t'
/usr/include/subversion-1/svn_cmdline.h:225: error: expected declaration specifiers or '...' before 'apr_pool_t'
/usr/include/subversion-1/svn_cmdline.h:241: error: expected declaration specifiers or '...' before 'apr_pool_t'
/usr/include/subversion-1/svn_cmdline.h:263: error: expected declaration specifiers or '...' before 'apr_pool_t'
/usr/include/subversion-1/svn_cmdline.h:276: error: expected ')' before '*' token
hydra-svn.c:33: error: expected declaration specifiers or '...' before 'apr_pool_t'
hydra-svn.c: In function 'my_simple_prompt_callback':
hydra-svn.c:38: warning: implicit declaration of function 'apr_pcalloc'
hydra-svn.c:38: error: 'pool' undeclared (first use in this function)
hydra-svn.c:38: error: (Each undeclared identifier is reported only once
hydra-svn.c:38: error: for each function it appears in.)
hydra-svn.c:38: warning: initialization makes pointer from integer without a cast
hydra-svn.c:48: warning: implicit declaration of function 'apr_pstrdup'
hydra-svn.c:48: warning: assignment makes pointer from integer without a cast
hydra-svn.c:49: warning: assignment makes pointer from integer without a cast
hydra-svn.c: In function 'start_svn':
hydra-svn.c:62: error: 'apr_pool_t' undeclared (first use in this function)
hydra-svn.c:62: error: 'pool' undeclared (first use in this function)
hydra-svn.c:65: error: 'apr_hash_t' undeclared (first use in this function)
hydra-svn.c:65: error: 'dirents' undeclared (first use in this function)
hydra-svn.c:78: warning: implicit declaration of function 'svn_pool_create_ex'
hydra-svn.c:80: error: too many arguments to function 'svn_config_ensure'
hydra-svn.c:88: error: too many arguments to function 'svn_client_create_context'
hydra-svn.c:94: warning: implicit declaration of function 'svn_config_get_config'
hydra-svn.c:94: error: 'svn_client_ctx_t' has no member named 'config'
hydra-svn.c:94: warning: assignment makes pointer from integer without a cast
hydra-svn.c:103: error: 'apr_array_header_t' undeclared (first use in this function)
hydra-svn.c:103: error: 'providers' undeclared (first use in this function)
hydra-svn.c:104: warning: implicit declaration of function 'apr_array_make'
hydra-svn.c:109: error: too many arguments to function 'svn_client_get_simple_prompt_provider'
hydra-svn.c:110: warning: implicit declaration of function 'apr_array_push'
hydra-svn.c:113: error: too many arguments to function 'svn_auth_open'
hydra-svn.c:120: warning: implicit declaration of function 'svn_client_ls'
hydra-svn.c:123: warning: assignment makes pointer from integer without a cast
hydra-svn.c:125: warning: implicit declaration of function 'apr_pool_clear'
hydra-svn.c:126: warning: implicit declaration of function 'apr_pool_destroy'
hydra-svn.c:131: error: 'svn_error_t' has no member named 'apr_err'
hydra-svn.c:131: error: 'svn_error_t' has no member named 'message'
hydra-svn.c:134: error: 'svn_error_t' has no member named 'apr_err'
hydra-svn.c:140: error: 'svn_error_t' has no member named 'message'
make: *** [hydra-svn.o] Error 1