All pastes #622511 Raw Edit

Untitled

public text v1 · immutable
·published 2007-07-16 22:08 UTC
rendered paste body
/bin/sh ./libtool --tag=CC   --mode=link gcc  -g -O2 -Wall -std=c9x   -o test-libglade test-libglade.o glade/libglade-2.0.la -L/root/src/jhbuild-evo/install/lib -L/opt/gnome/lib -lxml2 -lgtk-x11-2.0 -lgdk-x11-2.0 -latk-1.0 -lgdk_pixbuf-2.0 -lm -lpangocairo-1.0 -lpango-1.0 -lcairo -lgobject-2.0 -lgmodule-2.0 -ldl -lglib-2.0   
gcc -g -O2 -Wall -std=c9x -o .libs/test-libglade test-libglade.o  glade/.libs/libglade-2.0.so -L/root/src/jhbuild-evo/install/lib -L/opt/gnome/lib /opt/gnome/lib/libgtk-x11-2.0.so /opt/gnome/lib/libgdk-x11-2.0.so /opt/gnome/lib/libgdk_pixbuf-2.0.so /opt/gnome/lib/libgmodule-2.0.so /opt/gnome/lib/libgobject-2.0.so /opt/gnome/lib/libglib-2.0.so -lrt /root/src/jhbuild-evo/install/lib/libxml2.so /root/src/jhbuild-evo/install/lib/libgtk-x11-2.0.so /root/src/jhbuild-evo/install/lib/libgdk-x11-2.0.so /root/src/jhbuild-evo/install/lib/libatk-1.0.so /root/src/jhbuild-evo/install/lib/libgdk_pixbuf-2.0.so /root/src/jhbuild-evo/install/lib/libpangocairo-1.0.so /root/src/jhbuild-evo/install/lib/libpangoft2-1.0.so /root/src/jhbuild-evo/install/lib/libpango-1.0.so /root/src/jhbuild-evo/install/lib/libcairo.so /root/src/jhbuild-evo/install/lib/libfontconfig.so /usr/lib/libfreetype.so -lexpat /usr/lib/libpng12.so -lz /usr/lib/libXrender.so -lpthread /usr/lib/libX11.so /usr/lib/libXau.so /usr/lib/libXdmcp.so -lm /root/src/jhbuild-evo/install/lib/libgobject-2.0.so /root/src/jhbuild-evo/install/lib/libgmodule-2.0.so -ldl /root/src/jhbuild-evo/install/lib/libglib-2.0.so -Wl,--rpath -Wl,/root/src/jhbuild-evo/install/lib
/root/src/jhbuild-evo/install/lib/libpangocairo-1.0.so: undefined reference to `g_once_init_enter_impl'
/root/src/jhbuild-evo/install/lib/libpangocairo-1.0.so: undefined reference to `g_once_init_leave'
collect2: ld returned 1 exit status
make[2]: *** [test-libglade] Error 1
make[2]: Leaving directory `/root/src/jhbuild-evo/libglade'
make[1]: *** [all-recursive] Error 1
make[1]: Leaving directory `/root/src/jhbuild-evo/libglade'
make: *** [all] Error 2
*** error during stage build of libglade: ########## Error running make   *** [7/35]