i830_driver.c: In function 'I830DrmMMInit':
i830_driver.c:2132: error: 'drm_mm_init_arg_t' has no member named 'req'
i830_driver.c:2132: error: 'mm_init' undeclared (first use in this function)
i830_driver.c:2132: error: (Each undeclared identifier is reported only once
i830_driver.c:2132: error: for each function it appears in.)
i830_driver.c:2133: error: 'drm_mm_init_arg_t' has no member named 'req'
i830_driver.c:2134: error: 'drm_mm_init_arg_t' has no member named 'req'
i830_driver.c:2135: error: 'drm_mm_init_arg_t' has no member named 'req'
i830_driver.c: In function 'I830DrmMMTakedown':
i830_driver.c:2153: error: 'drm_mm_init_arg_t' has no member named 'req'
i830_driver.c:2153: error: 'mm_takedown' undeclared (first use in this function)
i830_driver.c:2154: error: 'drm_mm_init_arg_t' has no member named 'req'
i830_driver.c: In function 'I830DrmMMLock':
i830_driver.c:2168: error: 'drm_mm_init_arg_t' has no member named 'req'
i830_driver.c:2168: error: 'mm_lock' undeclared (first use in this function)
i830_driver.c:2169: error: 'drm_mm_init_arg_t' has no member named 'req'
i830_driver.c: In function 'I830DrmMMUnlock':
i830_driver.c:2184: error: 'drm_mm_init_arg_t' has no member named 'req'
i830_driver.c:2184: error: 'mm_unlock' undeclared (first use in this function)
i830_driver.c:2185: error: 'drm_mm_init_arg_t' has no member named 'req'
make[3]: *** [i830_driver.lo] Erreur 1
make[3]: *** Attente des tâches non terminées....
i686-pc-linux-gnu-gcc -DHAVE_CONFIG_H -I. -I.. -Wall -Wpointer-arith -Wstrict-prototypes -Wmissing-prototypes -Wmissing-declarations -Wnested-externs -fno-strict-aliasing -I/usr/include/xorg -I/usr/include/drm -I/usr/include/X11/dri -DI830_XV -DI830_USE_XAA -DI830_USE_EXA -march=prescott -O2 -pipe -fstack-protector -g -MT i830_display.lo -MD -MP -MF .deps/i830_display.Tpo -c i830_display.c -fPIC -DPIC -o .libs/i830_display.o
mv -f .deps/i830_dvo.Tpo .deps/i830_dvo.Plo
mv -f .deps/i830_debug.Tpo .deps/i830_debug.Plo
mv -f .deps/i830_display.Tpo .deps/i830_display.Plo
make[3]: quittant le répertoire « /var/tmp/portage/x11-drivers/xf86-video-intel-99999999/work/xf86-video-intel-99999999/src »
make[2]: *** [all-recursive] Erreur 1
make[2]: quittant le répertoire « /var/tmp/portage/x11-drivers/xf86-video-intel-99999999/work/xf86-video-intel-99999999/src »
make[1]: *** [all-recursive] Erreur 1
make[1]: quittant le répertoire « /var/tmp/portage/x11-drivers/xf86-video-intel-99999999/work/xf86-video-intel-99999999 »
make: *** [all] Erreur 2
*
* ERROR: x11-drivers/xf86-video-intel-99999999 failed.
* Call stack:
* ebuild.sh, line 1647: Called dyn_compile
* ebuild.sh, line 988: Called qa_call 'src_compile'
* ebuild.sh, line 44: Called src_compile
* ebuild.sh, line 1327: Called x-modular_src_compile
* x-modular.eclass, line 337: Called x-modular_src_make
* x-modular.eclass, line 332: Called die
*
* emake failed
* If you need support, post the topmost build error, and the call stack if relevant.
* A complete build log is located at '/var/tmp/portage/x11-drivers/xf86-video-intel-99999999/temp/build.log'.
* This ebuild is from an overlay: '/usr/taillo/portage/'