rendered paste bodybuildit: "Patch Zope" is missing target /usr/local/topp/nui-deploy/2007-07-16/src/Zope-2.9-branch/test.py.origorig
"Patch Zope" is missing target /usr/local/topp/nui-deploy/2007-07-16/src/Zope-2.9-branch/configure.origorig
"Patch Zope" is missing target /usr/local/topp/nui-deploy/2007-07-16/src/Zope-2.9-branch/lib/python/AccessControl/__init__.py.origor
"Patch Zope" is missing target /usr/local/topp/nui-deploy/2007-07-16/src/Zope-2.9-branch/lib/python/Products/__init__.py.origorig
buildit: executing Patch Zope
buildit: running "test -e test.py.origorig || (cp test.py test.py.aside && patch -f -p0 < /usr/local/topp/nui-deploy/2007-07-16/src/pp.build.opencore/topp/build/opencore/resources/test.py.diff && mv test.py.aside test.py.origorig)"
patching file test.py
buildit: running "test -e configure.origorig || (cp configure configure.aside && patch -f -p0 < /usr/local/topp/nui-deploy/2007-07-1src/topp.build.opencore/topp/build/opencore/resources/configure.diff && mv configure.aside configure.origorig)"
patching file configure
Hunk #1 FAILED at 18.
1 out of 1 hunk FAILED -- saving rejects to file configure.rej
Traceback (most recent call last):
File "/usr/local/topp/nui-deploy/2007-07-16/bin/build-opencore", line 13, in ?
sys.exit(
File "/usr/local/topp/nui-deploy/2007-07-16/src/topp.build.opencore/topp/build/opencore/__init__.py", line 98, in main
builder.install()
File "/usr/lib/python2.4/site-packages/topp.build.lib-0.3.3-py2.4.egg/topp/build/lib/__init__.py", line 792, in install
self.perform_tasks()
File "/usr/lib/python2.4/site-packages/topp.build.lib-0.3.3-py2.4.egg/topp/build/lib/__init__.py", line 757, in perform_tasks
self.do(i)
File "/usr/lib/python2.4/site-packages/topp.build.lib-0.3.3-py2.4.egg/topp/build/lib/__init__.py", line 744, in do
Software(task, self.context).install()
File "/usr/lib/python2.4/site-packages/buildit-0.1-py2.4.egg/buildit/context.py", line 217, in install
self.context.run(self.task)
File "/usr/lib/python2.4/site-packages/buildit-0.1-py2.4.egg/buildit/context.py", line 199, in run
task.attemptCompletion()
File "/usr/lib/python2.4/site-packages/buildit-0.1-py2.4.egg/buildit/task.py", line 275, in attemptCompletion
raise TaskError, (
buildit.task.TaskError: Task "Patch Zope": command "<buildit.commandlib.Patch instance at 0x2b5330825b48>" failed with status code "6"