All pastes #621561 Raw Edit

Unnamed

public text v1 · immutable
·published 2007-07-16 08:01 UTC
rendered paste body
Using 2.6.x kernel build system.
make: Entering directory `/tmp/vmware-config0/vmmon-only'
make -C /lib/modules/2.6.20-16-generic/build/include/.. SUBDIRS=$PWD SRCROOT=$PWD/. modules
make[1]: Entering directory `/usr/src/linux-headers-2.6.20-16-generic'
  CC [M]  /tmp/vmware-config0/vmmon-only/linux/driver.o
In file included from /tmp/vmware-config0/vmmon-only/linux/driver.c:80:
/tmp/vmware-config0/vmmon-only/./include/compat_kernel.h:21: error: expected declaration specifiers or ‘...’ before ‘compat_exit’
/tmp/vmware-config0/vmmon-only/./include/compat_kernel.h:21: error: expected declaration specifiers or ‘...’ before ‘exit_code’
/tmp/vmware-config0/vmmon-only/./include/compat_kernel.h:21: warning: type defaults to ‘int’ in declaration of ‘_syscall1’
make[2]: *** [/tmp/vmware-config0/vmmon-only/linux/driver.o] Error 1
make[1]: *** [_module_/tmp/vmware-config0/vmmon-only] Error 2
make[1]: Leaving directory `/usr/src/linux-headers-2.6.20-16-generic'
make: *** [vmmon.ko] Error 2
make: Leaving directory `/tmp/vmware-config0/vmmon-only'
Unable to build the vmmon module.