All pastes #621226 Raw Edit

Unnamed

public text v1 · immutable
·published 2007-07-16 01:04 UTC
rendered paste body
This file contains any messages produced by compilers while
running configure, to aid debugging if configure makes a mistake.

It was created by mpd configure 0.14.0, which was
generated by GNU Autoconf 2.61.  Invocation command line was

  $ ./configure 

## --------- ##
## Platform. ##
## --------- ##

hostname = yzinch-laptop
uname -m = i686
uname -r = 2.6.20-16-generic
uname -s = Linux
uname -v = #2 SMP Thu Jun 7 20:19:32 UTC 2007

/usr/bin/uname -p = unknown
/bin/uname -X     = unknown

/bin/arch              = i686
/usr/bin/arch -k       = unknown
/usr/convex/getsysinfo = unknown
/usr/bin/hostinfo      = unknown
/bin/machine           = unknown
/usr/bin/oslevel       = unknown
/bin/universe          = unknown

PATH: /usr/local/sbin
PATH: /usr/local/bin
PATH: /usr/sbin
PATH: /usr/bin
PATH: /sbin
PATH: /bin
PATH: /usr/games


## ----------- ##
## Core tests. ##
## ----------- ##

configure:2110: checking for a BSD-compatible install
configure:2166: result: /usr/bin/install -c
configure:2177: checking whether build environment is sane
configure:2220: result: yes
configure:2285: checking for gawk
configure:2315: result: no
configure:2285: checking for mawk
configure:2301: found /usr/bin/mawk
configure:2312: result: mawk
configure:2323: checking whether make sets $(MAKE)
configure:2344: result: yes
configure:2582: checking for gcc
configure:2598: found /usr/bin/gcc
configure:2609: result: gcc
configure:2847: checking for C compiler version
configure:2854: gcc --version >&5
gcc (GCC) 4.1.2 (Ubuntu 4.1.2-0ubuntu4)
Copyright (C) 2006 Free Software Foundation, Inc.
This is free software; see the source for copying conditions.  There is NO
warranty; not even for MERCHANTABILITY or FITNESS FOR A PARTICULAR PURPOSE.

configure:2857: $? = 0
configure:2864: gcc -v >&5
Using built-in specs.
Target: i486-linux-gnu
Configured with: ../src/configure -v --enable-languages=c,c++,fortran,objc,obj-c++,treelang --prefix=/usr --enable-shared --with-system-zlib --libexecdir=/usr/lib --without-included-gettext --enable-threads=posix --enable-nls --program-suffix=-4.1 --enable-__cxa_atexit --enable-clocale=gnu --enable-libstdcxx-debug --enable-mpfr --enable-checking=release i486-linux-gnu
Thread model: posix
gcc version 4.1.2 (Ubuntu 4.1.2-0ubuntu4)
configure:2867: $? = 0
configure:2874: gcc -V >&5
gcc: '-V' option must have argument
configure:2877: $? = 1
configure:2900: checking for C compiler default output file name
configure:2927: gcc    conftest.c  >&5
configure:2930: $? = 0
configure:2968: result: a.out
configure:2985: checking whether the C compiler works
configure:2995: ./a.out
configure:2998: $? = 0
configure:3015: result: yes
configure:3022: checking whether we are cross compiling
configure:3024: result: no
configure:3027: checking for suffix of executables
configure:3034: gcc -o conftest    conftest.c  >&5
configure:3037: $? = 0
configure:3061: result: 
configure:3067: checking for suffix of object files
configure:3093: gcc -c   conftest.c >&5
configure:3096: $? = 0
configure:3119: result: o
configure:3123: checking whether we are using the GNU C compiler
configure:3152: gcc -c   conftest.c >&5
configure:3158: $? = 0
configure:3175: result: yes
configure:3180: checking whether gcc accepts -g
configure:3210: gcc -c -g  conftest.c >&5
configure:3216: $? = 0
configure:3315: result: yes
configure:3332: checking for gcc option to accept ISO C89
configure:3406: gcc  -c -g -O2  conftest.c >&5
conftest.c:17: error: 'p' was not declared in this scope
conftest.c:17: error: 'i' was not declared in this scope
conftest.c:17: error: initializer expression list treated as compound expression
conftest.c:18: error: expected ',' or ';' before 'char'
conftest.c:20: error: expected unqualified-id before '{' token
conftest.c: In function 'int main()':
conftest.c:56: error: cannot convert 'char*' to 'char* (*)(char**, int)' for argument '1' to 'char* f(char* (*)(char**, int), char**, ...)'
conftest.c:56: error: cannot convert 'char*' to 'char* (*)(char**, int)' for argument '1' to 'char* f(char* (*)(char**, int), char**, ...)'
configure:3412: $? = 1
configure: failed program was:
| /* confdefs.h.  */
| #define PACKAGE_NAME "mpd"
| #define PACKAGE_TARNAME "mpd"
| #define PACKAGE_VERSION "0.14.0"
| #define PACKAGE_STRING "mpd 0.14.0"
| #define PACKAGE_BUGREPORT "warren.dukes@gmail.com"
| #define PACKAGE "mpd"
| #define VERSION "0.14.0"
| /* end confdefs.h.  */
| #include <stdarg.h>
| #include <stdio.h>
| #include <sys/types.h>
| #include <sys/stat.h>
| /* Most of the following tests are stolen from RCS 5.7's src/conf.sh.  */
| struct buf { int x; };
| FILE * (*rcsopen) (struct buf *, struct stat *, int);
| static char *e (p, i)
|      char **p;
|      int i;
| {
|   return p[i];
| }
| static char *f (char * (*g) (char **, int), char **p, ...)
| {
|   char *s;
|   va_list v;
|   va_start (v,p);
|   s = g (p, va_arg (v,int));
|   va_end (v);
|   return s;
| }
| 
| /* OSF 4.0 Compaq cc is some sort of almost-ANSI by default.  It has
|    function prototypes and stuff, but not '\xHH' hex character constants.
|    These don't provoke an error unfortunately, instead are silently treated
|    as 'x'.  The following induces an error, until -std is added to get
|    proper ANSI mode.  Curiously '\x00'!='x' always comes out true, for an
|    array size at least.  It's necessary to write '\x00'==0 to get something
|    that's true only with -std.  */
| int osf4_cc_array ['\x00' == 0 ? 1 : -1];
| 
| /* IBM C 6 for AIX is almost-ANSI by default, but it replaces macro parameters
|    inside strings and character constants.  */
| #define FOO(x) 'x'
| int xlc6_cc_array[FOO(a) == 'x' ? 1 : -1];
| 
| int test (int i, double x);
| struct s1 {int (*f) (int a);};
| struct s2 {int (*f) (double a);};
| int pairnames (int, char **, FILE *(*)(struct buf *, struct stat *, int), int, int);
| int argc;
| char **argv;
| int
| main ()
| {
| return f (e, argv, 0) != argv[0]  ||  f (e, argv, 1) != argv[1];
|   ;
|   return 0;
| }
configure:3406: gcc -qlanglvl=extc89 -c -g -O2  conftest.c >&5
gcc: unrecognized option '-qlanglvl=extc89'
conftest.c:17: error: 'p' was not declared in this scope
conftest.c:17: error: 'i' was not declared in this scope
conftest.c:17: error: initializer expression list treated as compound expression
conftest.c:18: error: expected ',' or ';' before 'char'
conftest.c:20: error: expected unqualified-id before '{' token
conftest.c: In function 'int main()':
conftest.c:56: error: cannot convert 'char*' to 'char* (*)(char**, int)' for argument '1' to 'char* f(char* (*)(char**, int), char**, ...)'
conftest.c:56: error: cannot convert 'char*' to 'char* (*)(char**, int)' for argument '1' to 'char* f(char* (*)(char**, int), char**, ...)'
configure:3412: $? = 1
configure: failed program was:
| /* confdefs.h.  */
| #define PACKAGE_NAME "mpd"
| #define PACKAGE_TARNAME "mpd"
| #define PACKAGE_VERSION "0.14.0"
| #define PACKAGE_STRING "mpd 0.14.0"
| #define PACKAGE_BUGREPORT "warren.dukes@gmail.com"
| #define PACKAGE "mpd"
| #define VERSION "0.14.0"
| /* end confdefs.h.  */
| #include <stdarg.h>
| #include <stdio.h>
| #include <sys/types.h>
| #include <sys/stat.h>
| /* Most of the following tests are stolen from RCS 5.7's src/conf.sh.  */
| struct buf { int x; };
| FILE * (*rcsopen) (struct buf *, struct stat *, int);
| static char *e (p, i)
|      char **p;
|      int i;
| {
|   return p[i];
| }
| static char *f (char * (*g) (char **, int), char **p, ...)
| {
|   char *s;
|   va_list v;
|   va_start (v,p);
|   s = g (p, va_arg (v,int));
|   va_end (v);
|   return s;
| }
| 
| /* OSF 4.0 Compaq cc is some sort of almost-ANSI by default.  It has
|    function prototypes and stuff, but not '\xHH' hex character constants.
|    These don't provoke an error unfortunately, instead are silently treated
|    as 'x'.  The following induces an error, until -std is added to get
|    proper ANSI mode.  Curiously '\x00'!='x' always comes out true, for an
|    array size at least.  It's necessary to write '\x00'==0 to get something
|    that's true only with -std.  */
| int osf4_cc_array ['\x00' == 0 ? 1 : -1];
| 
| /* IBM C 6 for AIX is almost-ANSI by default, but it replaces macro parameters
|    inside strings and character constants.  */
| #define FOO(x) 'x'
| int xlc6_cc_array[FOO(a) == 'x' ? 1 : -1];
| 
| int test (int i, double x);
| struct s1 {int (*f) (int a);};
| struct s2 {int (*f) (double a);};
| int pairnames (int, char **, FILE *(*)(struct buf *, struct stat *, int), int, int);
| int argc;
| char **argv;
| int
| main ()
| {
| return f (e, argv, 0) != argv[0]  ||  f (e, argv, 1) != argv[1];
|   ;
|   return 0;
| }
configure:3406: gcc -qlanglvl=ansi -c -g -O2  conftest.c >&5
gcc: unrecognized option '-qlanglvl=ansi'
conftest.c:17: error: 'p' was not declared in this scope
conftest.c:17: error: 'i' was not declared in this scope
conftest.c:17: error: initializer expression list treated as compound expression
conftest.c:18: error: expected ',' or ';' before 'char'
conftest.c:20: error: expected unqualified-id before '{' token
conftest.c: In function 'int main()':
conftest.c:56: error: cannot convert 'char*' to 'char* (*)(char**, int)' for argument '1' to 'char* f(char* (*)(char**, int), char**, ...)'
conftest.c:56: error: cannot convert 'char*' to 'char* (*)(char**, int)' for argument '1' to 'char* f(char* (*)(char**, int), char**, ...)'
configure:3412: $? = 1
configure: failed program was:
| /* confdefs.h.  */
| #define PACKAGE_NAME "mpd"
| #define PACKAGE_TARNAME "mpd"
| #define PACKAGE_VERSION "0.14.0"
| #define PACKAGE_STRING "mpd 0.14.0"
| #define PACKAGE_BUGREPORT "warren.dukes@gmail.com"
| #define PACKAGE "mpd"
| #define VERSION "0.14.0"
| /* end confdefs.h.  */
| #include <stdarg.h>
| #include <stdio.h>
| #include <sys/types.h>
| #include <sys/stat.h>
| /* Most of the following tests are stolen from RCS 5.7's src/conf.sh.  */
| struct buf { int x; };
| FILE * (*rcsopen) (struct buf *, struct stat *, int);
| static char *e (p, i)
|      char **p;
|      int i;
| {
|   return p[i];
| }
| static char *f (char * (*g) (char **, int), char **p, ...)
| {
|   char *s;
|   va_list v;
|   va_start (v,p);
|   s = g (p, va_arg (v,int));
|   va_end (v);
|   return s;
| }
| 
| /* OSF 4.0 Compaq cc is some sort of almost-ANSI by default.  It has
|    function prototypes and stuff, but not '\xHH' hex character constants.
|    These don't provoke an error unfortunately, instead are silently treated
|    as 'x'.  The following induces an error, until -std is added to get
|    proper ANSI mode.  Curiously '\x00'!='x' always comes out true, for an
|    array size at least.  It's necessary to write '\x00'==0 to get something
|    that's true only with -std.  */
| int osf4_cc_array ['\x00' == 0 ? 1 : -1];
| 
| /* IBM C 6 for AIX is almost-ANSI by default, but it replaces macro parameters
|    inside strings and character constants.  */
| #define FOO(x) 'x'
| int xlc6_cc_array[FOO(a) == 'x' ? 1 : -1];
| 
| int test (int i, double x);
| struct s1 {int (*f) (int a);};
| struct s2 {int (*f) (double a);};
| int pairnames (int, char **, FILE *(*)(struct buf *, struct stat *, int), int, int);
| int argc;
| char **argv;
| int
| main ()
| {
| return f (e, argv, 0) != argv[0]  ||  f (e, argv, 1) != argv[1];
|   ;
|   return 0;
| }
configure:3406: gcc -std -c -g -O2  conftest.c >&5
cc1: error: unrecognized command line option "-std"
configure:3412: $? = 1
configure: failed program was:
| /* confdefs.h.  */
| #define PACKAGE_NAME "mpd"
| #define PACKAGE_TARNAME "mpd"
| #define PACKAGE_VERSION "0.14.0"
| #define PACKAGE_STRING "mpd 0.14.0"
| #define PACKAGE_BUGREPORT "warren.dukes@gmail.com"
| #define PACKAGE "mpd"
| #define VERSION "0.14.0"
| /* end confdefs.h.  */
| #include <stdarg.h>
| #include <stdio.h>
| #include <sys/types.h>
| #include <sys/stat.h>
| /* Most of the following tests are stolen from RCS 5.7's src/conf.sh.  */
| struct buf { int x; };
| FILE * (*rcsopen) (struct buf *, struct stat *, int);
| static char *e (p, i)
|      char **p;
|      int i;
| {
|   return p[i];
| }
| static char *f (char * (*g) (char **, int), char **p, ...)
| {
|   char *s;
|   va_list v;
|   va_start (v,p);
|   s = g (p, va_arg (v,int));
|   va_end (v);
|   return s;
| }
| 
| /* OSF 4.0 Compaq cc is some sort of almost-ANSI by default.  It has
|    function prototypes and stuff, but not '\xHH' hex character constants.
|    These don't provoke an error unfortunately, instead are silently treated
|    as 'x'.  The following induces an error, until -std is added to get
|    proper ANSI mode.  Curiously '\x00'!='x' always comes out true, for an
|    array size at least.  It's necessary to write '\x00'==0 to get something
|    that's true only with -std.  */
| int osf4_cc_array ['\x00' == 0 ? 1 : -1];
| 
| /* IBM C 6 for AIX is almost-ANSI by default, but it replaces macro parameters
|    inside strings and character constants.  */
| #define FOO(x) 'x'
| int xlc6_cc_array[FOO(a) == 'x' ? 1 : -1];
| 
| int test (int i, double x);
| struct s1 {int (*f) (int a);};
| struct s2 {int (*f) (double a);};
| int pairnames (int, char **, FILE *(*)(struct buf *, struct stat *, int), int, int);
| int argc;
| char **argv;
| int
| main ()
| {
| return f (e, argv, 0) != argv[0]  ||  f (e, argv, 1) != argv[1];
|   ;
|   return 0;
| }
configure:3406: gcc -Ae -c -g -O2  conftest.c >&5
<command line>:1:2: error: missing '(' after predicate
conftest.c:17: error: 'p' was not declared in this scope
conftest.c:17: error: 'i' was not declared in this scope
conftest.c:17: error: initializer expression list treated as compound expression
conftest.c:18: error: expected ',' or ';' before 'char'
conftest.c:20: error: expected unqualified-id before '{' token
conftest.c: In function 'int main()':
conftest.c:56: error: cannot convert 'char*' to 'char* (*)(char**, int)' for argument '1' to 'char* f(char* (*)(char**, int), char**, ...)'
conftest.c:56: error: cannot convert 'char*' to 'char* (*)(char**, int)' for argument '1' to 'char* f(char* (*)(char**, int), char**, ...)'
configure:3412: $? = 1
configure: failed program was:
| /* confdefs.h.  */
| #define PACKAGE_NAME "mpd"
| #define PACKAGE_TARNAME "mpd"
| #define PACKAGE_VERSION "0.14.0"
| #define PACKAGE_STRING "mpd 0.14.0"
| #define PACKAGE_BUGREPORT "warren.dukes@gmail.com"
| #define PACKAGE "mpd"
| #define VERSION "0.14.0"
| /* end confdefs.h.  */
| #include <stdarg.h>
| #include <stdio.h>
| #include <sys/types.h>
| #include <sys/stat.h>
| /* Most of the following tests are stolen from RCS 5.7's src/conf.sh.  */
| struct buf { int x; };
| FILE * (*rcsopen) (struct buf *, struct stat *, int);
| static char *e (p, i)
|      char **p;
|      int i;
| {
|   return p[i];
| }
| static char *f (char * (*g) (char **, int), char **p, ...)
| {
|   char *s;
|   va_list v;
|   va_start (v,p);
|   s = g (p, va_arg (v,int));
|   va_end (v);
|   return s;
| }
| 
| /* OSF 4.0 Compaq cc is some sort of almost-ANSI by default.  It has
|    function prototypes and stuff, but not '\xHH' hex character constants.
|    These don't provoke an error unfortunately, instead are silently treated
|    as 'x'.  The following induces an error, until -std is added to get
|    proper ANSI mode.  Curiously '\x00'!='x' always comes out true, for an
|    array size at least.  It's necessary to write '\x00'==0 to get something
|    that's true only with -std.  */
| int osf4_cc_array ['\x00' == 0 ? 1 : -1];
| 
| /* IBM C 6 for AIX is almost-ANSI by default, but it replaces macro parameters
|    inside strings and character constants.  */
| #define FOO(x) 'x'
| int xlc6_cc_array[FOO(a) == 'x' ? 1 : -1];
| 
| int test (int i, double x);
| struct s1 {int (*f) (int a);};
| struct s2 {int (*f) (double a);};
| int pairnames (int, char **, FILE *(*)(struct buf *, struct stat *, int), int, int);
| int argc;
| char **argv;
| int
| main ()
| {
| return f (e, argv, 0) != argv[0]  ||  f (e, argv, 1) != argv[1];
|   ;
|   return 0;
| }
configure:3406: gcc -Aa -D_HPUX_SOURCE -c -g -O2  conftest.c >&5
<command line>:1:2: error: missing '(' after predicate
conftest.c:17: error: 'p' was not declared in this scope
conftest.c:17: error: 'i' was not declared in this scope
conftest.c:17: error: initializer expression list treated as compound expression
conftest.c:18: error: expected ',' or ';' before 'char'
conftest.c:20: error: expected unqualified-id before '{' token
conftest.c: In function 'int main()':
conftest.c:56: error: cannot convert 'char*' to 'char* (*)(char**, int)' for argument '1' to 'char* f(char* (*)(char**, int), char**, ...)'
conftest.c:56: error: cannot convert 'char*' to 'char* (*)(char**, int)' for argument '1' to 'char* f(char* (*)(char**, int), char**, ...)'
configure:3412: $? = 1
configure: failed program was:
| /* confdefs.h.  */
| #define PACKAGE_NAME "mpd"
| #define PACKAGE_TARNAME "mpd"
| #define PACKAGE_VERSION "0.14.0"
| #define PACKAGE_STRING "mpd 0.14.0"
| #define PACKAGE_BUGREPORT "warren.dukes@gmail.com"
| #define PACKAGE "mpd"
| #define VERSION "0.14.0"
| /* end confdefs.h.  */
| #include <stdarg.h>
| #include <stdio.h>
| #include <sys/types.h>
| #include <sys/stat.h>
| /* Most of the following tests are stolen from RCS 5.7's src/conf.sh.  */
| struct buf { int x; };
| FILE * (*rcsopen) (struct buf *, struct stat *, int);
| static char *e (p, i)
|      char **p;
|      int i;
| {
|   return p[i];
| }
| static char *f (char * (*g) (char **, int), char **p, ...)
| {
|   char *s;
|   va_list v;
|   va_start (v,p);
|   s = g (p, va_arg (v,int));
|   va_end (v);
|   return s;
| }
| 
| /* OSF 4.0 Compaq cc is some sort of almost-ANSI by default.  It has
|    function prototypes and stuff, but not '\xHH' hex character constants.
|    These don't provoke an error unfortunately, instead are silently treated
|    as 'x'.  The following induces an error, until -std is added to get
|    proper ANSI mode.  Curiously '\x00'!='x' always comes out true, for an
|    array size at least.  It's necessary to write '\x00'==0 to get something
|    that's true only with -std.  */
| int osf4_cc_array ['\x00' == 0 ? 1 : -1];
| 
| /* IBM C 6 for AIX is almost-ANSI by default, but it replaces macro parameters
|    inside strings and character constants.  */
| #define FOO(x) 'x'
| int xlc6_cc_array[FOO(a) == 'x' ? 1 : -1];
| 
| int test (int i, double x);
| struct s1 {int (*f) (int a);};
| struct s2 {int (*f) (double a);};
| int pairnames (int, char **, FILE *(*)(struct buf *, struct stat *, int), int, int);
| int argc;
| char **argv;
| int
| main ()
| {
| return f (e, argv, 0) != argv[0]  ||  f (e, argv, 1) != argv[1];
|   ;
|   return 0;
| }
configure:3406: gcc -Xc -D__EXTENSIONS__ -c -g -O2  conftest.c >&5
gcc: unrecognized option '-Xc'
conftest.c:17: error: 'p' was not declared in this scope
conftest.c:17: error: 'i' was not declared in this scope
conftest.c:17: error: initializer expression list treated as compound expression
conftest.c:18: error: expected ',' or ';' before 'char'
conftest.c:20: error: expected unqualified-id before '{' token
conftest.c: In function 'int main()':
conftest.c:56: error: cannot convert 'char*' to 'char* (*)(char**, int)' for argument '1' to 'char* f(char* (*)(char**, int), char**, ...)'
conftest.c:56: error: cannot convert 'char*' to 'char* (*)(char**, int)' for argument '1' to 'char* f(char* (*)(char**, int), char**, ...)'
configure:3412: $? = 1
configure: failed program was:
| /* confdefs.h.  */
| #define PACKAGE_NAME "mpd"
| #define PACKAGE_TARNAME "mpd"
| #define PACKAGE_VERSION "0.14.0"
| #define PACKAGE_STRING "mpd 0.14.0"
| #define PACKAGE_BUGREPORT "warren.dukes@gmail.com"
| #define PACKAGE "mpd"
| #define VERSION "0.14.0"
| /* end confdefs.h.  */
| #include <stdarg.h>
| #include <stdio.h>
| #include <sys/types.h>
| #include <sys/stat.h>
| /* Most of the following tests are stolen from RCS 5.7's src/conf.sh.  */
| struct buf { int x; };
| FILE * (*rcsopen) (struct buf *, struct stat *, int);
| static char *e (p, i)
|      char **p;
|      int i;
| {
|   return p[i];
| }
| static char *f (char * (*g) (char **, int), char **p, ...)
| {
|   char *s;
|   va_list v;
|   va_start (v,p);
|   s = g (p, va_arg (v,int));
|   va_end (v);
|   return s;
| }
| 
| /* OSF 4.0 Compaq cc is some sort of almost-ANSI by default.  It has
|    function prototypes and stuff, but not '\xHH' hex character constants.
|    These don't provoke an error unfortunately, instead are silently treated
|    as 'x'.  The following induces an error, until -std is added to get
|    proper ANSI mode.  Curiously '\x00'!='x' always comes out true, for an
|    array size at least.  It's necessary to write '\x00'==0 to get something
|    that's true only with -std.  */
| int osf4_cc_array ['\x00' == 0 ? 1 : -1];
| 
| /* IBM C 6 for AIX is almost-ANSI by default, but it replaces macro parameters
|    inside strings and character constants.  */
| #define FOO(x) 'x'
| int xlc6_cc_array[FOO(a) == 'x' ? 1 : -1];
| 
| int test (int i, double x);
| struct s1 {int (*f) (int a);};
| struct s2 {int (*f) (double a);};
| int pairnames (int, char **, FILE *(*)(struct buf *, struct stat *, int), int, int);
| int argc;
| char **argv;
| int
| main ()
| {
| return f (e, argv, 0) != argv[0]  ||  f (e, argv, 1) != argv[1];
|   ;
|   return 0;
| }
configure:3438: result: unsupported
configure:3464: checking for style of include used by make
configure:3492: result: GNU
configure:3520: checking dependency style of gcc
configure:3610: result: gcc3
configure:3628: checking whether gcc and cc understand -c and -o together
configure:3663: gcc -c conftest.c -o conftest2.o >&5
configure:3666: $? = 0
configure:3672: gcc -c conftest.c -o conftest2.o >&5
configure:3675: $? = 0
configure:3686: cc -c conftest.c >&5
configure:3689: $? = 0
configure:3697: cc -c conftest.c -o conftest2.o >&5
configure:3700: $? = 0
configure:3706: cc -c conftest.c -o conftest2.o >&5
configure:3709: $? = 0
configure:3727: result: yes
configure:3765: checking for a BSD-compatible install
configure:3821: result: /usr/bin/install -c
configure:3910: checking build system type
configure:3928: result: i686-pc-linux-gnu
configure:3950: checking host system type
configure:3965: result: i686-pc-linux-gnu
configure:3987: checking for a sed that does not truncate output
configure:4041: result: /bin/sed
configure:4044: checking for grep that handles long lines and -e
configure:4118: result: /bin/grep
configure:4123: checking for egrep
configure:4201: result: /bin/grep -E
configure:4217: checking for ld used by gcc
configure:4284: result: /bin/ld
configure:4293: checking if the linker (/bin/ld) is GNU ld
configure:4308: result: yes
configure:4313: checking for /bin/ld option to reload object files
configure:4320: result: -r
configure:4338: checking for BSD-compatible nm
configure:4387: result: nm
configure:4391: checking whether ln -s works
configure:4395: result: yes
configure:4402: checking how to recognise dependent libraries
configure:4578: result: pass_all
configure:4812: checking how to run the C preprocessor
configure:4852: gcc -E  conftest.c
configure:4858: $? = 0
configure:4889: gcc -E  conftest.c
conftest.c:10:28: error: ac_nonexistent.h: No such file or directory
configure:4895: $? = 1
configure: failed program was:
| /* confdefs.h.  */
| #define PACKAGE_NAME "mpd"
| #define PACKAGE_TARNAME "mpd"
| #define PACKAGE_VERSION "0.14.0"
| #define PACKAGE_STRING "mpd 0.14.0"
| #define PACKAGE_BUGREPORT "warren.dukes@gmail.com"
| #define PACKAGE "mpd"
| #define VERSION "0.14.0"
| /* end confdefs.h.  */
| #include <ac_nonexistent.h>
configure:4928: result: gcc -E
configure:4957: gcc -E  conftest.c
configure:4963: $? = 0
configure:4994: gcc -E  conftest.c
conftest.c:10:28: error: ac_nonexistent.h: No such file or directory
configure:5000: $? = 1
configure: failed program was:
| /* confdefs.h.  */
| #define PACKAGE_NAME "mpd"
| #define PACKAGE_TARNAME "mpd"
| #define PACKAGE_VERSION "0.14.0"
| #define PACKAGE_STRING "mpd 0.14.0"
| #define PACKAGE_BUGREPORT "warren.dukes@gmail.com"
| #define PACKAGE "mpd"
| #define VERSION "0.14.0"
| /* end confdefs.h.  */
| #include <ac_nonexistent.h>
configure:5038: checking for ANSI C header files
configure:5068: gcc -c -g -O2  conftest.c >&5
configure:5074: $? = 0
configure:5173: gcc -o conftest -g -O2   conftest.c  >&5
configure:5176: $? = 0
configure:5182: ./conftest
configure:5185: $? = 0
configure:5202: result: yes
configure:5226: checking for sys/types.h
configure:5247: gcc -c -g -O2  conftest.c >&5
configure:5253: $? = 0
configure:5269: result: yes
configure:5226: checking for sys/stat.h
configure:5247: gcc -c -g -O2  conftest.c >&5
configure:5253: $? = 0
configure:5269: result: yes
configure:5226: checking for stdlib.h
configure:5247: gcc -c -g -O2  conftest.c >&5
configure:5253: $? = 0
configure:5269: result: yes
configure:5226: checking for string.h
configure:5247: gcc -c -g -O2  conftest.c >&5
configure:5253: $? = 0
configure:5269: result: yes
configure:5226: checking for memory.h
configure:5247: gcc -c -g -O2  conftest.c >&5
configure:5253: $? = 0
configure:5269: result: yes
configure:5226: checking for strings.h
configure:5247: gcc -c -g -O2  conftest.c >&5
configure:5253: $? = 0
configure:5269: result: yes
configure:5226: checking for inttypes.h
configure:5247: gcc -c -g -O2  conftest.c >&5
configure:5253: $? = 0
configure:5269: result: yes
configure:5226: checking for stdint.h
configure:5247: gcc -c -g -O2  conftest.c >&5
configure:5253: $? = 0
configure:5269: result: yes
configure:5226: checking for unistd.h
configure:5247: gcc -c -g -O2  conftest.c >&5
configure:5253: $? = 0
configure:5269: result: yes
configure:5296: checking dlfcn.h usability
configure:5313: gcc -c -g -O2  conftest.c >&5
configure:5319: $? = 0
configure:5333: result: yes
configure:5337: checking dlfcn.h presence
configure:5352: gcc -E  conftest.c
configure:5358: $? = 0
configure:5372: result: yes
configure:5405: checking for dlfcn.h
configure:5413: result: yes
configure:5484: checking for g++
configure:5500: found /usr/bin/g++
configure:5511: result: g++
configure:5542: checking for C++ compiler version
configure:5549: g++ --version >&5
g++ (GCC) 4.1.2 (Ubuntu 4.1.2-0ubuntu4)
Copyright (C) 2006 Free Software Foundation, Inc.
This is free software; see the source for copying conditions.  There is NO
warranty; not even for MERCHANTABILITY or FITNESS FOR A PARTICULAR PURPOSE.

configure:5552: $? = 0
configure:5559: g++ -v >&5
Using built-in specs.
Target: i486-linux-gnu
Configured with: ../src/configure -v --enable-languages=c,c++,fortran,objc,obj-c++,treelang --prefix=/usr --enable-shared --with-system-zlib --libexecdir=/usr/lib --without-included-gettext --enable-threads=posix --enable-nls --program-suffix=-4.1 --enable-__cxa_atexit --enable-clocale=gnu --enable-libstdcxx-debug --enable-mpfr --enable-checking=release i486-linux-gnu
Thread model: posix
gcc version 4.1.2 (Ubuntu 4.1.2-0ubuntu4)
configure:5562: $? = 0
configure:5569: g++ -V >&5
g++: '-V' option must have argument
configure:5572: $? = 1
configure:5575: checking whether we are using the GNU C++ compiler
configure:5604: g++ -c   conftest.cpp >&5
configure:5610: $? = 0
configure:5627: result: yes
configure:5632: checking whether g++ accepts -g
configure:5662: g++ -c -g  conftest.cpp >&5
configure:5668: $? = 0
configure:5767: result: yes
configure:5792: checking dependency style of g++
configure:5882: result: gcc3
configure:5909: checking how to run the C++ preprocessor
configure:5945: g++ -E  conftest.cpp
configure:5951: $? = 0
configure:5982: g++ -E  conftest.cpp
conftest.cpp:21:28: error: ac_nonexistent.h: No such file or directory
configure:5988: $? = 1
configure: failed program was:
| /* confdefs.h.  */
| #define PACKAGE_NAME "mpd"
| #define PACKAGE_TARNAME "mpd"
| #define PACKAGE_VERSION "0.14.0"
| #define PACKAGE_STRING "mpd 0.14.0"
| #define PACKAGE_BUGREPORT "warren.dukes@gmail.com"
| #define PACKAGE "mpd"
| #define VERSION "0.14.0"
| #define STDC_HEADERS 1
| #define HAVE_SYS_TYPES_H 1
| #define HAVE_SYS_STAT_H 1
| #define HAVE_STDLIB_H 1
| #define HAVE_STRING_H 1
| #define HAVE_MEMORY_H 1
| #define HAVE_STRINGS_H 1
| #define HAVE_INTTYPES_H 1
| #define HAVE_STDINT_H 1
| #define HAVE_UNISTD_H 1
| #define HAVE_DLFCN_H 1
| /* end confdefs.h.  */
| #include <ac_nonexistent.h>
configure:6021: result: g++ -E
configure:6050: g++ -E  conftest.cpp
configure:6056: $? = 0
configure:6087: g++ -E  conftest.cpp
conftest.cpp:21:28: error: ac_nonexistent.h: No such file or directory
configure:6093: $? = 1
configure: failed program was:
| /* confdefs.h.  */
| #define PACKAGE_NAME "mpd"
| #define PACKAGE_TARNAME "mpd"
| #define PACKAGE_VERSION "0.14.0"
| #define PACKAGE_STRING "mpd 0.14.0"
| #define PACKAGE_BUGREPORT "warren.dukes@gmail.com"
| #define PACKAGE "mpd"
| #define VERSION "0.14.0"
| #define STDC_HEADERS 1
| #define HAVE_SYS_TYPES_H 1
| #define HAVE_SYS_STAT_H 1
| #define HAVE_STDLIB_H 1
| #define HAVE_STRING_H 1
| #define HAVE_MEMORY_H 1
| #define HAVE_STRINGS_H 1
| #define HAVE_INTTYPES_H 1
| #define HAVE_STDINT_H 1
| #define HAVE_UNISTD_H 1
| #define HAVE_DLFCN_H 1
| /* end confdefs.h.  */
| #include <ac_nonexistent.h>
configure:6186: checking for g77
configure:6216: result: no
configure:6186: checking for xlf
configure:6216: result: no
configure:6186: checking for f77
configure:6216: result: no
configure:6186: checking for frt
configure:6216: result: no
configure:6186: checking for pgf77
configure:6216: result: no
configure:6186: checking for cf77
configure:6216: result: no
configure:6186: checking for fort77
configure:6216: result: no
configure:6186: checking for fl32
configure:6216: result: no
configure:6186: checking for af77
configure:6216: result: no
configure:6186: checking for xlf90
configure:6216: result: no
configure:6186: checking for f90
configure:6216: result: no
configure:6186: checking for pgf90
configure:6216: result: no
configure:6186: checking for pghpf
configure:6216: result: no
configure:6186: checking for epcf90
configure:6216: result: no
configure:6186: checking for gfortran
configure:6216: result: no
configure:6186: checking for g95
configure:6216: result: no
configure:6186: checking for xlf95
configure:6216: result: no
configure:6186: checking for f95
configure:6216: result: no
configure:6186: checking for fort
configure:6216: result: no
configure:6186: checking for ifort
configure:6216: result: no
configure:6186: checking for ifc
configure:6216: result: no
configure:6186: checking for efc
configure:6216: result: no
configure:6186: checking for pgf95
configure:6216: result: no
configure:6186: checking for lf95
configure:6216: result: no
configure:6186: checking for ftn
configure:6216: result: no
configure:6243: checking for Fortran 77 compiler version
configure:6250:  --version >&5
./configure: line 6251: --version: command not found
configure:6253: $? = 127
configure:6260:  -v >&5
./configure: line 6261: -v: command not found
configure:6263: $? = 127
configure:6270:  -V >&5
./configure: line 6271: -V: command not found
configure:6273: $? = 127
configure:6281: checking whether we are using the GNU Fortran 77 compiler
configure:6300:  -c  conftest.F >&5
./configure: line 6301: -c: command not found
configure:6306: $? = 127
configure: failed program was:
|       program main
| #ifndef __GNUC__
|        choke me
| #endif
| 
|       end
configure:6323: result: no
configure:6329: checking whether  accepts -g
configure:6346:  -c -g conftest.f >&5
./configure: line 6347: -c: command not found
configure:6352: $? = 127
configure: failed program was:
|       program main
| 
|       end
configure:6368: result: no
configure:6398: checking the maximum length of command line arguments
configure:6507: result: 32768
configure:6518: checking command to parse nm output from gcc object
configure:6623: gcc -c -g -O2  conftest.c >&5
configure:6626: $? = 0
configure:6630: nm conftest.o \| sed -n -e 's/^.*[ 	]\([BCDEGRST][BCDEGRST]*\)[ 	][ 	]*\([_A-Za-z][_A-Za-z0-9]*\)$/\1 \2 \2/p' \> conftest.nm
./configure: line 6631: nm: command not found
configure:6633: $? = 0
cannot run sed -n -e 's/^.*[ 	]\([BCDEGRST][BCDEGRST]*\)[ 	][ 	]*\([_A-Za-z][_A-Za-z0-9]*\)$/\1 \2 \2/p'
configure:6623: gcc -c -g -O2  conftest.c >&5
configure:6626: $? = 0
configure:6630: nm conftest.o \| sed -n -e 's/^.*[ 	]\([BCDEGRST][BCDEGRST]*\)[ 	][ 	]*_\([_A-Za-z][_A-Za-z0-9]*\)$/\1 _\2 \2/p' \> conftest.nm
./configure: line 6631: nm: command not found
configure:6633: $? = 0
cannot run sed -n -e 's/^.*[ 	]\([BCDEGRST][BCDEGRST]*\)[ 	][ 	]*_\([_A-Za-z][_A-Za-z0-9]*\)$/\1 _\2 \2/p'
configure:6723: result: failed
configure:6730: checking for objdir
configure:6745: result: .libs
configure:6837: checking for ar
configure:6853: found /usr/bin/ar
configure:6864: result: ar
configure:6933: checking for ranlib
configure:6949: found /usr/bin/ranlib
configure:6960: result: ranlib
configure:7029: checking for strip
configure:7059: result: no
configure:7342: checking if gcc supports -fno-rtti -fno-exceptions
configure:7360: gcc -c -g -O2  -fno-rtti -fno-exceptions conftest.c >&5
configure:7364: $? = 0
configure:7377: result: yes
configure:7392: checking for gcc option to produce PIC
configure:7602: result: -fPIC
configure:7610: checking if gcc PIC flag -fPIC works
configure:7628: gcc -c -g -O2  -fPIC -DPIC conftest.c >&5
configure:7632: $? = 0
configure:7645: result: yes
configure:7673: checking if gcc static flag -static works
configure:7701: result: yes
configure:7711: checking if gcc supports -c -o file.o
configure:7732: gcc -c -g -O2  -o out/conftest2.o conftest.c >&5
configure:7736: $? = 0
configure:7758: result: yes
configure:7784: checking whether the gcc linker (/bin/ld) supports shared libraries
configure:8739: result: yes
configure:8760: checking whether -lc should be explicitly linked in
configure:8765: gcc -c -g -O2  conftest.c >&5
configure:8768: $? = 0
configure:8783: gcc -shared conftest.o  -v -Wl,-soname -Wl,conftest -o conftest 2\>\&1 \| grep  -lc  \>/dev/null 2\>\&1
configure:8786: $? = 0
configure:8798: result: no
configure:8806: checking dynamic linker characteristics
configure:9382: result: GNU/Linux ld.so
configure:9391: checking how to hardcode library paths into programs
configure:9416: result: immediate
configure:9430: checking whether stripping libraries is possible
configure:9451: result: no
configure:10236: checking if libtool supports shared libraries
configure:10238: result: yes
configure:10241: checking whether to build shared libraries
configure:10262: result: yes
configure:10265: checking whether to build static libraries
configure:10269: result: yes
configure:10361: creating libtool
configure:10949: checking for ld used by g++
configure:11016: result: /bin/ld
configure:11025: checking if the linker (/bin/ld) is GNU ld
configure:11040: result: yes
configure:11091: checking whether the g++ linker (/bin/ld) supports shared libraries
configure:12025: result: yes
configure:12043: g++ -c -g -O2  conftest.cpp >&5
configure:12046: $? = 0
configure:12165: checking for g++ option to produce PIC
configure:12439: result: -fPIC
configure:12447: checking if g++ PIC flag -fPIC works
configure:12465: g++ -c -g -O2  -fPIC -DPIC conftest.cpp >&5
configure:12469: $? = 0
configure:12482: result: yes
configure:12510: checking if g++ static flag -static works
configure:12538: result: yes
configure:12548: checking if g++ supports -c -o file.o
configure:12569: g++ -c -g -O2  -o out/conftest2.o conftest.cpp >&5
configure:12573: $? = 0
configure:12595: result: yes
configure:12621: checking whether the g++ linker (/bin/ld) supports shared libraries
configure:12649: result: yes
configure:12716: checking dynamic linker characteristics
configure:13292: result: GNU/Linux ld.so
configure:13301: checking how to hardcode library paths into programs
configure:13326: result: immediate
configure:19444: checking whether make sets $(MAKE)
configure:19465: result: yes
configure:19829: checking whether byte ordering is bigendian
configure:19862: gcc -c -g -O2  conftest.c >&5
configure:19868: $? = 0
configure:19900: gcc -c -g -O2  conftest.c >&5
conftest.c: In function 'int main()':
conftest.c:29: error: 'big' was not declared in this scope
conftest.c:29: error: expected `;' before 'endian'
configure:19906: $? = 1
configure: failed program was:
| /* confdefs.h.  */
| #define PACKAGE_NAME "mpd"
| #define PACKAGE_TARNAME "mpd"
| #define PACKAGE_VERSION "0.14.0"
| #define PACKAGE_STRING "mpd 0.14.0"
| #define PACKAGE_BUGREPORT "warren.dukes@gmail.com"
| #define PACKAGE "mpd"
| #define VERSION "0.14.0"
| #define STDC_HEADERS 1
| #define HAVE_SYS_TYPES_H 1
| #define HAVE_SYS_STAT_H 1
| #define HAVE_STDLIB_H 1
| #define HAVE_STRING_H 1
| #define HAVE_MEMORY_H 1
| #define HAVE_STRINGS_H 1
| #define HAVE_INTTYPES_H 1
| #define HAVE_STDINT_H 1
| #define HAVE_UNISTD_H 1
| #define HAVE_DLFCN_H 1
| #define PROTOCOL_VERSION "0.14.0"
| /* end confdefs.h.  */
| #include <sys/types.h>
| #include <sys/param.h>
| 
| int
| main ()
| {
| #if BYTE_ORDER != BIG_ENDIAN
|  not big endian
| #endif
| 
|   ;
|   return 0;
| }
configure:20046: result: no
configure:20066: checking for short
configure:20096: gcc -c -g -O2  conftest.c >&5
configure:20102: $? = 0
configure:20117: result: yes
configure:20124: checking size of short
configure:20426: gcc -o conftest -g -O2   conftest.c  >&5
/tmp/ccq55ZHT.o:(.eh_frame+0x11): undefined reference to `__gxx_personality_v0'
collect2: ld returned 1 exit status
configure:20429: $? = 1
configure: program exited with status 1
configure: failed program was:
| /* confdefs.h.  */
| #define PACKAGE_NAME "mpd"
| #define PACKAGE_TARNAME "mpd"
| #define PACKAGE_VERSION "0.14.0"
| #define PACKAGE_STRING "mpd 0.14.0"
| #define PACKAGE_BUGREPORT "warren.dukes@gmail.com"
| #define PACKAGE "mpd"
| #define VERSION "0.14.0"
| #define STDC_HEADERS 1
| #define HAVE_SYS_TYPES_H 1
| #define HAVE_SYS_STAT_H 1
| #define HAVE_STDLIB_H 1
| #define HAVE_STRING_H 1
| #define HAVE_MEMORY_H 1
| #define HAVE_STRINGS_H 1
| #define HAVE_INTTYPES_H 1
| #define HAVE_STDINT_H 1
| #define HAVE_UNISTD_H 1
| #define HAVE_DLFCN_H 1
| #define PROTOCOL_VERSION "0.14.0"
| /* end confdefs.h.  */
| #include <stdio.h>
| #ifdef HAVE_SYS_TYPES_H
| # include <sys/types.h>
| #endif
| #ifdef HAVE_SYS_STAT_H
| # include <sys/stat.h>
| #endif
| #ifdef STDC_HEADERS
| # include <stdlib.h>
| # include <stddef.h>
| #else
| # ifdef HAVE_STDLIB_H
| #  include <stdlib.h>
| # endif
| #endif
| #ifdef HAVE_STRING_H
| # if !defined STDC_HEADERS && defined HAVE_MEMORY_H
| #  include <memory.h>
| # endif
| # include <string.h>
| #endif
| #ifdef HAVE_STRINGS_H
| # include <strings.h>
| #endif
| #ifdef HAVE_INTTYPES_H
| # include <inttypes.h>
| #endif
| #ifdef HAVE_STDINT_H
| # include <stdint.h>
| #endif
| #ifdef HAVE_UNISTD_H
| # include <unistd.h>
| #endif
|    typedef short ac__type_sizeof_;
| static long int longval () { return (long int) (sizeof (ac__type_sizeof_)); }
| static unsigned long int ulongval () { return (long int) (sizeof (ac__type_sizeof_)); }
| #include <stdio.h>
| #include <stdlib.h>
| int
| main ()
| {
| 
|   FILE *f = fopen ("conftest.val", "w");
|   if (! f)
|     return 1;
|   if (((long int) (sizeof (ac__type_sizeof_))) < 0)
|     {
|       long int i = longval ();
|       if (i != ((long int) (sizeof (ac__type_sizeof_))))
| 	return 1;
|       fprintf (f, "%ld\n", i);
|     }
|   else
|     {
|       unsigned long int i = ulongval ();
|       if (i != ((long int) (sizeof (ac__type_sizeof_))))
| 	return 1;
|       fprintf (f, "%lu\n", i);
|     }
|   return ferror (f) || fclose (f) != 0;
| 
|   ;
|   return 0;
| }
configure:20449: error: cannot compute sizeof (short)
See `config.log' for more details.

## ---------------- ##
## Cache variables. ##
## ---------------- ##

ac_cv_build=i686-pc-linux-gnu
ac_cv_c_bigendian=no
ac_cv_c_compiler_gnu=yes
ac_cv_cxx_compiler_gnu=yes
ac_cv_env_AVAHI_CFLAGS_set=
ac_cv_env_AVAHI_CFLAGS_value=
ac_cv_env_AVAHI_LIBS_set=
ac_cv_env_AVAHI_LIBS_value=
ac_cv_env_CCC_set=
ac_cv_env_CCC_value=
ac_cv_env_CC_set=
ac_cv_env_CC_value=
ac_cv_env_CFLAGS_set=
ac_cv_env_CFLAGS_value=
ac_cv_env_CPPFLAGS_set=
ac_cv_env_CPPFLAGS_value=
ac_cv_env_CPP_set=
ac_cv_env_CPP_value=
ac_cv_env_CXXCPP_set=
ac_cv_env_CXXCPP_value=
ac_cv_env_CXXFLAGS_set=
ac_cv_env_CXXFLAGS_value=
ac_cv_env_CXX_set=
ac_cv_env_CXX_value=
ac_cv_env_F77_set=
ac_cv_env_F77_value=
ac_cv_env_FFLAGS_set=
ac_cv_env_FFLAGS_value=
ac_cv_env_JACK_CFLAGS_set=
ac_cv_env_JACK_CFLAGS_value=
ac_cv_env_JACK_LIBS_set=
ac_cv_env_JACK_LIBS_value=
ac_cv_env_LDFLAGS_set=
ac_cv_env_LDFLAGS_value=
ac_cv_env_LIBS_set=
ac_cv_env_LIBS_value=
ac_cv_env_PKG_CONFIG_set=
ac_cv_env_PKG_CONFIG_value=
ac_cv_env_PULSE_CFLAGS_set=
ac_cv_env_PULSE_CFLAGS_value=
ac_cv_env_PULSE_LIBS_set=
ac_cv_env_PULSE_LIBS_value=
ac_cv_env_SAMPLERATE_CFLAGS_set=
ac_cv_env_SAMPLERATE_CFLAGS_value=
ac_cv_env_SAMPLERATE_LIBS_set=
ac_cv_env_SAMPLERATE_LIBS_value=
ac_cv_env_WAVPACK_CFLAGS_set=
ac_cv_env_WAVPACK_CFLAGS_value=
ac_cv_env_WAVPACK_LIBS_set=
ac_cv_env_WAVPACK_LIBS_value=
ac_cv_env_build_alias_set=
ac_cv_env_build_alias_value=
ac_cv_env_host_alias_set=
ac_cv_env_host_alias_value=
ac_cv_env_target_alias_set=
ac_cv_env_target_alias_value=
ac_cv_f77_compiler_gnu=no
ac_cv_header_dlfcn_h=yes
ac_cv_header_inttypes_h=yes
ac_cv_header_memory_h=yes
ac_cv_header_stdc=yes
ac_cv_header_stdint_h=yes
ac_cv_header_stdlib_h=yes
ac_cv_header_string_h=yes
ac_cv_header_strings_h=yes
ac_cv_header_sys_stat_h=yes
ac_cv_header_sys_types_h=yes
ac_cv_header_unistd_h=yes
ac_cv_host=i686-pc-linux-gnu
ac_cv_objext=o
ac_cv_path_EGREP='/bin/grep -E'
ac_cv_path_GREP=/bin/grep
ac_cv_path_install='/usr/bin/install -c'
ac_cv_prog_AWK=mawk
ac_cv_prog_CPP='gcc -E'
ac_cv_prog_CXXCPP='g++ -E'
ac_cv_prog_ac_ct_AR=ar
ac_cv_prog_ac_ct_CC=gcc
ac_cv_prog_ac_ct_CXX=g++
ac_cv_prog_ac_ct_RANLIB=ranlib
ac_cv_prog_cc_c89=no
ac_cv_prog_cc_g=yes
ac_cv_prog_cc_gcc_c_o=yes
ac_cv_prog_cxx_g=yes
ac_cv_prog_f77_g=no
ac_cv_prog_make_make_set=yes
ac_cv_type_short=yes
am_cv_CC_dependencies_compiler_type=gcc3
am_cv_CXX_dependencies_compiler_type=gcc3
lt_cv_deplibs_check_method=pass_all
lt_cv_file_magic_cmd='$MAGIC_CMD'
lt_cv_file_magic_test_file=
lt_cv_ld_reload_flag=-r
lt_cv_objdir=.libs
lt_cv_path_LD=/bin/ld
lt_cv_path_LDCXX=/bin/ld
lt_cv_path_NM=nm
lt_cv_path_SED=/bin/sed
lt_cv_prog_compiler_c_o=yes
lt_cv_prog_compiler_c_o_CXX=yes
lt_cv_prog_compiler_rtti_exceptions=yes
lt_cv_prog_gnu_ld=yes
lt_cv_prog_gnu_ldcxx=yes
lt_cv_sys_global_symbol_pipe=
lt_cv_sys_global_symbol_to_c_name_address='sed -n -e '\''s/^: \([^ ]*\) $/  {\"\1\", (lt_ptr) 0},/p'\'' -e '\''s/^[BCDEGRST] \([^ ]*\) \([^ ]*\)$/  {"\2", (lt_ptr) \&\2},/p'\'''
lt_cv_sys_global_symbol_to_cdecl=
lt_cv_sys_max_cmd_len=32768
lt_lt_cv_prog_compiler_c_o='"yes"'
lt_lt_cv_prog_compiler_c_o_CXX='"yes"'
lt_lt_cv_sys_global_symbol_pipe='""'
lt_lt_cv_sys_global_symbol_to_c_name_address='"sed -n -e '\''s/^: \\([^ ]*\\) \$/  {\\\"\\1\\\", (lt_ptr) 0},/p'\'' -e '\''s/^[BCDEGRST] \\([^ ]*\\) \\([^ ]*\\)\$/  {\"\\2\", (lt_ptr) \\&\\2},/p'\''"'
lt_lt_cv_sys_global_symbol_to_cdecl='""'

## ----------------- ##
## Output variables. ##
## ----------------- ##

ACLOCAL='${SHELL} /home/yzinch/Music/mpd/missing --run aclocal-1.9'
ALSA_CFLAGS=''
ALSA_LIBS=''
AMDEPBACKSLASH='\'
AMDEP_FALSE='#'
AMDEP_TRUE=''
AMTAR='${SHELL} /home/yzinch/Music/mpd/missing --run tar'
AO_CFLAGS=''
AO_LIBS=''
AR='ar'
AUDIOFILE_CFLAGS=''
AUDIOFILE_CONFIG=''
AUDIOFILE_LIBS=''
AUTOCONF='${SHELL} /home/yzinch/Music/mpd/missing --run autoconf'
AUTOHEADER='${SHELL} /home/yzinch/Music/mpd/missing --run autoheader'
AUTOMAKE='${SHELL} /home/yzinch/Music/mpd/missing --run automake-1.9'
AVAHI_CFLAGS=''
AVAHI_LIBS=''
AWK='mawk'
CC='gcc'
CCDEPMODE='depmode=gcc3'
CFLAGS='-g -O2'
CPP='gcc -E'
CPPFLAGS=''
CXX='g++'
CXXCPP='g++ -E'
CXXDEPMODE='depmode=gcc3'
CXXFLAGS='-g -O2'
CYGPATH_W='echo'
DEFS=''
DEPDIR='.deps'
ECHO='echo'
ECHO_C=''
ECHO_N='-n'
ECHO_T=''
EGREP='/bin/grep -E'
EXEEXT=''
F77=''
FFLAGS=''
GREP='/bin/grep'
INSTALL_DATA='${INSTALL} -m 644'
INSTALL_PROGRAM='${INSTALL}'
INSTALL_SCRIPT='${INSTALL}'
INSTALL_STRIP_PROGRAM='${SHELL} $(install_sh) -c -s'
JACK_CFLAGS=''
JACK_LIBS=''
LDFLAGS=''
LIBFLAC_CFLAGS=''
LIBFLAC_LIBS=''
LIBMIKMOD_CFLAGS=''
LIBMIKMOD_CONFIG=''
LIBMIKMOD_LDADD=''
LIBMIKMOD_LIBS=''
LIBOBJS=''
LIBOGGFLAC_CFLAGS=''
LIBOGGFLAC_LIBS=''
LIBS=''
LIBTOOL='$(SHELL) $(top_builddir)/libtool'
LN_S='ln -s'
LTLIBOBJS=''
MAKEINFO='${SHELL} /home/yzinch/Music/mpd/missing --run makeinfo'
MP4FF_LIB=''
MP4FF_SUBDIR=''
MPD_CFLAGS='-Wall -Wmissing-prototypes'
MPD_LIBS=''
OBJEXT='o'
OGG_CFLAGS=''
OGG_LIBS=''
PACKAGE='mpd'
PACKAGE_BUGREPORT='warren.dukes@gmail.com'
PACKAGE_NAME='mpd'
PACKAGE_STRING='mpd 0.14.0'
PACKAGE_TARNAME='mpd'
PACKAGE_VERSION='0.14.0'
PATH_SEPARATOR=':'
PKGCONFIG=''
PKG_CONFIG=''
PULSE_CFLAGS=''
PULSE_LIBS=''
RANLIB='ranlib'
SAMPLERATE_CFLAGS=''
SAMPLERATE_LIBS=''
SET_MAKE=''
SHELL='/bin/bash'
SHOUTCONFIG=''
STRIP=':'
VERSION='0.14.0'
VORBISENC_LIBS=''
VORBISFILE_LIBS=''
VORBIS_CFLAGS=''
VORBIS_LIBS=''
WAVPACK_CFLAGS=''
WAVPACK_LIBS=''
ac_ct_CC='gcc'
ac_ct_CXX='g++'
ac_ct_F77=''
am__fastdepCC_FALSE='#'
am__fastdepCC_TRUE=''
am__fastdepCXX_FALSE='#'
am__fastdepCXX_TRUE=''
am__include='include'
am__leading_dot='.'
am__quote=''
am__tar='${AMTAR} chof - "$$tardir"'
am__untar='${AMTAR} xf -'
bindir='${exec_prefix}/bin'
build='i686-pc-linux-gnu'
build_alias=''
build_cpu='i686'
build_os='linux-gnu'
build_vendor='pc'
datadir='${datarootdir}'
datarootdir='${prefix}/share'
docdir='${datarootdir}/doc/${PACKAGE_TARNAME}'
dvidir='${docdir}'
exec_prefix='NONE'
host='i686-pc-linux-gnu'
host_alias=''
host_cpu='i686'
host_os='linux-gnu'
host_vendor='pc'
htmldir='${docdir}'
includedir='${prefix}/include'
infodir='${datarootdir}/info'
install_sh='/home/yzinch/Music/mpd/install-sh'
libdir='${exec_prefix}/lib'
libexecdir='${exec_prefix}/libexec'
localedir='${datarootdir}/locale'
localstatedir='${prefix}/var'
mandir='${datarootdir}/man'
mkdir_p='mkdir -p --'
oldincludedir='/usr/include'
pdfdir='${docdir}'
prefix='NONE'
program_transform_name='s,x,x,'
psdir='${docdir}'
sbindir='${exec_prefix}/sbin'
sharedstatedir='${prefix}/com'
sysconfdir='${prefix}/etc'
target_alias=''

## ----------- ##
## confdefs.h. ##
## ----------- ##

#define PACKAGE_NAME "mpd"
#define PACKAGE_TARNAME "mpd"
#define PACKAGE_VERSION "0.14.0"
#define PACKAGE_STRING "mpd 0.14.0"
#define PACKAGE_BUGREPORT "warren.dukes@gmail.com"
#define PACKAGE "mpd"
#define VERSION "0.14.0"
#define STDC_HEADERS 1
#define HAVE_SYS_TYPES_H 1
#define HAVE_SYS_STAT_H 1
#define HAVE_STDLIB_H 1
#define HAVE_STRING_H 1
#define HAVE_MEMORY_H 1
#define HAVE_STRINGS_H 1
#define HAVE_INTTYPES_H 1
#define HAVE_STDINT_H 1
#define HAVE_UNISTD_H 1
#define HAVE_DLFCN_H 1
#define PROTOCOL_VERSION "0.14.0"

configure: exit 77