All pastes #621120 Raw Edit

Something

public text v1 · immutable
·published 2007-07-15 23:07 UTC
rendered paste body
NOTE: Handling BitBake files: \ (4650/4650) [100 %]
NOTE: Parsing finished. 4429 cached, 0 parsed, 221 skipped, 0 masked.
NOTE: build 200707160109: started

OE Build Configuration:
BB_VERSION     = "1.8.5"
OE_REVISION    = "d982229f54ad86fa9296acab3704fc829cd11592"
TARGET_ARCH    = "arm"
TARGET_OS      = "linux-gnueabi"
MACHINE        = "a780"
DISTRO         = "angstrom"
DISTRO_VERSION = "test-20070715"
TARGET_FPU     = "soft"

NOTE: Resolving missing task queue dependencies
NOTE: preferred version 2.5 of glibc not available (for item virtual/arm-angstrom-linux-gnueabi-libc-for-gcc)
NOTE: Preparing runqueue
NOTE: Executing runqueue
NOTE: Running task 208 of 294 (ID: 163, /stuff/org.openembedded.dev/packages/qemu/qemu-native_cvs.bb, do_compile)
NOTE: package qemu-native-0.8.2+cvs20060723: started
NOTE: package qemu-native-0.8.2+cvs20060723-r1: task do_compile: started
ERROR: function do_compile failed
ERROR: log data follows (/home/james/oe/tmp/work/i686-linux/qemu-native-0.8.2+cvs20060723-r1/temp/log.do_compile.27138)
| NOTE: make -j 2
| make -C i386-user all
| make[1]: Entering directory `/home/james/oe/tmp/work/i686-linux/qemu-native-0.8.2+cvs20060723-r1/qemu/i386-user'
| ../dyngen -c -o opc.h op.o
| ../dyngen -g -o gen-op.h op.o
| dyngen: Stack clobbered in op_exit_tb
| dyngen: Stack clobbered in op_exit_tb
| make[1]: *** [opc.h] Error 1
| make[1]: *** Waiting for unfinished jobs....
| make[1]: *** [gen-op.h] Error 1
| make[1]: Leaving directory `/home/james/oe/tmp/work/i686-linux/qemu-native-0.8.2+cvs20060723-r1/qemu/i386-user'
| make -C arm-user all
| make: *** [subdir-i386-user] Error 2
| make: *** Waiting for unfinished jobs....
| make[1]: Entering directory `/home/james/oe/tmp/work/i686-linux/qemu-native-0.8.2+cvs20060723-r1/qemu/arm-user'
| ../dyngen -o op.h op.o
| dyngen: unsupported i386 relocation (10)
| make[1]: *** [op.h] Error 1
| make[1]: Leaving directory `/home/james/oe/tmp/work/i686-linux/qemu-native-0.8.2+cvs20060723-r1/qemu/arm-user'
| make: *** [subdir-arm-user] Error 2
| FATAL: oe_runmake failed
NOTE: Task failed: /home/james/oe/tmp/work/i686-linux/qemu-native-0.8.2+cvs20060723-r1/temp/log.do_compile.27138
NOTE: package qemu-native-0.8.2+cvs20060723-r1: task do_compile: failed
ERROR: TaskFailed event exception, aborting
NOTE: package qemu-native-0.8.2+cvs20060723: failed
ERROR: Build of /stuff/org.openembedded.dev/packages/qemu/qemu-native_cvs.bb do_compile failed
ERROR: Task 163 (/stuff/org.openembedded.dev/packages/qemu/qemu-native_cvs.bb, do_compile) failed
NOTE: Tasks Summary: Attempted 207 tasks of which 207 didn't need to be rerun and 1 failed.
ERROR: '/stuff/org.openembedded.dev/packages/qemu/qemu-native_cvs.bb' failed