All pastes #620806 Raw Edit

Anonym

public text v1 · immutable
·published 2007-07-15 19:21 UTC
rendered paste body
/Users/snake/Desktop/Riven X Projekt/rivenx Kopie/plistize_stacks.m:2:26: error: MHKKit/MHKKit.h: No such file or directory
/Users/snake/Desktop/Riven X Projekt/rivenx Kopie/plistize_stacks.m:125: error: parse error before '*' token
/Users/snake/Desktop/Riven X Projekt/rivenx Kopie/plistize_stacks.m: In function 'loadNAMEResourceWithID':
/Users/snake/Desktop/Riven X Projekt/rivenx Kopie/plistize_stacks.m:126: error: 'archive' undeclared (first use in this function)
/Users/snake/Desktop/Riven X Projekt/rivenx Kopie/plistize_stacks.m:126: error: (Each undeclared identifier is reported only once
/Users/snake/Desktop/Riven X Projekt/rivenx Kopie/plistize_stacks.m:126: error: for each function it appears in.)
/Users/snake/Desktop/Riven X Projekt/rivenx Kopie/plistize_stacks.m:126: error: parse error before 'ID'
/Users/snake/Desktop/Riven X Projekt/rivenx Kopie/plistize_stacks.m: In function 'main':
/Users/snake/Desktop/Riven X Projekt/rivenx Kopie/plistize_stacks.m:176: error: 'MHKArchive' undeclared (first use in this function)
/Users/snake/Desktop/Riven X Projekt/rivenx Kopie/plistize_stacks.m:176: error: 'archive' undeclared (first use in this function)
/Users/snake/Desktop/Riven X Projekt/rivenx Kopie/plistize_stacks.m:186: error: 'masterArchive' undeclared (first use in this function)
		/Users/snake/Desktop/Riven X Projekt/rivenx Kopie/plistize_stacks.m:2:26: error: MHKKit/MHKKit.h: No such file or directory
		/Users/snake/Desktop/Riven X Projekt/rivenx Kopie/plistize_stacks.m:125: error: parse error before '*' token
		/Users/snake/Desktop/Riven X Projekt/rivenx Kopie/plistize_stacks.m:126: error: 'archive' undeclared (first use in this function)
		/Users/snake/Desktop/Riven X Projekt/rivenx Kopie/plistize_stacks.m:126: error: parse error before 'ID'
		/Users/snake/Desktop/Riven X Projekt/rivenx Kopie/plistize_stacks.m:176: error: 'MHKArchive' undeclared (first use in this function)
		/Users/snake/Desktop/Riven X Projekt/rivenx Kopie/plistize_stacks.m:176: error: 'archive' undeclared (first use in this function)
		/Users/snake/Desktop/Riven X Projekt/rivenx Kopie/plistize_stacks.m:186: error: 'masterArchive' undeclared (first use in this function)
Build failed (7 errors)