All pastes #620558 Raw Edit

Anonymous

public text v1 · immutable
·published 2007-07-15 15:57 UTC
rendered paste body
launcher-plugin.c: In function 'launcher_plugin_unload':
launcher-plugin.c:376: error: 'KibaLauncherIcon' has no member named 'active_handle'
launcher-plugin.c:380: error: 'KibaLauncherIcon' has no member named 'inactive_handle'
make[3]: *** [launcher-plugin.lo] Error 1
make[3]: *** Waiting for unfinished jobs....
launcher.c: In function 'kiba_launcher_load_icons':
launcher.c:390: error: 'KibaLauncherIcon' has no member named 'active_handle'
launcher.c:392: error: 'KibaLauncherIcon' has no member named 'inactive_handle'
launcher.c: In function 'kiba_launcher_set_icon_surface':
launcher.c:416: error: 'KibaLauncherIcon' has no member named 'active_handle'
launcher.c:418: error: 'KibaLauncherIcon' has no member named 'inactive_handle'
launcher.c: In function 'launcher_create_nautilus_desktop_file':
launcher.c:648: error: 'GETTEXT_PACKAGE' undeclared (first use in this function)
launcher.c:648: error: (Each undeclared identifier is reported only once
launcher.c:648: error: for each function it appears in.)
launcher.c: In function 'kiba_object_button_press_cb':
launcher.c:791: error: 'GETTEXT_PACKAGE' undeclared (first use in this function)
make[3]: *** [launcher.lo] Error 1
make[2]: *** [all] Error 2
make[1]: *** [all-recursive] Error 1
make: *** [all] Error 2

!!! ERROR in gnome-extra/kiba-plugins-9999:
!!! In gnome2_src_compile at line 2930
!!! compile failure