r/lib64/dbus-1.0/include -g -O2 -fPIC -MT bmp2_bin-ui-part-playlist.o -MD -MP -MF .deps/bmp2_bin-ui-part-playlist.Tpo -c -o bmp2_bin-ui-part-playlist.o `test -f 'ui-part-playlist.cc' || echo './'`ui-part-playlist.cc
ui-part-playlist.cc: In constructor ‘Bmp::PlaylistList::PlaylistList(GtkTreeView*, const Glib::RefPtr<Gnome::Glade::Xml>&)’:
ui-part-playlist.cc:341: error: class ‘Bmp::PlaylistList’ does not have any field named ‘m_bmpx_track_id’
ui-part-playlist.cc: In member function ‘void Bmp::PlaylistList::put_track_at_iter(const Bmp::Track&, Gtk::TreeIter&)’:
ui-part-playlist.cc:486: error: ‘m_bmpx_track_id’ was not declared in this scope
ui-part-playlist.cc: In member function ‘void Bmp::PlaylistList::assign_current_iter(const Gtk::TreeIter&)’:
ui-part-playlist.cc:1066: error: ‘m_bmpx_track_id’ was not declared in this scope
make[4]: *** [bmp2_bin-ui-part-playlist.o] Error 1
make[4]: Leaving directory `/home/pete/local-programs/program/bmpx/src'
make[3]: *** [all-recursive] Error 1
make[3]: Leaving directory `/home/pete/local-programs/program/bmpx/src'
make[2]: *** [all] Error 2
make[2]: Leaving directory `/home/pete/local-programs/program/bmpx/src'
make[1]: *** [all-recursive] Error 1
make[1]: Leaving directory `/home/pete/local-programs/program/bmpx'
make: *** [all] Error 2