All pastes #619440 Raw Edit

Someone

public text v1 · immutable
·published 2007-07-14 19:08 UTC
rendered paste body
ant clean.db.schema
Buildfile: build.xml
Overriding previous definition of reference to patch.classpath

_check.svn.project:

_init.skip.svn.update:

_init.svn:

_init:

svn.get.revision:
      [svn] Using javahl
Svn : Status
     [echo] project subversion rev is

_build.prepare.etc:
     [copy] Copying 68 files to /home/ldsjohn/xplanner/xplanner/build/classes/product
     [copy] Copying 1 file to /home/ldsjohn/xplanner/xplanner/war/WEB-INF
     [copy] Copying 1 file to /home/ldsjohn/xplanner/xplanner/war/WEB-INF/classes

compile.reports:

build.product:
     [copy] Copying 514 files to /home/ldsjohn/xplanner/xplanner/build/classes/product

clean.db.schema:

BUILD FAILED
/home/ldsjohn/xplanner/xplanner/build-db.xml:64: com.mysql.jdbc.CommunicationsException: Communications link failure due to underlying exception:

** BEGIN NESTED EXCEPTION **

java.net.SocketException
MESSAGE: java.net.ConnectException: Connection refused

STACKTRACE:

java.net.SocketException: java.net.ConnectException: Connection refused
        at com.mysql.jdbc.StandardSocketFactory.connect(StandardSocketFactory.java:156)
        at com.mysql.jdbc.MysqlIO.<init>(MysqlIO.java:277)
        at com.mysql.jdbc.Connection.createNewIO(Connection.java:2668)
        at com.mysql.jdbc.Connection.<init>(Connection.java:1531)
        at com.mysql.jdbc.NonRegisteringDriver.connect(NonRegisteringDriver.java:266)
        at org.apache.tools.ant.taskdefs.JDBCTask.getConnection(JDBCTask.java:304)
        at org.apache.tools.ant.taskdefs.SQLExec.execute(SQLExec.java:346)
        at org.apache.tools.ant.UnknownElement.execute(UnknownElement.java:275)
        at org.apache.tools.ant.Task.perform(Task.java:364)
        at org.apache.tools.ant.Target.execute(Target.java:341)
        at org.apache.tools.ant.Target.performTasks(Target.java:369)
        at org.apache.tools.ant.Project.executeSortedTargets(Project.java:1216)
        at org.apache.tools.ant.Project.executeTarget(Project.java:1185)
        at org.apache.tools.ant.helper.DefaultExecutor.executeTargets(DefaultExecutor.java:40)
        at org.apache.tools.ant.Project.executeTargets(Project.java:1068)
        at org.apache.tools.ant.Main.runBuild(Main.java:668)
        at org.apache.tools.ant.Main.startAnt(Main.java:187)
        at org.apache.tools.ant.launch.Launcher.run(Launcher.java:246)
        at org.apache.tools.ant.launch.Launcher.main(Launcher.java:67)


** END NESTED EXCEPTION **



Last packet sent to the server was 14 ms ago.

Total time: 3 seconds