All pastes #619045 Raw Edit

Anonymous

public text v1 · immutable
·published 2007-07-14 12:14 UTC
rendered paste body
--------- Error log - file /home/SuNn/.WineCVS/sources/cvscedega/ErrorLog : ---------
./ppl.l:1337: attention : implicit declaration of function ‘max’
./ppl.l:1337: erreur: ‘ALLOCBLOCKSIZE’ undeclared (first use in this function)
./ppl.l: Hors de toute fonction :
./ppl.l:1346: attention : conflicting types for ‘macro_add_arg’
./ppl.l:1346: erreur: static declaration of ‘macro_add_arg’ follows non-static declaration
./ppl.l:493: erreur: previous implicit declaration of ‘macro_add_arg’ was here
./ppl.l: In function ‘macro_add_arg’:
./ppl.l:1349: erreur: ‘macexpstackentry_t’ undeclared (first use in this function)
./ppl.l:1349: erreur: ‘mep’ undeclared (first use in this function)
./ppl.l:1368: erreur: ‘debuglevel’ undeclared (first use in this function)
./ppl.l:1368: erreur: ‘DEBUGLEVEL_PPLEX’ undeclared (first use in this function)
./ppl.l:1370: erreur: ‘input_name’ undeclared (first use in this function)
./ppl.l:1371: erreur: ‘line_number’ undeclared (first use in this function)
./ppl.l:1378: erreur: ‘pp_macexp’ undeclared (first use in this function)
./ppl.l:1379: attention : implicit declaration of function ‘push_buffer’
./ppl.l: In function ‘macro_add_expansion’:
./ppl.l:1387: erreur: ‘macexpstackentry_t’ undeclared (first use in this function)
./ppl.l:1387: erreur: ‘mep’ undeclared (first use in this function)
./ppl.l:1396: erreur: ‘debuglevel’ undeclared (first use in this function)
./ppl.l:1396: erreur: ‘DEBUGLEVEL_PPLEX’ undeclared (first use in this function)
./ppl.l:1398: erreur: ‘input_name’ undeclared (first use in this function)
./ppl.l:1399: erreur: ‘line_number’ undeclared (first use in this function)
./ppl.l: Hors de toute fonction :
./ppl.l:1411: attention : conflicting types for ‘put_buffer’
./ppl.l:1411: erreur: static declaration of ‘put_buffer’ follows non-static declaration
./ppl.l:476: erreur: previous implicit declaration of ‘put_buffer’ was here
./ppl.l: In function ‘put_buffer’:
./ppl.l:1415: erreur: ‘pass_data’ undeclared (first use in this function)
./ppl.l: In function ‘do_include’:
./ppl.l:1439: erreur: ‘includelogicentry_t’ undeclared (first use in this function)
./ppl.l:1439: erreur: ‘iep’ undeclared (first use in this function)
./ppl.l:1441: erreur: ‘includelogiclist’ undeclared (first use in this function)
./ppl.l:1462: attention : implicit declaration of function ‘open_include’
./ppl.l:1462: attention : assignment makes pointer from integer without a cast
./ppl.l:1467: erreur: ‘seen_junk’ undeclared (first use in this function)
./ppl.l:1468: erreur: ‘include_state’ undeclared (first use in this function)
./ppl.l:1469: erreur: ‘include_ppp’ undeclared (first use in this function)
./ppl.l:1470: erreur: ‘pass_data’ undeclared (first use in this function)
./ppl.l:1473: erreur: ‘debuglevel’ undeclared (first use in this function)
./ppl.l:1473: erreur: ‘DEBUGLEVEL_PPMSG’ undeclared (first use in this function)
./ppl.l:1474: erreur: ‘input_name’ undeclared (first use in this function)
./ppl.l:1474: erreur: ‘line_number’ undeclared (first use in this function)
./ppl.l:1474: erreur: ‘include_ifdepth’ undeclared (first use in this function)
./ppl.l: In function ‘push_ignore_state’:
./ppl.l:1488: erreur: ‘pp_ignore’ undeclared (first use in this function)
make[2]: *** [lex.ppl.o] Erreur 1
make[2]: quittant le répertoire « /home/SuNn/.WineCVS/sources/cvscedega/winex/tools/wrc »
make[1]: *** [wrc] Erreur 2
make[1]: quittant le répertoire « /home/SuNn/.WineCVS/sources/cvscedega/winex/tools »
make: *** [tools] Erreur 2


Error in Make

Try fixing the error based on the output above, and
run the script again, without paramaters (Eg: WineCVS.sh)