All pastes #617643 Raw Edit

posixTraceCompileError

public text v1 · immutable
·published 2007-07-13 12:00 UTC
rendered paste body
make[1]: Entering directory `/usr/src/rtlinux-3.2-pre3/posixtrace'
*************** COMPILING POSIX TRACING LIBRARY **************
gcc -c -o posix_trace_tmp.o -I../include posix_trace.c
In file included from posix_trace.c:41:
../include/posix/trace/comm.h:77: parse error before "trace_event_id_t"
../include/posix/trace/comm.h:77: warning: no semicolon at end of struct or union
../include/posix/trace/comm.h:77: warning: no semicolon at end of struct or union
../include/posix/trace/comm.h:79: `TRACE_EVENT_NAME_MAX' undeclared here (not in a function)
../include/posix/trace/comm.h:82: parse error before "trace_event_id_t"
../include/posix/trace/comm.h:82: warning: no semicolon at end of struct or union
../include/posix/trace/comm.h:83: `MAX_FIFO_DATA_SIZE' undeclared here (not in a function)
../include/posix/trace/comm.h:86: parse error before '}' token
../include/posix/trace/comm.h:86: warning: data definition has no type or storage class
../include/posix/trace/comm.h:87: parse error before '}' token
../include/posix/trace/comm.h:87: warning: data definition has no type or storage class
../include/posix/trace/comm.h:89: parse error before '}' token
../include/posix/trace/comm.h:89: warning: data definition has no type or storage class
../include/posix/trace/comm.h:98: parse error before "posix_trace_event_info"
../include/posix/trace/comm.h:98: warning: no semicolon at end of struct or union
../include/posix/trace/comm.h:98: warning: no semicolon at end of struct or union
../include/posix/trace/comm.h:99: `MAX_FIFO_DATA_SIZE' undeclared here (not in a function)
../include/posix/trace/comm.h:106: parse error before "trace_event_id_t"
../include/posix/trace/comm.h:106: warning: no semicolon at end of struct or union
../include/posix/trace/comm.h:108: `TRACE_EVENT_NAME_MAX' undeclared here (not in a function)
../include/posix/trace/comm.h:109: parse error before '}' token
../include/posix/trace/comm.h:109: warning: data definition has no type or storage class
../include/posix/trace/comm.h:111: parse error before "attr"
../include/posix/trace/comm.h:111: warning: data definition has no type or storage class
../include/posix/trace/comm.h:113: parse error before "status"
../include/posix/trace/comm.h:113: warning: data definition has no type or storage class
../include/posix/trace/comm.h:115: conflicting types for `data'
../include/posix/trace/comm.h:83: previous declaration of `data'
../include/posix/trace/comm.h:115: warning: data definition has no type or storage class
../include/posix/trace/comm.h:116: parse error before '}' token
../include/posix/trace/comm.h:116: warning: data definition has no type or storage class
../include/posix/trace/comm.h:79: storage size of `eventname' isn't known
../include/posix/trace/comm.h:108: storage size of `name' isn't known
make[1]: *** [posix_trace.o] Error 1
make[1]: Leaving directory `/usr/src/rtlinux-3.2-pre3/posixtrace'
make: *** metrics: No such file or directory.  Stop.
make[1]: Entering directory `/usr/src/rtlinux-3.2-pre3/regression'
make[1]: Nothing to be done for `all'.
make[1]: Leaving directory `/usr/src/rtlinux-3.2-pre3/regression'
 
make[1]: Entering directory `/usr/src/rtlinux-3.2-pre3/drivers/mbuff'
do 'make tests' to build all mbuff demo programs.
make[1]: Leaving directory `/usr/src/rtlinux-3.2-pre3/drivers/mbuff'
 
make[1]: Entering directory `/usr/src/rtlinux-3.2-pre3/examples/frank'
make[1]: Nothing to be done for `all'.
make[1]: Leaving directory `/usr/src/rtlinux-3.2-pre3/examples/frank'
make[1]: Entering directory `/usr/src/rtlinux-3.2-pre3/examples/measurements'
make[1]: Nothing to be done for `all'.
make[1]: Leaving directory `/usr/src/rtlinux-3.2-pre3/examples/measurements'
make[1]: Entering directory `/usr/src/rtlinux-3.2-pre3/examples/hello'
gcc -D__KERNEL__ -Wall -Wstrict-prototypes -Wno-trigraphs -fno-strict-aliasing -fno-common -pipe
-mpreferred-stack-boundary=2 -march=i686 -DMODULE -DMODVERSIONS -include /usr/src/rtlinux-3.2-pre3/linux-2.4.22/include/linux/modversions.h -g -D__RTL__ -D_LOOSE_KERNEL_NAMES -O2 -I/usr/src/rtlinux-3.2-pre3/linux/include -I/usr/src/rtlinux-3.2-pre3/include -I/usr/src/rtlinux-3.2-pre3/include/compat -I/usr/src/rtlinux-3.2-pre3/include/posix   -c -o kled.o kled.c
kled.c: In function `my_timer_func':
kled.c:49: structure has no member named `vc_tty'
kled.c:52: `jiffies_R0da02d67' undeclared (first use in this function)
kled.c:52: (Each undeclared identifier is reported only once
kled.c:52: for each function it appears in.)
kled.c: In function `kbleds_init':
kled.c:67: structure has no member named `vc_tty'
kled.c:71: structure has no member named `vc_tty'
kled.c:80: `jiffies_R0da02d67' undeclared (first use in this function)
kled.c: In function `kbleds_cleanup':
kled.c:90: structure has no member named `vc_tty'
make[1]: *** [kled.o] Error 1
make[1]: Leaving directory `/usr/src/rtlinux-3.2-pre3/examples/hello'
make[1]: Entering directory `/usr/src/rtlinux-3.2-pre3/examples/hello_dev_mem'
make[1]: Nothing to be done for `all'.
make[1]: Leaving directory `/usr/src/rtlinux-3.2-pre3/examples/hello_dev_mem'
make[1]: Entering directory `/usr/src/rtlinux-3.2-pre3/examples/mutex'
make[1]: *** No rule to make target `mutex_timed.o', needed by `all'.  Stop.
make[1]: Leaving directory `/usr/src/rtlinux-3.2-pre3/examples/mutex'
make[1]: Entering directory `/usr/src/rtlinux-3.2-pre3/examples/misc'
make[1]: Nothing to be done for `all'.
make[1]: Leaving directory `/usr/src/rtlinux-3.2-pre3/examples/misc'
make[1]: Entering directory `/usr/src/rtlinux-3.2-pre3/examples/parallel'
make[1]: Nothing to be done for `all'.
make[1]: Leaving directory `/usr/src/rtlinux-3.2-pre3/examples/parallel'
make[1]: Entering directory `/usr/src/rtlinux-3.2-pre3/examples/kernel_resources'
make[1]: Nothing to be done for `all'.
make[1]: Leaving directory `/usr/src/rtlinux-3.2-pre3/examples/kernel_resources'
make[1]: Entering directory `/usr/src/rtlinux-3.2-pre3/examples/large_mem'
make[1]: Nothing to be done for `all'.
make[1]: Leaving directory `/usr/src/rtlinux-3.2-pre3/examples/large_mem'
make[1]: Entering directory `/usr/src/rtlinux-3.2-pre3/examples/pwm'
make[1]: Nothing to be done for `all'.
make[1]: Leaving directory `/usr/src/rtlinux-3.2-pre3/examples/pwm'
make[1]: Entering directory `/usr/src/rtlinux-3.2-pre3/examples/fifos'
make[1]: Nothing to be done for `all'.
make[1]: Leaving directory `/usr/src/rtlinux-3.2-pre3/examples/fifos'
make[1]: Entering directory `/usr/src/rtlinux-3.2-pre3/examples/hello_mbuff'
make[1]: Nothing to be done for `all'.
make[1]: Leaving directory `/usr/src/rtlinux-3.2-pre3/examples/hello_mbuff'
make[1]: Entering directory `/usr/src/rtlinux-3.2-pre3/examples/proc'
make[1]: Nothing to be done for `all'.
make[1]: Leaving directory `/usr/src/rtlinux-3.2-pre3/examples/proc'
make[1]: Entering directory `/usr/src/rtlinux-3.2-pre3/examples/posixtrace/system-online'
make[1]: *** No targets specified and no makefile found.  Stop.
make[1]: Leaving directory `/usr/src/rtlinux-3.2-pre3/examples/posixtrace/system-online'
make: *** examples/posixtrace/user-online-filter: No such file or directory.  Stop.
make: *** examples/posixtrace/system-log: No such file or directory.  Stop.
make: *** examples/posixtrace/user-log-rtl: No such file or directory.  Stop.
make: *** [examples] Error 2
[root@localhost rtlinux-3.2-pre3]#