All pastes #617474 Raw Edit

Untitled

public text v1 · immutable
·published 2007-07-13 08:32 UTC
rendered paste body
| if ccache gcc -DHAVE_CONFIG_H -DLIBDIR=\"/home/moko/build/tmp/staging/i686-linux/lib\" -I. -I/home/moko/build/tmp/work/i686-linux/coreutils-native-5.3.0-r1/coreutils-5.3.0/lib -I..  -I.. -I/home/moko/build/tmp/work/i686-linux/coreutils-native-5.3.0-r1/coreutils-5.3.0/lib -isystem/home/moko/build/tmp/staging/i686-linux/include  -isystem/home/moko/build/tmp/staging/i686-linux/include -O2 -MT utimecmp.o -MD -MP -MF ".deps/utimecmp.Tpo" -c -o utimecmp.o utimecmp.c; \
|       then mv -f ".deps/utimecmp.Tpo" ".deps/utimecmp.Po"; else rm -f ".deps/utimecmp.Tpo"; exit 1; fi
| In file included from utimecmp.c:40:
| utimens.h:2: error: conflicting types for 'futimens'
| /usr/include/sys/stat.h:370: error: previous declaration of 'futimens' was here
| make[4]: *** [utimecmp.o] Error 1
| make[4]: Leaving directory `/home/moko/build/tmp/work/i686-linux/coreutils-native-5.3.0-r1/coreutils-5.3.0/lib'
| make[3]: *** [all] Error 2
| make[3]: Leaving directory `/home/moko/build/tmp/work/i686-linux/coreutils-native-5.3.0-r1/coreutils-5.3.0/lib'
| make[2]: *** [all-recursive] Error 1
| make[2]: Leaving directory `/home/moko/build/tmp/work/i686-linux/coreutils-native-5.3.0-r1/coreutils-5.3.0'
| make[1]: *** [all] Error 2
| make[1]: Leaving directory `/home/moko/build/tmp/work/i686-linux/coreutils-native-5.3.0-r1/coreutils-5.3.0'
| FATAL: oe_runmake failed
NOTE: Task failed: /home/moko/build/tmp/work/i686-linux/coreutils-native-5.3.0-r1/temp/log.do_compile.16665
NOTE: package coreutils-native-5.3.0-r1: task do_compile: failed
ERROR: TaskFailed event exception, aborting
NOTE: package coreutils-native-5.3.0: failed
ERROR: Build of openmoko-devel-image failed
make: *** [openmoko-devel-image] Error 1