All pastes #617300 Raw Edit

Tyler

public text v1 · immutable
·published 2007-07-13 04:29 UTC
rendered paste body
This file contains any messages produced by compilers while
running configure, to aid debugging if configure makes a mistake.

It was created by TiLP2 configure 1.04, which was
generated by GNU Autoconf 2.59.  Invocation command line was

  $ ./configure --prefix=/usr --libdir=/usr/lib64 --mandir=/usr/share/man --disable-nls

## --------- ##
## Platform. ##
## --------- ##

hostname = joe
uname -m = x86_64
uname -r = 2.6.18-8.1.6.el5
uname -s = Linux
uname -v = #1 SMP Thu Jun 14 17:29:04 EDT 2007

/usr/bin/uname -p = unknown
/bin/uname -X     = unknown

/bin/arch              = x86_64
/usr/bin/arch -k       = unknown
/usr/convex/getsysinfo = unknown
hostinfo               = unknown
/bin/machine           = unknown
/usr/bin/oslevel       = unknown
/bin/universe          = unknown

PATH: /usr/lib64/qt-3.3/bin
PATH: /usr/kerberos/bin
PATH: /usr/local/bin
PATH: /usr/bin
PATH: /bin
PATH: /usr/X11R6/bin
PATH: /usr/local/tigcc/bin
PATH: /home/tyler/bin
PATH: /usr/local/tigcc/bin


## ----------- ##
## Core tests. ##
## ----------- ##

configure:1666: checking for a BSD-compatible install
configure:1721: result: /usr/bin/install -c
configure:1736: checking for -p flag to install
configure:1749: result: yes
configure:1760: checking whether build environment is sane
configure:1803: result: yes
configure:1868: checking for gawk
configure:1884: found /usr/bin/gawk
configure:1894: result: gawk
configure:1904: checking whether make sets $(MAKE)
configure:1924: result: yes
configure:2092: checking whether to enable maintainer-specific portions of Makefiles
configure:2101: result: no
configure:2126: checking for something to drink while compiling
configure:2128: result: err: no fridge found!
configure:2213: checking build system type
configure:2231: result: x86_64-unknown-linux-gnu
configure:2239: checking host system type
configure:2253: result: x86_64-unknown-linux-gnu
configure:2273: checking for style of include used by make
configure:2301: result: GNU
configure:2372: checking for gcc
configure:2388: found /usr/bin/gcc
configure:2398: result: gcc
configure:2642: checking for C compiler version
configure:2645: gcc --version </dev/null >&5
gcc (GCC) 4.1.1 20070105 (Red Hat 4.1.1-52)
Copyright (C) 2006 Free Software Foundation, Inc.
This is free software; see the source for copying conditions.  There is NO
warranty; not even for MERCHANTABILITY or FITNESS FOR A PARTICULAR PURPOSE.

configure:2648: $? = 0
configure:2650: gcc -v </dev/null >&5
Using built-in specs.
Target: x86_64-redhat-linux
Configured with: ../configure --prefix=/usr --mandir=/usr/share/man --infodir=/usr/share/info --enable-shared --enable-threads=posix --enable-checking=release --with-system-zlib --enable-__cxa_atexit --disable-libunwind-exceptions --enable-libgcj-multifile --enable-languages=c,c++,objc,obj-c++,java,fortran,ada --enable-java-awt=gtk --disable-dssi --enable-plugin --with-java-home=/usr/lib/jvm/java-1.4.2-gcj-1.4.2.0/jre --with-cpu=generic --host=x86_64-redhat-linux
Thread model: posix
gcc version 4.1.1 20070105 (Red Hat 4.1.1-52)
configure:2653: $? = 0
configure:2655: gcc -V </dev/null >&5
gcc: '-V' option must have argument
configure:2658: $? = 1
configure:2681: checking for C compiler default output file name
configure:2684: gcc -O2 -g -pipe -Wall -Wp,-D_FORTIFY_SOURCE=2 -fexceptions -fstack-protector --param=ssp-buffer-size=4 -m64 -mtune=generic   conftest.c  >&5
configure:2687: $? = 0
configure:2733: result: a.out
configure:2738: checking whether the C compiler works
configure:2744: ./a.out
configure:2747: $? = 0
configure:2764: result: yes
configure:2771: checking whether we are cross compiling
configure:2773: result: no
configure:2776: checking for suffix of executables
configure:2778: gcc -o conftest -O2 -g -pipe -Wall -Wp,-D_FORTIFY_SOURCE=2 -fexceptions -fstack-protector --param=ssp-buffer-size=4 -m64 -mtune=generic   conftest.c  >&5
configure:2781: $? = 0
configure:2806: result: 
configure:2812: checking for suffix of object files
configure:2833: gcc -c -O2 -g -pipe -Wall -Wp,-D_FORTIFY_SOURCE=2 -fexceptions -fstack-protector --param=ssp-buffer-size=4 -m64 -mtune=generic  conftest.c >&5
configure:2836: $? = 0
configure:2858: result: o
configure:2862: checking whether we are using the GNU C compiler
configure:2886: gcc -c -O2 -g -pipe -Wall -Wp,-D_FORTIFY_SOURCE=2 -fexceptions -fstack-protector --param=ssp-buffer-size=4 -m64 -mtune=generic  conftest.c >&5
configure:2892: $? = 0
configure:2896: test -z 
			 || test ! -s conftest.err
configure:2899: $? = 0
configure:2902: test -s conftest.o
configure:2905: $? = 0
configure:2918: result: yes
configure:2924: checking whether gcc accepts -g
configure:2945: gcc -c -g  conftest.c >&5
configure:2951: $? = 0
configure:2955: test -z 
			 || test ! -s conftest.err
configure:2958: $? = 0
configure:2961: test -s conftest.o
configure:2964: $? = 0
configure:2975: result: yes
configure:2992: checking for gcc option to accept ANSI C
configure:3062: gcc  -c -O2 -g -pipe -Wall -Wp,-D_FORTIFY_SOURCE=2 -fexceptions -fstack-protector --param=ssp-buffer-size=4 -m64 -mtune=generic  conftest.c >&5
configure:3068: $? = 0
configure:3072: test -z 
			 || test ! -s conftest.err
configure:3075: $? = 0
configure:3078: test -s conftest.o
configure:3081: $? = 0
configure:3099: result: none needed
configure:3117: gcc -c -O2 -g -pipe -Wall -Wp,-D_FORTIFY_SOURCE=2 -fexceptions -fstack-protector --param=ssp-buffer-size=4 -m64 -mtune=generic  conftest.c >&5
conftest.c:2: error: expected '=', ',', ';', 'asm' or '__attribute__' before 'me'
configure:3123: $? = 1
configure: failed program was:
| #ifndef __cplusplus
|   choke me
| #endif
configure:3258: checking dependency style of gcc
configure:3348: result: gcc3
configure:3365: checking for a sed that does not truncate output
configure:3421: result: /bin/sed
configure:3424: checking for egrep
configure:3434: result: grep -E
configure:3450: checking for ld used by gcc
configure:3517: result: /usr/bin/ld
configure:3526: checking if the linker (/usr/bin/ld) is GNU ld
configure:3541: result: yes
configure:3546: checking for /usr/bin/ld option to reload object files
configure:3553: result: -r
configure:3571: checking for BSD-compatible nm
configure:3620: result: /usr/bin/nm -B
configure:3624: checking whether ln -s works
configure:3628: result: yes
configure:3635: checking how to recognise dependent libraries
configure:3811: result: pass_all
configure:3899: gcc -c -O2 -g -pipe -Wall -Wp,-D_FORTIFY_SOURCE=2 -fexceptions -fstack-protector --param=ssp-buffer-size=4 -m64 -mtune=generic  conftest.c >&5
configure:3902: $? = 0
configure:4290: checking how to run the C preprocessor
configure:4325: gcc -E  conftest.c
configure:4331: $? = 0
configure:4363: gcc -E  conftest.c
conftest.c:11:28: error: ac_nonexistent.h: No such file or directory
configure:4369: $? = 1
configure: failed program was:
| /* confdefs.h.  */
| 
| #define PACKAGE_NAME "TiLP2"
| #define PACKAGE_TARNAME "tilp2"
| #define PACKAGE_VERSION "1.04"
| #define PACKAGE_STRING "TiLP2 1.04"
| #define PACKAGE_BUGREPORT "tilp-users@lists.sourceforge.net"
| #define PACKAGE "tilp2"
| #define VERSION "1.04"
| /* end confdefs.h.  */
| #include <ac_nonexistent.h>
configure:4408: result: gcc -E
configure:4432: gcc -E  conftest.c
configure:4438: $? = 0
configure:4470: gcc -E  conftest.c
conftest.c:11:28: error: ac_nonexistent.h: No such file or directory
configure:4476: $? = 1
configure: failed program was:
| /* confdefs.h.  */
| 
| #define PACKAGE_NAME "TiLP2"
| #define PACKAGE_TARNAME "tilp2"
| #define PACKAGE_VERSION "1.04"
| #define PACKAGE_STRING "TiLP2 1.04"
| #define PACKAGE_BUGREPORT "tilp-users@lists.sourceforge.net"
| #define PACKAGE "tilp2"
| #define VERSION "1.04"
| /* end confdefs.h.  */
| #include <ac_nonexistent.h>
configure:4520: checking for ANSI C header files
configure:4545: gcc -c -O2 -g -pipe -Wall -Wp,-D_FORTIFY_SOURCE=2 -fexceptions -fstack-protector --param=ssp-buffer-size=4 -m64 -mtune=generic  conftest.c >&5
configure:4551: $? = 0
configure:4555: test -z 
			 || test ! -s conftest.err
configure:4558: $? = 0
configure:4561: test -s conftest.o
configure:4564: $? = 0
configure:4653: gcc -o conftest -O2 -g -pipe -Wall -Wp,-D_FORTIFY_SOURCE=2 -fexceptions -fstack-protector --param=ssp-buffer-size=4 -m64 -mtune=generic   conftest.c  >&5
conftest.c: In function 'main':
conftest.c:28: warning: implicit declaration of function 'exit'
conftest.c:28: warning: incompatible implicit declaration of built-in function 'exit'
configure:4656: $? = 0
configure:4658: ./conftest
configure:4661: $? = 0
configure:4676: result: yes
configure:4700: checking for sys/types.h
configure:4716: gcc -c -O2 -g -pipe -Wall -Wp,-D_FORTIFY_SOURCE=2 -fexceptions -fstack-protector --param=ssp-buffer-size=4 -m64 -mtune=generic  conftest.c >&5
configure:4722: $? = 0
configure:4726: test -z 
			 || test ! -s conftest.err
configure:4729: $? = 0
configure:4732: test -s conftest.o
configure:4735: $? = 0
configure:4746: result: yes
configure:4700: checking for sys/stat.h
configure:4716: gcc -c -O2 -g -pipe -Wall -Wp,-D_FORTIFY_SOURCE=2 -fexceptions -fstack-protector --param=ssp-buffer-size=4 -m64 -mtune=generic  conftest.c >&5
configure:4722: $? = 0
configure:4726: test -z 
			 || test ! -s conftest.err
configure:4729: $? = 0
configure:4732: test -s conftest.o
configure:4735: $? = 0
configure:4746: result: yes
configure:4700: checking for stdlib.h
configure:4716: gcc -c -O2 -g -pipe -Wall -Wp,-D_FORTIFY_SOURCE=2 -fexceptions -fstack-protector --param=ssp-buffer-size=4 -m64 -mtune=generic  conftest.c >&5
configure:4722: $? = 0
configure:4726: test -z 
			 || test ! -s conftest.err
configure:4729: $? = 0
configure:4732: test -s conftest.o
configure:4735: $? = 0
configure:4746: result: yes
configure:4700: checking for string.h
configure:4716: gcc -c -O2 -g -pipe -Wall -Wp,-D_FORTIFY_SOURCE=2 -fexceptions -fstack-protector --param=ssp-buffer-size=4 -m64 -mtune=generic  conftest.c >&5
configure:4722: $? = 0
configure:4726: test -z 
			 || test ! -s conftest.err
configure:4729: $? = 0
configure:4732: test -s conftest.o
configure:4735: $? = 0
configure:4746: result: yes
configure:4700: checking for memory.h
configure:4716: gcc -c -O2 -g -pipe -Wall -Wp,-D_FORTIFY_SOURCE=2 -fexceptions -fstack-protector --param=ssp-buffer-size=4 -m64 -mtune=generic  conftest.c >&5
configure:4722: $? = 0
configure:4726: test -z 
			 || test ! -s conftest.err
configure:4729: $? = 0
configure:4732: test -s conftest.o
configure:4735: $? = 0
configure:4746: result: yes
configure:4700: checking for strings.h
configure:4716: gcc -c -O2 -g -pipe -Wall -Wp,-D_FORTIFY_SOURCE=2 -fexceptions -fstack-protector --param=ssp-buffer-size=4 -m64 -mtune=generic  conftest.c >&5
configure:4722: $? = 0
configure:4726: test -z 
			 || test ! -s conftest.err
configure:4729: $? = 0
configure:4732: test -s conftest.o
configure:4735: $? = 0
configure:4746: result: yes
configure:4700: checking for inttypes.h
configure:4716: gcc -c -O2 -g -pipe -Wall -Wp,-D_FORTIFY_SOURCE=2 -fexceptions -fstack-protector --param=ssp-buffer-size=4 -m64 -mtune=generic  conftest.c >&5
configure:4722: $? = 0
configure:4726: test -z 
			 || test ! -s conftest.err
configure:4729: $? = 0
configure:4732: test -s conftest.o
configure:4735: $? = 0
configure:4746: result: yes
configure:4700: checking for stdint.h
configure:4716: gcc -c -O2 -g -pipe -Wall -Wp,-D_FORTIFY_SOURCE=2 -fexceptions -fstack-protector --param=ssp-buffer-size=4 -m64 -mtune=generic  conftest.c >&5
configure:4722: $? = 0
configure:4726: test -z 
			 || test ! -s conftest.err
configure:4729: $? = 0
configure:4732: test -s conftest.o
configure:4735: $? = 0
configure:4746: result: yes
configure:4700: checking for unistd.h
configure:4716: gcc -c -O2 -g -pipe -Wall -Wp,-D_FORTIFY_SOURCE=2 -fexceptions -fstack-protector --param=ssp-buffer-size=4 -m64 -mtune=generic  conftest.c >&5
configure:4722: $? = 0
configure:4726: test -z 
			 || test ! -s conftest.err
configure:4729: $? = 0
configure:4732: test -s conftest.o
configure:4735: $? = 0
configure:4746: result: yes
configure:4772: checking dlfcn.h usability
configure:4784: gcc -c -O2 -g -pipe -Wall -Wp,-D_FORTIFY_SOURCE=2 -fexceptions -fstack-protector --param=ssp-buffer-size=4 -m64 -mtune=generic  conftest.c >&5
configure:4790: $? = 0
configure:4794: test -z 
			 || test ! -s conftest.err
configure:4797: $? = 0
configure:4800: test -s conftest.o
configure:4803: $? = 0
configure:4813: result: yes
configure:4817: checking dlfcn.h presence
configure:4827: gcc -E  conftest.c
configure:4833: $? = 0
configure:4853: result: yes
configure:4888: checking for dlfcn.h
configure:4895: result: yes
configure:4960: checking for g++
configure:4976: found /usr/bin/g++
configure:4986: result: g++
configure:5002: checking for C++ compiler version
configure:5005: g++ --version </dev/null >&5
g++ (GCC) 4.1.1 20070105 (Red Hat 4.1.1-52)
Copyright (C) 2006 Free Software Foundation, Inc.
This is free software; see the source for copying conditions.  There is NO
warranty; not even for MERCHANTABILITY or FITNESS FOR A PARTICULAR PURPOSE.

configure:5008: $? = 0
configure:5010: g++ -v </dev/null >&5
Using built-in specs.
Target: x86_64-redhat-linux
Configured with: ../configure --prefix=/usr --mandir=/usr/share/man --infodir=/usr/share/info --enable-shared --enable-threads=posix --enable-checking=release --with-system-zlib --enable-__cxa_atexit --disable-libunwind-exceptions --enable-libgcj-multifile --enable-languages=c,c++,objc,obj-c++,java,fortran,ada --enable-java-awt=gtk --disable-dssi --enable-plugin --with-java-home=/usr/lib/jvm/java-1.4.2-gcj-1.4.2.0/jre --with-cpu=generic --host=x86_64-redhat-linux
Thread model: posix
gcc version 4.1.1 20070105 (Red Hat 4.1.1-52)
configure:5013: $? = 0
configure:5015: g++ -V </dev/null >&5
g++: '-V' option must have argument
configure:5018: $? = 1
configure:5021: checking whether we are using the GNU C++ compiler
configure:5045: g++ -c   conftest.cc >&5
configure:5051: $? = 0
configure:5055: test -z 
			 || test ! -s conftest.err
configure:5058: $? = 0
configure:5061: test -s conftest.o
configure:5064: $? = 0
configure:5077: result: yes
configure:5083: checking whether g++ accepts -g
configure:5104: g++ -c -g  conftest.cc >&5
configure:5110: $? = 0
configure:5114: test -z 
			 || test ! -s conftest.err
configure:5117: $? = 0
configure:5120: test -s conftest.o
configure:5123: $? = 0
configure:5134: result: yes
configure:5176: g++ -c -g -O2  conftest.cc >&5
configure:5182: $? = 0
configure:5186: test -z 
			 || test ! -s conftest.err
configure:5189: $? = 0
configure:5192: test -s conftest.o
configure:5195: $? = 0
configure:5221: g++ -c -g -O2  conftest.cc >&5
conftest.cc: In function 'int main()':
conftest.cc:26: error: 'exit' was not declared in this scope
configure:5227: $? = 1
configure: failed program was:
| /* confdefs.h.  */
| 
| #define PACKAGE_NAME "TiLP2"
| #define PACKAGE_TARNAME "tilp2"
| #define PACKAGE_VERSION "1.04"
| #define PACKAGE_STRING "TiLP2 1.04"
| #define PACKAGE_BUGREPORT "tilp-users@lists.sourceforge.net"
| #define PACKAGE "tilp2"
| #define VERSION "1.04"
| #define STDC_HEADERS 1
| #define HAVE_SYS_TYPES_H 1
| #define HAVE_SYS_STAT_H 1
| #define HAVE_STDLIB_H 1
| #define HAVE_STRING_H 1
| #define HAVE_MEMORY_H 1
| #define HAVE_STRINGS_H 1
| #define HAVE_INTTYPES_H 1
| #define HAVE_STDINT_H 1
| #define HAVE_UNISTD_H 1
| #define HAVE_DLFCN_H 1
| /* end confdefs.h.  */
| 
| int
| main ()
| {
| exit (42);
|   ;
|   return 0;
| }
configure:5176: g++ -c -g -O2  conftest.cc >&5
configure:5182: $? = 0
configure:5186: test -z 
			 || test ! -s conftest.err
configure:5189: $? = 0
configure:5192: test -s conftest.o
configure:5195: $? = 0
configure:5221: g++ -c -g -O2  conftest.cc >&5
configure:5227: $? = 0
configure:5231: test -z 
			 || test ! -s conftest.err
configure:5234: $? = 0
configure:5237: test -s conftest.o
configure:5240: $? = 0
configure:5265: checking dependency style of g++
configure:5355: result: gcc3
configure:5382: checking how to run the C++ preprocessor
configure:5413: g++ -E  conftest.cc
configure:5419: $? = 0
configure:5451: g++ -E  conftest.cc
conftest.cc:25:28: error: ac_nonexistent.h: No such file or directory
configure:5457: $? = 1
configure: failed program was:
| /* confdefs.h.  */
| 
| #define PACKAGE_NAME "TiLP2"
| #define PACKAGE_TARNAME "tilp2"
| #define PACKAGE_VERSION "1.04"
| #define PACKAGE_STRING "TiLP2 1.04"
| #define PACKAGE_BUGREPORT "tilp-users@lists.sourceforge.net"
| #define PACKAGE "tilp2"
| #define VERSION "1.04"
| #define STDC_HEADERS 1
| #define HAVE_SYS_TYPES_H 1
| #define HAVE_SYS_STAT_H 1
| #define HAVE_STDLIB_H 1
| #define HAVE_STRING_H 1
| #define HAVE_MEMORY_H 1
| #define HAVE_STRINGS_H 1
| #define HAVE_INTTYPES_H 1
| #define HAVE_STDINT_H 1
| #define HAVE_UNISTD_H 1
| #define HAVE_DLFCN_H 1
| #ifdef __cplusplus
| extern "C" void std::exit (int) throw (); using std::exit;
| #endif
| /* end confdefs.h.  */
| #include <ac_nonexistent.h>
configure:5496: result: g++ -E
configure:5520: g++ -E  conftest.cc
configure:5526: $? = 0
configure:5558: g++ -E  conftest.cc
conftest.cc:25:28: error: ac_nonexistent.h: No such file or directory
configure:5564: $? = 1
configure: failed program was:
| /* confdefs.h.  */
| 
| #define PACKAGE_NAME "TiLP2"
| #define PACKAGE_TARNAME "tilp2"
| #define PACKAGE_VERSION "1.04"
| #define PACKAGE_STRING "TiLP2 1.04"
| #define PACKAGE_BUGREPORT "tilp-users@lists.sourceforge.net"
| #define PACKAGE "tilp2"
| #define VERSION "1.04"
| #define STDC_HEADERS 1
| #define HAVE_SYS_TYPES_H 1
| #define HAVE_SYS_STAT_H 1
| #define HAVE_STDLIB_H 1
| #define HAVE_STRING_H 1
| #define HAVE_MEMORY_H 1
| #define HAVE_STRINGS_H 1
| #define HAVE_INTTYPES_H 1
| #define HAVE_STDINT_H 1
| #define HAVE_UNISTD_H 1
| #define HAVE_DLFCN_H 1
| #ifdef __cplusplus
| extern "C" void std::exit (int) throw (); using std::exit;
| #endif
| /* end confdefs.h.  */
| #include <ac_nonexistent.h>
configure:5661: checking for g77
configure:5690: result: no
configure:5661: checking for f77
configure:5690: result: no
configure:5661: checking for xlf
configure:5690: result: no
configure:5661: checking for frt
configure:5690: result: no
configure:5661: checking for pgf77
configure:5690: result: no
configure:5661: checking for fort77
configure:5690: result: no
configure:5661: checking for fl32
configure:5690: result: no
configure:5661: checking for af77
configure:5690: result: no
configure:5661: checking for f90
configure:5690: result: no
configure:5661: checking for xlf90
configure:5690: result: no
configure:5661: checking for pgf90
configure:5690: result: no
configure:5661: checking for epcf90
configure:5690: result: no
configure:5661: checking for f95
configure:5677: found /usr/bin/f95
configure:5687: result: f95
configure:5702: checking for Fortran 77 compiler version
configure:5705: f95 --version </dev/null >&5
GNU Fortran 95 (GCC) 4.1.1 20070105 (Red Hat 4.1.1-52)
Copyright (C) 2006 Free Software Foundation, Inc.

GNU Fortran comes with NO WARRANTY, to the extent permitted by law.
You may redistribute copies of GNU Fortran
under the terms of the GNU General Public License.
For more information about these matters, see the file named COPYING

configure:5708: $? = 0
configure:5710: f95 -v </dev/null >&5
Using built-in specs.
Target: x86_64-redhat-linux
Configured with: ../configure --prefix=/usr --mandir=/usr/share/man --infodir=/usr/share/info --enable-shared --enable-threads=posix --enable-checking=release --with-system-zlib --enable-__cxa_atexit --disable-libunwind-exceptions --enable-libgcj-multifile --enable-languages=c,c++,objc,obj-c++,java,fortran,ada --enable-java-awt=gtk --disable-dssi --enable-plugin --with-java-home=/usr/lib/jvm/java-1.4.2-gcj-1.4.2.0/jre --with-cpu=generic --host=x86_64-redhat-linux
Thread model: posix
gcc version 4.1.1 20070105 (Red Hat 4.1.1-52)
configure:5713: $? = 0
configure:5715: f95 -V </dev/null >&5
f95: '-V' option must have argument
configure:5718: $? = 1
configure:5726: checking whether we are using the GNU Fortran 77 compiler
configure:5740: f95 -c  conftest.F >&5
configure:5746: $? = 0
configure:5750: test -z 
			 || test ! -s conftest.err
configure:5753: $? = 0
configure:5756: test -s conftest.o
configure:5759: $? = 0
configure:5772: result: yes
configure:5778: checking whether f95 accepts -g
configure:5790: f95 -c -g conftest.f >&5
configure:5796: $? = 0
configure:5800: test -z 
			 || test ! -s conftest.err
configure:5803: $? = 0
configure:5806: test -s conftest.o
configure:5809: $? = 0
configure:5821: result: yes
configure:5851: checking the maximum length of command line arguments
configure:5960: result: 32768
configure:5971: checking command to parse /usr/bin/nm -B output from gcc object
configure:6076: gcc -c -O2 -g -pipe -Wall -Wp,-D_FORTIFY_SOURCE=2 -fexceptions -fstack-protector --param=ssp-buffer-size=4 -m64 -mtune=generic  conftest.c >&5
configure:6079: $? = 0
configure:6083: /usr/bin/nm -B conftest.o \| sed -n -e 's/^.*[ 	]\([ABCDGIRSTW][ABCDGIRSTW]*\)[ 	][ 	]*\([_A-Za-z][_A-Za-z0-9]*\)$/\1 \2 \2/p' \> conftest.nm
configure:6086: $? = 0
configure:6138: gcc -o conftest -O2 -g -pipe -Wall -Wp,-D_FORTIFY_SOURCE=2 -fexceptions -fstack-protector --param=ssp-buffer-size=4 -m64 -mtune=generic   conftest.c conftstm.o >&5
configure:6141: $? = 0
configure:6179: result: ok
configure:6183: checking for objdir
configure:6198: result: .libs
configure:6288: checking for ar
configure:6304: found /usr/bin/ar
configure:6315: result: ar
configure:6368: checking for ranlib
configure:6384: found /usr/bin/ranlib
configure:6395: result: ranlib
configure:6448: checking for strip
configure:6464: found /usr/bin/strip
configure:6475: result: strip
configure:6747: checking if gcc supports -fno-rtti -fno-exceptions
configure:6765: gcc -c -O2 -g -pipe -Wall -Wp,-D_FORTIFY_SOURCE=2 -fexceptions -fstack-protector --param=ssp-buffer-size=4 -m64 -mtune=generic  -fno-rtti -fno-exceptions conftest.c >&5
cc1: warning: command line option "-fno-rtti" is valid for C++/ObjC++ but not for C
configure:6769: $? = 0
configure:6782: result: no
configure:6797: checking for gcc option to produce PIC
configure:7007: result: -fPIC
configure:7015: checking if gcc PIC flag -fPIC works
configure:7033: gcc -c -O2 -g -pipe -Wall -Wp,-D_FORTIFY_SOURCE=2 -fexceptions -fstack-protector --param=ssp-buffer-size=4 -m64 -mtune=generic  -fPIC -DPIC conftest.c >&5
configure:7037: $? = 0
configure:7050: result: yes
configure:7078: checking if gcc static flag -static works
configure:7106: result: yes
configure:7116: checking if gcc supports -c -o file.o
configure:7137: gcc -c -O2 -g -pipe -Wall -Wp,-D_FORTIFY_SOURCE=2 -fexceptions -fstack-protector --param=ssp-buffer-size=4 -m64 -mtune=generic  -o out/conftest2.o conftest.c >&5
configure:7141: $? = 0
configure:7163: result: yes
configure:7189: checking whether the gcc linker (/usr/bin/ld -m elf_x86_64) supports shared libraries
configure:8147: result: yes
configure:8168: checking whether -lc should be explicitly linked in
configure:8173: gcc -c -O2 -g -pipe -Wall -Wp,-D_FORTIFY_SOURCE=2 -fexceptions -fstack-protector --param=ssp-buffer-size=4 -m64 -mtune=generic  conftest.c >&5
configure:8176: $? = 0
configure:8191: gcc -shared conftest.o  -v -Wl,-soname -Wl,conftest -o conftest 2\>\&1 \| grep  -lc  \>/dev/null 2\>\&1
configure:8194: $? = 0
configure:8206: result: no
configure:8214: checking dynamic linker characteristics
configure:8607: gcc -c -O2 -g -pipe -Wall -Wp,-D_FORTIFY_SOURCE=2 -fexceptions -fstack-protector --param=ssp-buffer-size=4 -m64 -mtune=generic  conftest.c >&5
configure:8610: $? = 0
configure:8823: result: GNU/Linux ld.so
configure:8832: checking how to hardcode library paths into programs
configure:8857: result: immediate
configure:8871: checking whether stripping libraries is possible
configure:8876: result: yes
configure:9710: checking if libtool supports shared libraries
configure:9712: result: yes
configure:9715: checking whether to build shared libraries
configure:9736: result: yes
configure:9739: checking whether to build static libraries
configure:9743: result: no
configure:9835: creating libtool
configure:10426: checking for ld used by g++
configure:10493: result: /usr/bin/ld -m elf_x86_64
configure:10502: checking if the linker (/usr/bin/ld -m elf_x86_64) is GNU ld
configure:10517: result: yes
configure:10568: checking whether the g++ linker (/usr/bin/ld -m elf_x86_64) supports shared libraries
configure:11506: result: yes
configure:11524: g++ -c -g -O2  conftest.cpp >&5
configure:11527: $? = 0
configure:11646: checking for g++ option to produce PIC
configure:11920: result: -fPIC
configure:11928: checking if g++ PIC flag -fPIC works
configure:11946: g++ -c -g -O2  -fPIC -DPIC conftest.cpp >&5
configure:11950: $? = 0
configure:11963: result: yes
configure:11991: checking if g++ static flag -static works
configure:12019: result: yes
configure:12029: checking if g++ supports -c -o file.o
configure:12050: g++ -c -g -O2  -o out/conftest2.o conftest.cpp >&5
configure:12054: $? = 0
configure:12076: result: yes
configure:12102: checking whether the g++ linker (/usr/bin/ld -m elf_x86_64) supports shared libraries
configure:12127: result: yes
configure:12194: checking dynamic linker characteristics
configure:12587: g++ -c -g -O2  conftest.cpp >&5
configure:12590: $? = 0
configure:12803: result: GNU/Linux ld.so
configure:12812: checking how to hardcode library paths into programs
configure:12837: result: immediate
configure:13366: checking if libtool supports shared libraries
configure:13368: result: yes
configure:13371: checking whether to build shared libraries
configure:13391: result: yes
configure:13394: checking whether to build static libraries
configure:13398: result: no
configure:13408: checking for f95 option to produce PIC
configure:13618: result: -fPIC
configure:13626: checking if f95 PIC flag -fPIC works
configure:13644: f95 -c -g -O2 -fPIC conftest.f >&5
configure:13648: $? = 0
configure:13661: result: yes
configure:13689: checking if f95 static flag -static works
configure:13717: result: yes
configure:13727: checking if f95 supports -c -o file.o
configure:13748: f95 -c -g -O2 -o out/conftest2.o conftest.f >&5
configure:13752: $? = 0
configure:13774: result: yes
configure:13800: checking whether the f95 linker (/usr/bin/ld -m elf_x86_64) supports shared libraries
configure:14738: result: yes
configure:14805: checking dynamic linker characteristics
configure:15198: f95 -c -g -O2 conftest.f >&5
Warning: conftest.f:1: Illegal preprocessor directive
configure:15201: $? = 0
configure:15414: result: GNU/Linux ld.so
configure:15423: checking how to hardcode library paths into programs
configure:15448: result: immediate
configure:19089: checking for gcc
configure:19115: result: gcc
configure:19359: checking for C compiler version
configure:19362: gcc --version </dev/null >&5
gcc (GCC) 4.1.1 20070105 (Red Hat 4.1.1-52)
Copyright (C) 2006 Free Software Foundation, Inc.
This is free software; see the source for copying conditions.  There is NO
warranty; not even for MERCHANTABILITY or FITNESS FOR A PARTICULAR PURPOSE.

configure:19365: $? = 0
configure:19367: gcc -v </dev/null >&5
Using built-in specs.
Target: x86_64-redhat-linux
Configured with: ../configure --prefix=/usr --mandir=/usr/share/man --infodir=/usr/share/info --enable-shared --enable-threads=posix --enable-checking=release --with-system-zlib --enable-__cxa_atexit --disable-libunwind-exceptions --enable-libgcj-multifile --enable-languages=c,c++,objc,obj-c++,java,fortran,ada --enable-java-awt=gtk --disable-dssi --enable-plugin --with-java-home=/usr/lib/jvm/java-1.4.2-gcj-1.4.2.0/jre --with-cpu=generic --host=x86_64-redhat-linux
Thread model: posix
gcc version 4.1.1 20070105 (Red Hat 4.1.1-52)
configure:19370: $? = 0
configure:19372: gcc -V </dev/null >&5
gcc: '-V' option must have argument
configure:19375: $? = 1
configure:19378: checking whether we are using the GNU C compiler
configure:19434: result: yes
configure:19440: checking whether gcc accepts -g
configure:19491: result: yes
configure:19508: checking for gcc option to accept ANSI C
configure:19615: result: none needed
configure:19633: gcc -c -O2 -g -pipe -Wall -Wp,-D_FORTIFY_SOURCE=2 -fexceptions -fstack-protector --param=ssp-buffer-size=4 -m64 -mtune=generic  conftest.c >&5
conftest.c:2: error: expected '=', ',', ';', 'asm' or '__attribute__' before 'me'
configure:19639: $? = 1
configure: failed program was:
| #ifndef __cplusplus
|   choke me
| #endif
configure:19774: checking dependency style of gcc
configure:19864: result: gcc3
configure:19894: checking for a BSD-compatible install
configure:19949: result: /usr/bin/install -c -p
configure:19960: checking whether make sets $(MAKE)
configure:19980: result: yes
configure:19989: checking whether ln -s works
configure:19993: result: yes
configure:20001: checking for strerror in -lcposix
configure:20031: gcc -o conftest -O2 -g -pipe -Wall -Wp,-D_FORTIFY_SOURCE=2 -fexceptions -fstack-protector --param=ssp-buffer-size=4 -m64 -mtune=generic   conftest.c -lcposix   >&5
/usr/bin/ld: cannot find -lcposix
collect2: ld returned 1 exit status
configure:20037: $? = 1
configure: failed program was:
| /* confdefs.h.  */
| 
| #define PACKAGE_NAME "TiLP2"
| #define PACKAGE_TARNAME "tilp2"
| #define PACKAGE_VERSION "1.04"
| #define PACKAGE_STRING "TiLP2 1.04"
| #define PACKAGE_BUGREPORT "tilp-users@lists.sourceforge.net"
| #define PACKAGE "tilp2"
| #define VERSION "1.04"
| #define STDC_HEADERS 1
| #define HAVE_SYS_TYPES_H 1
| #define HAVE_SYS_STAT_H 1
| #define HAVE_STDLIB_H 1
| #define HAVE_STRING_H 1
| #define HAVE_MEMORY_H 1
| #define HAVE_STRINGS_H 1
| #define HAVE_INTTYPES_H 1
| #define HAVE_STDINT_H 1
| #define HAVE_UNISTD_H 1
| #define HAVE_DLFCN_H 1
| #ifdef __cplusplus
| extern "C" void std::exit (int) throw (); using std::exit;
| #endif
| /* end confdefs.h.  */
| 
| /* Override any gcc2 internal prototype to avoid an error.  */
| #ifdef __cplusplus
| extern "C"
| #endif
| /* We use char because int might match the return type of a gcc2
|    builtin and then its argument prototype would still apply.  */
| char strerror ();
| int
| main ()
| {
| strerror ();
|   ;
|   return 0;
| }
configure:20063: result: no
configure:20075: checking for gawk
configure:20101: result: gawk
configure:20113: checking for groff
configure:20129: found /usr/bin/groff
configure:20140: result: yes
configure:20174: checking whether NLS is requested
configure:20183: result: no
configure:20221: checking for msgfmt
configure: trying /usr/bin/msgfmt...
0 translated messages.
configure:20253: result: /usr/bin/msgfmt
configure:20262: checking for gmsgfmt
configure:20293: result: /usr/bin/msgfmt
configure:20332: checking for xgettext
configure: trying /usr/bin/xgettext...
/usr/bin/xgettext: warning: file `/dev/null' extension `' is unknown; will try C
configure:20364: result: /usr/bin/xgettext
configure:20404: checking for msgmerge
configure: trying /usr/bin/msgmerge...
configure:20435: result: /usr/bin/msgmerge
configure:20471: checking whether we are using the GNU C Library 2 or newer
configure:20502: result: yes
configure:20549: checking for ranlib
configure:20576: result: ranlib
configure:20588: checking for an ANSI C-conforming const
configure:20655: gcc -c -O2 -g -pipe -Wall -Wp,-D_FORTIFY_SOURCE=2 -fexceptions -fstack-protector --param=ssp-buffer-size=4 -m64 -mtune=generic  conftest.c >&5
conftest.c: In function 'main':
conftest.c:52: warning: unused variable 's'
conftest.c:72: warning: unused variable 'foo'
conftest.c:39: warning: unused variable 'zero'
conftest.c:33: warning: unused variable 'x'
conftest.c:54: warning: 't' is used uninitialized in this function
conftest.c:69: warning: 'b' is used uninitialized in this function
configure:20661: $? = 0
configure:20665: test -z 
			 || test ! -s conftest.err
configure:20668: $? = 0
configure:20671: test -s conftest.o
configure:20674: $? = 0
configure:20685: result: yes
configure:20696: checking for signed
configure:20717: gcc -c -O2 -g -pipe -Wall -Wp,-D_FORTIFY_SOURCE=2 -fexceptions -fstack-protector --param=ssp-buffer-size=4 -m64 -mtune=generic  conftest.c >&5
conftest.c: In function 'main':
conftest.c:29: warning: unused variable 'x'
configure:20723: $? = 0
configure:20727: test -z 
			 || test ! -s conftest.err
configure:20730: $? = 0
configure:20733: test -s conftest.o
configure:20736: $? = 0
configure:20747: result: yes
configure:20757: checking for inline
configure:20778: gcc -c -O2 -g -pipe -Wall -Wp,-D_FORTIFY_SOURCE=2 -fexceptions -fstack-protector --param=ssp-buffer-size=4 -m64 -mtune=generic  conftest.c >&5
configure:20784: $? = 0
configure:20788: test -z 
			 || test ! -s conftest.err
configure:20791: $? = 0
configure:20794: test -s conftest.o
configure:20797: $? = 0
configure:20809: result: inline
configure:20828: checking for off_t
configure:20852: gcc -c -O2 -g -pipe -Wall -Wp,-D_FORTIFY_SOURCE=2 -fexceptions -fstack-protector --param=ssp-buffer-size=4 -m64 -mtune=generic  conftest.c >&5
configure:20858: $? = 0
configure:20862: test -z 
			 || test ! -s conftest.err
configure:20865: $? = 0
configure:20868: test -s conftest.o
configure:20871: $? = 0
configure:20882: result: yes
configure:20894: checking for size_t
configure:20918: gcc -c -O2 -g -pipe -Wall -Wp,-D_FORTIFY_SOURCE=2 -fexceptions -fstack-protector --param=ssp-buffer-size=4 -m64 -mtune=generic  conftest.c >&5
configure:20924: $? = 0
configure:20928: test -z 
			 || test ! -s conftest.err
configure:20931: $? = 0
configure:20934: test -s conftest.o
configure:20937: $? = 0
configure:20948: result: yes
configure:20961: checking for long long
configure:20983: gcc -o conftest -O2 -g -pipe -Wall -Wp,-D_FORTIFY_SOURCE=2 -fexceptions -fstack-protector --param=ssp-buffer-size=4 -m64 -mtune=generic   conftest.c  >&5
configure:20989: $? = 0
configure:20993: test -z 
			 || test ! -s conftest.err
configure:20996: $? = 0
configure:20999: test -s conftest
configure:21002: $? = 0
configure:21014: result: yes
configure:21025: checking for long double
configure:21085: result: yes
configure:21096: checking for wchar_t
configure:21118: gcc -c -O2 -g -pipe -Wall -Wp,-D_FORTIFY_SOURCE=2 -fexceptions -fstack-protector --param=ssp-buffer-size=4 -m64 -mtune=generic  conftest.c >&5
configure:21124: $? = 0
configure:21128: test -z 
			 || test ! -s conftest.err
configure:21131: $? = 0
configure:21134: test -s conftest.o
configure:21137: $? = 0
configure:21148: result: yes
configure:21159: checking for wint_t
configure:21181: gcc -c -O2 -g -pipe -Wall -Wp,-D_FORTIFY_SOURCE=2 -fexceptions -fstack-protector --param=ssp-buffer-size=4 -m64 -mtune=generic  conftest.c >&5
configure:21187: $? = 0
configure:21191: test -z 
			 || test ! -s conftest.err
configure:21194: $? = 0
configure:21197: test -s conftest.o
configure:21200: $? = 0
configure:21211: result: yes
configure:21222: checking for inttypes.h
configure:21244: gcc -c -O2 -g -pipe -Wall -Wp,-D_FORTIFY_SOURCE=2 -fexceptions -fstack-protector --param=ssp-buffer-size=4 -m64 -mtune=generic  conftest.c >&5
conftest.c: In function 'main':
conftest.c:34: warning: unused variable 'i'
configure:21250: $? = 0
configure:21254: test -z 
			 || test ! -s conftest.err
configure:21257: $? = 0
configure:21260: test -s conftest.o
configure:21263: $? = 0
configure:21274: result: yes
configure:21285: checking for stdint.h
configure:21307: gcc -c -O2 -g -pipe -Wall -Wp,-D_FORTIFY_SOURCE=2 -fexceptions -fstack-protector --param=ssp-buffer-size=4 -m64 -mtune=generic  conftest.c >&5
conftest.c: In function 'main':
conftest.c:35: warning: unused variable 'i'
configure:21313: $? = 0
configure:21317: test -z 
			 || test ! -s conftest.err
configure:21320: $? = 0
configure:21323: test -s conftest.o
configure:21326: $? = 0
configure:21337: result: yes
configure:21350: checking for intmax_t
configure:21380: gcc -c -O2 -g -pipe -Wall -Wp,-D_FORTIFY_SOURCE=2 -fexceptions -fstack-protector --param=ssp-buffer-size=4 -m64 -mtune=generic  conftest.c >&5
conftest.c: In function 'main':
conftest.c:44: warning: unused variable 'x'
configure:21386: $? = 0
configure:21390: test -z 
			 || test ! -s conftest.err
configure:21393: $? = 0
configure:21396: test -s conftest.o
configure:21399: $? = 0
configure:21410: result: yes
configure:21422: checking whether printf() supports POSIX/XSI format strings
configure:21472: gcc -o conftest -O2 -g -pipe -Wall -Wp,-D_FORTIFY_SOURCE=2 -fexceptions -fstack-protector --param=ssp-buffer-size=4 -m64 -mtune=generic   conftest.c  >&5
configure:21475: $? = 0
configure:21477: ./conftest
configure:21480: $? = 0
configure:21495: result: yes
configure:21509: checking for working alloca.h
configure:21530: gcc -o conftest -O2 -g -pipe -Wall -Wp,-D_FORTIFY_SOURCE=2 -fexceptions -fstack-protector --param=ssp-buffer-size=4 -m64 -mtune=generic   conftest.c  >&5
conftest.c: In function 'main':
conftest.c:37: warning: unused variable 'p'
configure:21536: $? = 0
configure:21540: test -z 
			 || test ! -s conftest.err
configure:21543: $? = 0
configure:21546: test -s conftest
configure:21549: $? = 0
configure:21561: result: yes
configure:21571: checking for alloca
configure:21612: gcc -o conftest -O2 -g -pipe -Wall -Wp,-D_FORTIFY_SOURCE=2 -fexceptions -fstack-protector --param=ssp-buffer-size=4 -m64 -mtune=generic   conftest.c  >&5
conftest.c: In function 'main':
conftest.c:58: warning: unused variable 'p'
configure:21618: $? = 0
configure:21622: test -z 
			 || test ! -s conftest.err
configure:21625: $? = 0
configure:21628: test -s conftest
configure:21631: $? = 0
configure:21643: result: yes
configure:21872: checking for stdlib.h
configure:21877: result: yes
configure:21872: checking for unistd.h
configure:21877: result: yes
configure:22021: checking for getpagesize
configure:22078: gcc -o conftest -O2 -g -pipe -Wall -Wp,-D_FORTIFY_SOURCE=2 -fexceptions -fstack-protector --param=ssp-buffer-size=4 -m64 -mtune=generic   conftest.c  >&5
configure:22084: $? = 0
configure:22088: test -z 
			 || test ! -s conftest.err
configure:22091: $? = 0
configure:22094: test -s conftest
configure:22097: $? = 0
configure:22109: result: yes
configure:22119: checking for working mmap
configure:22261: gcc -o conftest -O2 -g -pipe -Wall -Wp,-D_FORTIFY_SOURCE=2 -fexceptions -fstack-protector --param=ssp-buffer-size=4 -m64 -mtune=generic   conftest.c  >&5
configure:22264: $? = 0
configure:22266: ./conftest
configure:22269: $? = 0
configure:22283: result: yes
configure:22295: checking whether we are using the GNU C Library 2.1 or newer
configure:22326: result: yes
configure:22334: checking whether integer division by zero raises SIGFPE
configure:22396: gcc -o conftest -O2 -g -pipe -Wall -Wp,-D_FORTIFY_SOURCE=2 -fexceptions -fstack-protector --param=ssp-buffer-size=4 -m64 -mtune=generic   conftest.c  >&5
configure:22399: $? = 0
configure:22401: ./conftest
configure:22404: $? = 0
configure:22419: result: yes
configure:22432: checking for unsigned long long
configure:22454: gcc -o conftest -O2 -g -pipe -Wall -Wp,-D_FORTIFY_SOURCE=2 -fexceptions -fstack-protector --param=ssp-buffer-size=4 -m64 -mtune=generic   conftest.c  >&5
configure:22460: $? = 0
configure:22464: test -z 
			 || test ! -s conftest.err
configure:22467: $? = 0
configure:22470: test -s conftest
configure:22473: $? = 0
configure:22485: result: yes
configure:22517: checking for inttypes.h
configure:22540: gcc -c -O2 -g -pipe -Wall -Wp,-D_FORTIFY_SOURCE=2 -fexceptions -fstack-protector --param=ssp-buffer-size=4 -m64 -mtune=generic  conftest.c >&5
configure:22546: $? = 0
configure:22550: test -z 
			 || test ! -s conftest.err
configure:22553: $? = 0
configure:22556: test -s conftest.o
configure:22559: $? = 0
configure:22571: result: yes
configure:22584: checking whether the inttypes.h PRIxNN macros are broken
configure:22610: gcc -c -O2 -g -pipe -Wall -Wp,-D_FORTIFY_SOURCE=2 -fexceptions -fstack-protector --param=ssp-buffer-size=4 -m64 -mtune=generic  conftest.c >&5
configure:22616: $? = 0
configure:22620: test -z 
			 || test ! -s conftest.err
configure:22623: $? = 0
configure:22626: test -s conftest.o
configure:22629: $? = 0
configure:22641: result: no
configure:22658: checking for stdint.h
configure:22663: result: yes
configure:22803: checking for SIZE_MAX
configure:23872: result: yes
configure:23890: checking for stdint.h
configure:23895: result: yes
configure:24037: checking for CFPreferencesCopyAppValue
configure:24062: gcc -o conftest -O2 -g -pipe -Wall -Wp,-D_FORTIFY_SOURCE=2 -fexceptions -fstack-protector --param=ssp-buffer-size=4 -m64 -mtune=generic  -I/System/Library/Frameworks/CoreFoundation.framework/Headers  conftest.c  -framework CoreFoundation >&5
gcc: CoreFoundation: No such file or directory
cc1: error: unrecognized command line option "-framework"
configure:24068: $? = 1
configure: failed program was:
| /* confdefs.h.  */
| 
| #define PACKAGE_NAME "TiLP2"
| #define PACKAGE_TARNAME "tilp2"
| #define PACKAGE_VERSION "1.04"
| #define PACKAGE_STRING "TiLP2 1.04"
| #define PACKAGE_BUGREPORT "tilp-users@lists.sourceforge.net"
| #define PACKAGE "tilp2"
| #define VERSION "1.04"
| #define STDC_HEADERS 1
| #define HAVE_SYS_TYPES_H 1
| #define HAVE_SYS_STAT_H 1
| #define HAVE_STDLIB_H 1
| #define HAVE_STRING_H 1
| #define HAVE_MEMORY_H 1
| #define HAVE_STRINGS_H 1
| #define HAVE_INTTYPES_H 1
| #define HAVE_STDINT_H 1
| #define HAVE_UNISTD_H 1
| #define HAVE_DLFCN_H 1
| #ifdef __cplusplus
| extern "C" void std::exit (int) throw (); using std::exit;
| #endif
| #define HAVE_LONG_LONG 1
| #define HAVE_LONG_DOUBLE 1
| #define HAVE_WCHAR_T 1
| #define HAVE_WINT_T 1
| #define HAVE_INTTYPES_H_WITH_UINTMAX 1
| #define HAVE_STDINT_H_WITH_UINTMAX 1
| #define HAVE_INTMAX_T 1
| #define HAVE_POSIX_PRINTF 1
| #define HAVE_ALLOCA_H 1
| #define HAVE_ALLOCA 1
| #define HAVE_STDLIB_H 1
| #define HAVE_UNISTD_H 1
| #define HAVE_GETPAGESIZE 1
| #define HAVE_MMAP 1
| #define INTDIV0_RAISES_SIGFPE 1
| #define HAVE_UNSIGNED_LONG_LONG 1
| #define HAVE_UINTMAX_T 1
| #define HAVE_INTTYPES_H 1
| #define HAVE_STDINT_H 1
| #define HAVE_STDINT_H 1
| /* end confdefs.h.  */
| #include <CFPreferences.h>
| int
| main ()
| {
| CFPreferencesCopyAppValue(NULL, NULL)
|   ;
|   return 0;
| }
configure:24095: result: no
configure:24104: checking for CFLocaleCopyCurrent
configure:24129: gcc -o conftest -O2 -g -pipe -Wall -Wp,-D_FORTIFY_SOURCE=2 -fexceptions -fstack-protector --param=ssp-buffer-size=4 -m64 -mtune=generic  -I/System/Library/Frameworks/CoreFoundation.framework/Headers  conftest.c  -framework CoreFoundation >&5
gcc: CoreFoundation: No such file or directory
cc1: error: unrecognized command line option "-framework"
configure:24135: $? = 1
configure: failed program was:
| /* confdefs.h.  */
| 
| #define PACKAGE_NAME "TiLP2"
| #define PACKAGE_TARNAME "tilp2"
| #define PACKAGE_VERSION "1.04"
| #define PACKAGE_STRING "TiLP2 1.04"
| #define PACKAGE_BUGREPORT "tilp-users@lists.sourceforge.net"
| #define PACKAGE "tilp2"
| #define VERSION "1.04"
| #define STDC_HEADERS 1
| #define HAVE_SYS_TYPES_H 1
| #define HAVE_SYS_STAT_H 1
| #define HAVE_STDLIB_H 1
| #define HAVE_STRING_H 1
| #define HAVE_MEMORY_H 1
| #define HAVE_STRINGS_H 1
| #define HAVE_INTTYPES_H 1
| #define HAVE_STDINT_H 1
| #define HAVE_UNISTD_H 1
| #define HAVE_DLFCN_H 1
| #ifdef __cplusplus
| extern "C" void std::exit (int) throw (); using std::exit;
| #endif
| #define HAVE_LONG_LONG 1
| #define HAVE_LONG_DOUBLE 1
| #define HAVE_WCHAR_T 1
| #define HAVE_WINT_T 1
| #define HAVE_INTTYPES_H_WITH_UINTMAX 1
| #define HAVE_STDINT_H_WITH_UINTMAX 1
| #define HAVE_INTMAX_T 1
| #define HAVE_POSIX_PRINTF 1
| #define HAVE_ALLOCA_H 1
| #define HAVE_ALLOCA 1
| #define HAVE_STDLIB_H 1
| #define HAVE_UNISTD_H 1
| #define HAVE_GETPAGESIZE 1
| #define HAVE_MMAP 1
| #define INTDIV0_RAISES_SIGFPE 1
| #define HAVE_UNSIGNED_LONG_LONG 1
| #define HAVE_UINTMAX_T 1
| #define HAVE_INTTYPES_H 1
| #define HAVE_STDINT_H 1
| #define HAVE_STDINT_H 1
| /* end confdefs.h.  */
| #include <CFLocale.h>
| int
| main ()
| {
| CFLocaleCopyCurrent();
|   ;
|   return 0;
| }
configure:24162: result: no
configure:24217: checking for ld used by GCC
configure:24281: result: /usr/bin/ld -m elf_x86_64
configure:24290: checking if the linker (/usr/bin/ld -m elf_x86_64) is GNU ld
configure:24303: result: yes
configure:24310: checking for shared library run path origin
configure:24323: result: done
configure:24729: checking for ptrdiff_t
configure:24753: gcc -c -O2 -g -pipe -Wall -Wp,-D_FORTIFY_SOURCE=2 -fexceptions -fstack-protector --param=ssp-buffer-size=4 -m64 -mtune=generic  conftest.c >&5
configure:24759: $? = 0
configure:24763: test -z 
			 || test ! -s conftest.err
configure:24766: $? = 0
configure:24769: test -s conftest.o
configure:24772: $? = 0
configure:24783: result: yes
configure:24820: checking argz.h usability
configure:24832: gcc -c -O2 -g -pipe -Wall -Wp,-D_FORTIFY_SOURCE=2 -fexceptions -fstack-protector --param=ssp-buffer-size=4 -m64 -mtune=generic  conftest.c >&5
configure:24838: $? = 0
configure:24842: test -z 
			 || test ! -s conftest.err
configure:24845: $? = 0
configure:24848: test -s conftest.o
configure:24851: $? = 0
configure:24861: result: yes
configure:24865: checking argz.h presence
configure:24875: gcc -E  conftest.c
configure:24881: $? = 0
configure:24901: result: yes
configure:24936: checking for argz.h
configure:24943: result: yes
configure:24820: checking limits.h usability
configure:24832: gcc -c -O2 -g -pipe -Wall -Wp,-D_FORTIFY_SOURCE=2 -fexceptions -fstack-protector --param=ssp-buffer-size=4 -m64 -mtune=generic  conftest.c >&5
configure:24838: $? = 0
configure:24842: test -z 
			 || test ! -s conftest.err
configure:24845: $? = 0
configure:24848: test -s conftest.o
configure:24851: $? = 0
configure:24861: result: yes
configure:24865: checking limits.h presence
configure:24875: gcc -E  conftest.c
configure:24881: $? = 0
configure:24901: result: yes
configure:24936: checking for limits.h
configure:24943: result: yes
configure:24820: checking locale.h usability
configure:24832: gcc -c -O2 -g -pipe -Wall -Wp,-D_FORTIFY_SOURCE=2 -fexceptions -fstack-protector --param=ssp-buffer-size=4 -m64 -mtune=generic  conftest.c >&5
configure:24838: $? = 0
configure:24842: test -z 
			 || test ! -s conftest.err
configure:24845: $? = 0
configure:24848: test -s conftest.o
configure:24851: $? = 0
configure:24861: result: yes
configure:24865: checking locale.h presence
configure:24875: gcc -E  conftest.c
configure:24881: $? = 0
configure:24901: result: yes
configure:24936: checking for locale.h
configure:24943: result: yes
configure:24820: checking nl_types.h usability
configure:24832: gcc -c -O2 -g -pipe -Wall -Wp,-D_FORTIFY_SOURCE=2 -fexceptions -fstack-protector --param=ssp-buffer-size=4 -m64 -mtune=generic  conftest.c >&5
configure:24838: $? = 0
configure:24842: test -z 
			 || test ! -s conftest.err
configure:24845: $? = 0
configure:24848: test -s conftest.o
configure:24851: $? = 0
configure:24861: result: yes
configure:24865: checking nl_types.h presence
configure:24875: gcc -E  conftest.c
configure:24881: $? = 0
configure:24901: result: yes
configure:24936: checking for nl_types.h
configure:24943: result: yes
configure:24820: checking malloc.h usability
configure:24832: gcc -c -O2 -g -pipe -Wall -Wp,-D_FORTIFY_SOURCE=2 -fexceptions -fstack-protector --param=ssp-buffer-size=4 -m64 -mtune=generic  conftest.c >&5
configure:24838: $? = 0
configure:24842: test -z 
			 || test ! -s conftest.err
configure:24845: $? = 0
configure:24848: test -s conftest.o
configure:24851: $? = 0
configure:24861: result: yes
configure:24865: checking malloc.h presence
configure:24875: gcc -E  conftest.c
configure:24881: $? = 0
configure:24901: result: yes
configure:24936: checking for malloc.h
configure:24943: result: yes
configure:24820: checking stddef.h usability
configure:24832: gcc -c -O2 -g -pipe -Wall -Wp,-D_FORTIFY_SOURCE=2 -fexceptions -fstack-protector --param=ssp-buffer-size=4 -m64 -mtune=generic  conftest.c >&5
configure:24838: $? = 0
configure:24842: test -z 
			 || test ! -s conftest.err
configure:24845: $? = 0
configure:24848: test -s conftest.o
configure:24851: $? = 0
configure:24861: result: yes
configure:24865: checking stddef.h presence
configure:24875: gcc -E  conftest.c
configure:24881: $? = 0
configure:24901: result: yes
configure:24936: checking for stddef.h
configure:24943: result: yes
configure:24811: checking for stdlib.h
configure:24816: result: yes
configure:24811: checking for string.h
configure:24816: result: yes
configure:24811: checking for unistd.h
configure:24816: result: yes
configure:24820: checking sys/param.h usability
configure:24832: gcc -c -O2 -g -pipe -Wall -Wp,-D_FORTIFY_SOURCE=2 -fexceptions -fstack-protector --param=ssp-buffer-size=4 -m64 -mtune=generic  conftest.c >&5
configure:24838: $? = 0
configure:24842: test -z 
			 || test ! -s conftest.err
configure:24845: $? = 0
configure:24848: test -s conftest.o
configure:24851: $? = 0
configure:24861: result: yes
configure:24865: checking sys/param.h presence
configure:24875: gcc -E  conftest.c
configure:24881: $? = 0
configure:24901: result: yes
configure:24936: checking for sys/param.h
configure:24943: result: yes
configure:24985: checking for asprintf
configure:25042: gcc -o conftest -O2 -g -pipe -Wall -Wp,-D_FORTIFY_SOURCE=2 -fexceptions -fstack-protector --param=ssp-buffer-size=4 -m64 -mtune=generic   conftest.c  >&5
configure:25048: $? = 0
configure:25052: test -z 
			 || test ! -s conftest.err
configure:25055: $? = 0
configure:25058: test -s conftest
configure:25061: $? = 0
configure:25073: result: yes
configure:24985: checking for fwprintf
configure:25042: gcc -o conftest -O2 -g -pipe -Wall -Wp,-D_FORTIFY_SOURCE=2 -fexceptions -fstack-protector --param=ssp-buffer-size=4 -m64 -mtune=generic   conftest.c  >&5
configure:25048: $? = 0
configure:25052: test -z 
			 || test ! -s conftest.err
configure:25055: $? = 0
configure:25058: test -s conftest
configure:25061: $? = 0
configure:25073: result: yes
configure:24985: checking for getcwd
configure:25042: gcc -o conftest -O2 -g -pipe -Wall -Wp,-D_FORTIFY_SOURCE=2 -fexceptions -fstack-protector --param=ssp-buffer-size=4 -m64 -mtune=generic   conftest.c  >&5
configure:25048: $? = 0
configure:25052: test -z 
			 || test ! -s conftest.err
configure:25055: $? = 0
configure:25058: test -s conftest
configure:25061: $? = 0
configure:25073: result: yes
configure:24985: checking for getegid
configure:25042: gcc -o conftest -O2 -g -pipe -Wall -Wp,-D_FORTIFY_SOURCE=2 -fexceptions -fstack-protector --param=ssp-buffer-size=4 -m64 -mtune=generic   conftest.c  >&5
configure:25048: $? = 0
configure:25052: test -z 
			 || test ! -s conftest.err
configure:25055: $? = 0
configure:25058: test -s conftest
configure:25061: $? = 0
configure:25073: result: yes
configure:24985: checking for geteuid
configure:25042: gcc -o conftest -O2 -g -pipe -Wall -Wp,-D_FORTIFY_SOURCE=2 -fexceptions -fstack-protector --param=ssp-buffer-size=4 -m64 -mtune=generic   conftest.c  >&5
configure:25048: $? = 0
configure:25052: test -z 
			 || test ! -s conftest.err
configure:25055: $? = 0
configure:25058: test -s conftest
configure:25061: $? = 0
configure:25073: result: yes
configure:24985: checking for getgid
configure:25042: gcc -o conftest -O2 -g -pipe -Wall -Wp,-D_FORTIFY_SOURCE=2 -fexceptions -fstack-protector --param=ssp-buffer-size=4 -m64 -mtune=generic   conftest.c  >&5
configure:25048: $? = 0
configure:25052: test -z 
			 || test ! -s conftest.err
configure:25055: $? = 0
configure:25058: test -s conftest
configure:25061: $? = 0
configure:25073: result: yes
configure:24985: checking for getuid
configure:25042: gcc -o conftest -O2 -g -pipe -Wall -Wp,-D_FORTIFY_SOURCE=2 -fexceptions -fstack-protector --param=ssp-buffer-size=4 -m64 -mtune=generic   conftest.c  >&5
configure:25048: $? = 0
configure:25052: test -z 
			 || test ! -s conftest.err
configure:25055: $? = 0
configure:25058: test -s conftest
configure:25061: $? = 0
configure:25073: result: yes
configure:24985: checking for mempcpy
configure:25042: gcc -o conftest -O2 -g -pipe -Wall -Wp,-D_FORTIFY_SOURCE=2 -fexceptions -fstack-protector --param=ssp-buffer-size=4 -m64 -mtune=generic   conftest.c  >&5
conftest.c:86: warning: conflicting types for built-in function 'mempcpy'
configure:25048: $? = 0
configure:25052: test -z 
			 || test ! -s conftest.err
configure:25055: $? = 0
configure:25058: test -s conftest
configure:25061: $? = 0
configure:25073: result: yes
configure:24985: checking for munmap
configure:25042: gcc -o conftest -O2 -g -pipe -Wall -Wp,-D_FORTIFY_SOURCE=2 -fexceptions -fstack-protector --param=ssp-buffer-size=4 -m64 -mtune=generic   conftest.c  >&5
configure:25048: $? = 0
configure:25052: test -z 
			 || test ! -s conftest.err
configure:25055: $? = 0
configure:25058: test -s conftest
configure:25061: $? = 0
configure:25073: result: yes
configure:24985: checking for putenv
configure:25042: gcc -o conftest -O2 -g -pipe -Wall -Wp,-D_FORTIFY_SOURCE=2 -fexceptions -fstack-protector --param=ssp-buffer-size=4 -m64 -mtune=generic   conftest.c  >&5
configure:25048: $? = 0
configure:25052: test -z 
			 || test ! -s conftest.err
configure:25055: $? = 0
configure:25058: test -s conftest
configure:25061: $? = 0
configure:25073: result: yes
configure:24985: checking for setenv
configure:25042: gcc -o conftest -O2 -g -pipe -Wall -Wp,-D_FORTIFY_SOURCE=2 -fexceptions -fstack-protector --param=ssp-buffer-size=4 -m64 -mtune=generic   conftest.c  >&5
configure:25048: $? = 0
configure:25052: test -z 
			 || test ! -s conftest.err
configure:25055: $? = 0
configure:25058: test -s conftest
configure:25061: $? = 0
configure:25073: result: yes
configure:24985: checking for setlocale
configure:25042: gcc -o conftest -O2 -g -pipe -Wall -Wp,-D_FORTIFY_SOURCE=2 -fexceptions -fstack-protector --param=ssp-buffer-size=4 -m64 -mtune=generic   conftest.c  >&5
configure:25048: $? = 0
configure:25052: test -z 
			 || test ! -s conftest.err
configure:25055: $? = 0
configure:25058: test -s conftest
configure:25061: $? = 0
configure:25073: result: yes
configure:24985: checking for snprintf
configure:25042: gcc -o conftest -O2 -g -pipe -Wall -Wp,-D_FORTIFY_SOURCE=2 -fexceptions -fstack-protector --param=ssp-buffer-size=4 -m64 -mtune=generic   conftest.c  >&5
conftest.c:91: warning: conflicting types for built-in function 'snprintf'
configure:25048: $? = 0
configure:25052: test -z 
			 || test ! -s conftest.err
configure:25055: $? = 0
configure:25058: test -s conftest
configure:25061: $? = 0
configure:25073: result: yes
configure:24985: checking for stpcpy
configure:25042: gcc -o conftest -O2 -g -pipe -Wall -Wp,-D_FORTIFY_SOURCE=2 -fexceptions -fstack-protector --param=ssp-buffer-size=4 -m64 -mtune=generic   conftest.c  >&5
conftest.c:92: warning: conflicting types for built-in function 'stpcpy'
configure:25048: $? = 0
configure:25052: test -z 
			 || test ! -s conftest.err
configure:25055: $? = 0
configure:25058: test -s conftest
configure:25061: $? = 0
configure:25073: result: yes
configure:24985: checking for strcasecmp
configure:25042: gcc -o conftest -O2 -g -pipe -Wall -Wp,-D_FORTIFY_SOURCE=2 -fexceptions -fstack-protector --param=ssp-buffer-size=4 -m64 -mtune=generic   conftest.c  >&5
conftest.c:93: warning: conflicting types for built-in function 'strcasecmp'
configure:25048: $? = 0
configure:25052: test -z 
			 || test ! -s conftest.err
configure:25055: $? = 0
configure:25058: test -s conftest
configure:25061: $? = 0
configure:25073: result: yes
configure:24985: checking for strdup
configure:25042: gcc -o conftest -O2 -g -pipe -Wall -Wp,-D_FORTIFY_SOURCE=2 -fexceptions -fstack-protector --param=ssp-buffer-size=4 -m64 -mtune=generic   conftest.c  >&5
conftest.c:94: warning: conflicting types for built-in function 'strdup'
configure:25048: $? = 0
configure:25052: test -z 
			 || test ! -s conftest.err
configure:25055: $? = 0
configure:25058: test -s conftest
configure:25061: $? = 0
configure:25073: result: yes
configure:24985: checking for strtoul
configure:25042: gcc -o conftest -O2 -g -pipe -Wall -Wp,-D_FORTIFY_SOURCE=2 -fexceptions -fstack-protector --param=ssp-buffer-size=4 -m64 -mtune=generic   conftest.c  >&5
configure:25048: $? = 0
configure:25052: test -z 
			 || test ! -s conftest.err
configure:25055: $? = 0
configure:25058: test -s conftest
configure:25061: $? = 0
configure:25073: result: yes
configure:24985: checking for tsearch
configure:25042: gcc -o conftest -O2 -g -pipe -Wall -Wp,-D_FORTIFY_SOURCE=2 -fexceptions -fstack-protector --param=ssp-buffer-size=4 -m64 -mtune=generic   conftest.c  >&5
configure:25048: $? = 0
configure:25052: test -z 
			 || test ! -s conftest.err
configure:25055: $? = 0
configure:25058: test -s conftest
configure:25061: $? = 0
configure:25073: result: yes
configure:24985: checking for wcslen
configure:25042: gcc -o conftest -O2 -g -pipe -Wall -Wp,-D_FORTIFY_SOURCE=2 -fexceptions -fstack-protector --param=ssp-buffer-size=4 -m64 -mtune=generic   conftest.c  >&5
configure:25048: $? = 0
configure:25052: test -z 
			 || test ! -s conftest.err
configure:25055: $? = 0
configure:25058: test -s conftest
configure:25061: $? = 0
configure:25073: result: yes
configure:24985: checking for __argz_count
configure:25042: gcc -o conftest -O2 -g -pipe -Wall -Wp,-D_FORTIFY_SOURCE=2 -fexceptions -fstack-protector --param=ssp-buffer-size=4 -m64 -mtune=generic   conftest.c  >&5
configure:25048: $? = 0
configure:25052: test -z 
			 || test ! -s conftest.err
configure:25055: $? = 0
configure:25058: test -s conftest
configure:25061: $? = 0
configure:25073: result: yes
configure:24985: checking for __argz_stringify
configure:25042: gcc -o conftest -O2 -g -pipe -Wall -Wp,-D_FORTIFY_SOURCE=2 -fexceptions -fstack-protector --param=ssp-buffer-size=4 -m64 -mtune=generic   conftest.c  >&5
configure:25048: $? = 0
configure:25052: test -z 
			 || test ! -s conftest.err
configure:25055: $? = 0
configure:25058: test -s conftest
configure:25061: $? = 0
configure:25073: result: yes
configure:24985: checking for __argz_next
configure:25042: gcc -o conftest -O2 -g -pipe -Wall -Wp,-D_FORTIFY_SOURCE=2 -fexceptions -fstack-protector --param=ssp-buffer-size=4 -m64 -mtune=generic   conftest.c  >&5
configure:25048: $? = 0
configure:25052: test -z 
			 || test ! -s conftest.err
configure:25055: $? = 0
configure:25058: test -s conftest
configure:25061: $? = 0
configure:25073: result: yes
configure:24985: checking for __fsetlocking
configure:25042: gcc -o conftest -O2 -g -pipe -Wall -Wp,-D_FORTIFY_SOURCE=2 -fexceptions -fstack-protector --param=ssp-buffer-size=4 -m64 -mtune=generic   conftest.c  >&5
configure:25048: $? = 0
configure:25052: test -z 
			 || test ! -s conftest.err
configure:25055: $? = 0
configure:25058: test -s conftest
configure:25061: $? = 0
configure:25073: result: yes
configure:25085: checking whether _snprintf is declared
configure:25110: gcc -c -O2 -g -pipe -Wall -Wp,-D_FORTIFY_SOURCE=2 -fexceptions -fstack-protector --param=ssp-buffer-size=4 -m64 -mtune=generic  conftest.c >&5
conftest.c: In function 'main':
conftest.c:84: error: '_snprintf' undeclared (first use in this function)
conftest.c:84: error: (Each undeclared identifier is reported only once
conftest.c:84: error: for each function it appears in.)
conftest.c:84: warning: unused variable 'p'
configure:25116: $? = 1
configure: failed program was:
| /* confdefs.h.  */
| 
| #define PACKAGE_NAME "TiLP2"
| #define PACKAGE_TARNAME "tilp2"
| #define PACKAGE_VERSION "1.04"
| #define PACKAGE_STRING "TiLP2 1.04"
| #define PACKAGE_BUGREPORT "tilp-users@lists.sourceforge.net"
| #define PACKAGE "tilp2"
| #define VERSION "1.04"
| #define STDC_HEADERS 1
| #define HAVE_SYS_TYPES_H 1
| #define HAVE_SYS_STAT_H 1
| #define HAVE_STDLIB_H 1
| #define HAVE_STRING_H 1
| #define HAVE_MEMORY_H 1
| #define HAVE_STRINGS_H 1
| #define HAVE_INTTYPES_H 1
| #define HAVE_STDINT_H 1
| #define HAVE_UNISTD_H 1
| #define HAVE_DLFCN_H 1
| #ifdef __cplusplus
| extern "C" void std::exit (int) throw (); using std::exit;
| #endif
| #define HAVE_LONG_LONG 1
| #define HAVE_LONG_DOUBLE 1
| #define HAVE_WCHAR_T 1
| #define HAVE_WINT_T 1
| #define HAVE_INTTYPES_H_WITH_UINTMAX 1
| #define HAVE_STDINT_H_WITH_UINTMAX 1
| #define HAVE_INTMAX_T 1
| #define HAVE_POSIX_PRINTF 1
| #define HAVE_ALLOCA_H 1
| #define HAVE_ALLOCA 1
| #define HAVE_STDLIB_H 1
| #define HAVE_UNISTD_H 1
| #define HAVE_GETPAGESIZE 1
| #define HAVE_MMAP 1
| #define INTDIV0_RAISES_SIGFPE 1
| #define HAVE_UNSIGNED_LONG_LONG 1
| #define HAVE_UINTMAX_T 1
| #define HAVE_INTTYPES_H 1
| #define HAVE_STDINT_H 1
| #define HAVE_STDINT_H 1
| #define HAVE_ARGZ_H 1
| #define HAVE_LIMITS_H 1
| #define HAVE_LOCALE_H 1
| #define HAVE_NL_TYPES_H 1
| #define HAVE_MALLOC_H 1
| #define HAVE_STDDEF_H 1
| #define HAVE_STDLIB_H 1
| #define HAVE_STRING_H 1
| #define HAVE_UNISTD_H 1
| #define HAVE_SYS_PARAM_H 1
| #define HAVE_ASPRINTF 1
| #define HAVE_FWPRINTF 1
| #define HAVE_GETCWD 1
| #define HAVE_GETEGID 1
| #define HAVE_GETEUID 1
| #define HAVE_GETGID 1
| #define HAVE_GETUID 1
| #define HAVE_MEMPCPY 1
| #define HAVE_MUNMAP 1
| #define HAVE_PUTENV 1
| #define HAVE_SETENV 1
| #define HAVE_SETLOCALE 1
| #define HAVE_SNPRINTF 1
| #define HAVE_STPCPY 1
| #define HAVE_STRCASECMP 1
| #define HAVE_STRDUP 1
| #define HAVE_STRTOUL 1
| #define HAVE_TSEARCH 1
| #define HAVE_WCSLEN 1
| #define HAVE___ARGZ_COUNT 1
| #define HAVE___ARGZ_STRINGIFY 1
| #define HAVE___ARGZ_NEXT 1
| #define HAVE___FSETLOCKING 1
| /* end confdefs.h.  */
| #include <stdio.h>
| int
| main ()
| {
| 
| #ifndef _snprintf
|   char *p = (char *) _snprintf;
| #endif
| 
|   ;
|   return 0;
| }
configure:25140: result: no
configure:25154: checking whether _snwprintf is declared
configure:25179: gcc -c -O2 -g -pipe -Wall -Wp,-D_FORTIFY_SOURCE=2 -fexceptions -fstack-protector --param=ssp-buffer-size=4 -m64 -mtune=generic  conftest.c >&5
conftest.c: In function 'main':
conftest.c:85: error: '_snwprintf' undeclared (first use in this function)
conftest.c:85: error: (Each undeclared identifier is reported only once
conftest.c:85: error: for each function it appears in.)
conftest.c:85: warning: unused variable 'p'
configure:25185: $? = 1
configure: failed program was:
| /* confdefs.h.  */
| 
| #define PACKAGE_NAME "TiLP2"
| #define PACKAGE_TARNAME "tilp2"
| #define PACKAGE_VERSION "1.04"
| #define PACKAGE_STRING "TiLP2 1.04"
| #define PACKAGE_BUGREPORT "tilp-users@lists.sourceforge.net"
| #define PACKAGE "tilp2"
| #define VERSION "1.04"
| #define STDC_HEADERS 1
| #define HAVE_SYS_TYPES_H 1
| #define HAVE_SYS_STAT_H 1
| #define HAVE_STDLIB_H 1
| #define HAVE_STRING_H 1
| #define HAVE_MEMORY_H 1
| #define HAVE_STRINGS_H 1
| #define HAVE_INTTYPES_H 1
| #define HAVE_STDINT_H 1
| #define HAVE_UNISTD_H 1
| #define HAVE_DLFCN_H 1
| #ifdef __cplusplus
| extern "C" void std::exit (int) throw (); using std::exit;
| #endif
| #define HAVE_LONG_LONG 1
| #define HAVE_LONG_DOUBLE 1
| #define HAVE_WCHAR_T 1
| #define HAVE_WINT_T 1
| #define HAVE_INTTYPES_H_WITH_UINTMAX 1
| #define HAVE_STDINT_H_WITH_UINTMAX 1
| #define HAVE_INTMAX_T 1
| #define HAVE_POSIX_PRINTF 1
| #define HAVE_ALLOCA_H 1
| #define HAVE_ALLOCA 1
| #define HAVE_STDLIB_H 1
| #define HAVE_UNISTD_H 1
| #define HAVE_GETPAGESIZE 1
| #define HAVE_MMAP 1
| #define INTDIV0_RAISES_SIGFPE 1
| #define HAVE_UNSIGNED_LONG_LONG 1
| #define HAVE_UINTMAX_T 1
| #define HAVE_INTTYPES_H 1
| #define HAVE_STDINT_H 1
| #define HAVE_STDINT_H 1
| #define HAVE_ARGZ_H 1
| #define HAVE_LIMITS_H 1
| #define HAVE_LOCALE_H 1
| #define HAVE_NL_TYPES_H 1
| #define HAVE_MALLOC_H 1
| #define HAVE_STDDEF_H 1
| #define HAVE_STDLIB_H 1
| #define HAVE_STRING_H 1
| #define HAVE_UNISTD_H 1
| #define HAVE_SYS_PARAM_H 1
| #define HAVE_ASPRINTF 1
| #define HAVE_FWPRINTF 1
| #define HAVE_GETCWD 1
| #define HAVE_GETEGID 1
| #define HAVE_GETEUID 1
| #define HAVE_GETGID 1
| #define HAVE_GETUID 1
| #define HAVE_MEMPCPY 1
| #define HAVE_MUNMAP 1
| #define HAVE_PUTENV 1
| #define HAVE_SETENV 1
| #define HAVE_SETLOCALE 1
| #define HAVE_SNPRINTF 1
| #define HAVE_STPCPY 1
| #define HAVE_STRCASECMP 1
| #define HAVE_STRDUP 1
| #define HAVE_STRTOUL 1
| #define HAVE_TSEARCH 1
| #define HAVE_WCSLEN 1
| #define HAVE___ARGZ_COUNT 1
| #define HAVE___ARGZ_STRINGIFY 1
| #define HAVE___ARGZ_NEXT 1
| #define HAVE___FSETLOCKING 1
| #define HAVE_DECL__SNPRINTF 0
| /* end confdefs.h.  */
| #include <stdio.h>
| int
| main ()
| {
| 
| #ifndef _snwprintf
|   char *p = (char *) _snwprintf;
| #endif
| 
|   ;
|   return 0;
| }
configure:25209: result: no
configure:25224: checking whether feof_unlocked is declared
configure:25249: gcc -c -O2 -g -pipe -Wall -Wp,-D_FORTIFY_SOURCE=2 -fexceptions -fstack-protector --param=ssp-buffer-size=4 -m64 -mtune=generic  conftest.c >&5
conftest.c: In function 'main':
conftest.c:86: warning: unused variable 'p'
configure:25255: $? = 0
configure:25259: test -z 
			 || test ! -s conftest.err
configure:25262: $? = 0
configure:25265: test -s conftest.o
configure:25268: $? = 0
configure:25279: result: yes
configure:25293: checking whether fgets_unlocked is declared
configure:25318: gcc -c -O2 -g -pipe -Wall -Wp,-D_FORTIFY_SOURCE=2 -fexceptions -fstack-protector --param=ssp-buffer-size=4 -m64 -mtune=generic  conftest.c >&5
conftest.c: In function 'main':
conftest.c:87: error: 'fgets_unlocked' undeclared (first use in this function)
conftest.c:87: error: (Each undeclared identifier is reported only once
conftest.c:87: error: for each function it appears in.)
conftest.c:87: warning: unused variable 'p'
configure:25324: $? = 1
configure: failed program was:
| /* confdefs.h.  */
| 
| #define PACKAGE_NAME "TiLP2"
| #define PACKAGE_TARNAME "tilp2"
| #define PACKAGE_VERSION "1.04"
| #define PACKAGE_STRING "TiLP2 1.04"
| #define PACKAGE_BUGREPORT "tilp-users@lists.sourceforge.net"
| #define PACKAGE "tilp2"
| #define VERSION "1.04"
| #define STDC_HEADERS 1
| #define HAVE_SYS_TYPES_H 1
| #define HAVE_SYS_STAT_H 1
| #define HAVE_STDLIB_H 1
| #define HAVE_STRING_H 1
| #define HAVE_MEMORY_H 1
| #define HAVE_STRINGS_H 1
| #define HAVE_INTTYPES_H 1
| #define HAVE_STDINT_H 1
| #define HAVE_UNISTD_H 1
| #define HAVE_DLFCN_H 1
| #ifdef __cplusplus
| extern "C" void std::exit (int) throw (); using std::exit;
| #endif
| #define HAVE_LONG_LONG 1
| #define HAVE_LONG_DOUBLE 1
| #define HAVE_WCHAR_T 1
| #define HAVE_WINT_T 1
| #define HAVE_INTTYPES_H_WITH_UINTMAX 1
| #define HAVE_STDINT_H_WITH_UINTMAX 1
| #define HAVE_INTMAX_T 1
| #define HAVE_POSIX_PRINTF 1
| #define HAVE_ALLOCA_H 1
| #define HAVE_ALLOCA 1
| #define HAVE_STDLIB_H 1
| #define HAVE_UNISTD_H 1
| #define HAVE_GETPAGESIZE 1
| #define HAVE_MMAP 1
| #define INTDIV0_RAISES_SIGFPE 1
| #define HAVE_UNSIGNED_LONG_LONG 1
| #define HAVE_UINTMAX_T 1
| #define HAVE_INTTYPES_H 1
| #define HAVE_STDINT_H 1
| #define HAVE_STDINT_H 1
| #define HAVE_ARGZ_H 1
| #define HAVE_LIMITS_H 1
| #define HAVE_LOCALE_H 1
| #define HAVE_NL_TYPES_H 1
| #define HAVE_MALLOC_H 1
| #define HAVE_STDDEF_H 1
| #define HAVE_STDLIB_H 1
| #define HAVE_STRING_H 1
| #define HAVE_UNISTD_H 1
| #define HAVE_SYS_PARAM_H 1
| #define HAVE_ASPRINTF 1
| #define HAVE_FWPRINTF 1
| #define HAVE_GETCWD 1
| #define HAVE_GETEGID 1
| #define HAVE_GETEUID 1
| #define HAVE_GETGID 1
| #define HAVE_GETUID 1
| #define HAVE_MEMPCPY 1
| #define HAVE_MUNMAP 1
| #define HAVE_PUTENV 1
| #define HAVE_SETENV 1
| #define HAVE_SETLOCALE 1
| #define HAVE_SNPRINTF 1
| #define HAVE_STPCPY 1
| #define HAVE_STRCASECMP 1
| #define HAVE_STRDUP 1
| #define HAVE_STRTOUL 1
| #define HAVE_TSEARCH 1
| #define HAVE_WCSLEN 1
| #define HAVE___ARGZ_COUNT 1
| #define HAVE___ARGZ_STRINGIFY 1
| #define HAVE___ARGZ_NEXT 1
| #define HAVE___FSETLOCKING 1
| #define HAVE_DECL__SNPRINTF 0
| #define HAVE_DECL__SNWPRINTF 0
| #define HAVE_DECL_FEOF_UNLOCKED 1
| /* end confdefs.h.  */
| #include <stdio.h>
| int
| main ()
| {
| 
| #ifndef fgets_unlocked
|   char *p = (char *) fgets_unlocked;
| #endif
| 
|   ;
|   return 0;
| }
configure:25348: result: no
configure:25362: checking whether getc_unlocked is declared
configure:25387: gcc -c -O2 -g -pipe -Wall -Wp,-D_FORTIFY_SOURCE=2 -fexceptions -fstack-protector --param=ssp-buffer-size=4 -m64 -mtune=generic  conftest.c >&5
conftest.c: In function 'main':
conftest.c:88: warning: unused variable 'p'
configure:25393: $? = 0
configure:25397: test -z 
			 || test ! -s conftest.err
configure:25400: $? = 0
configure:25403: test -s conftest.o
configure:25406: $? = 0
configure:25417: result: yes
configure:25485: checking for iconv
configure:25512: gcc -o conftest -O2 -g -pipe -Wall -Wp,-D_FORTIFY_SOURCE=2 -fexceptions -fstack-protector --param=ssp-buffer-size=4 -m64 -mtune=generic   conftest.c  >&5
configure:25518: $? = 0
configure:25522: test -z 
			 || test ! -s conftest.err
configure:25525: $? = 0
configure:25528: test -s conftest
configure:25531: $? = 0
configure:25597: result: yes
configure:25620: checking for iconv declaration
configure:25654: gcc -c -O2 -g -pipe -Wall -Wp,-D_FORTIFY_SOURCE=2 -fexceptions -fstack-protector --param=ssp-buffer-size=4 -m64 -mtune=generic  conftest.c >&5
configure:25660: $? = 0
configure:25664: test -z 
			 || test ! -s conftest.err
configure:25667: $? = 0
configure:25670: test -s conftest.o
configure:25673: $? = 0
configure:25688: result: 
         extern size_t iconv (iconv_t cd, char * *inbuf, size_t *inbytesleft, char * *outbuf, size_t *outbytesleft);
configure:25699: checking for nl_langinfo and CODESET
configure:25720: gcc -o conftest -O2 -g -pipe -Wall -Wp,-D_FORTIFY_SOURCE=2 -fexceptions -fstack-protector --param=ssp-buffer-size=4 -m64 -mtune=generic   conftest.c  >&5
conftest.c: In function 'main':
conftest.c:89: warning: unused variable 'cs'
configure:25726: $? = 0
configure:25730: test -z 
			 || test ! -s conftest.err
configure:25733: $? = 0
configure:25736: test -s conftest
configure:25739: $? = 0
configure:25752: result: yes
configure:25764: checking for LC_MESSAGES
configure:25785: gcc -o conftest -O2 -g -pipe -Wall -Wp,-D_FORTIFY_SOURCE=2 -fexceptions -fstack-protector --param=ssp-buffer-size=4 -m64 -mtune=generic   conftest.c  >&5
configure:25791: $? = 0
configure:25795: test -z 
			 || test ! -s conftest.err
configure:25798: $? = 0
configure:25801: test -s conftest
configure:25804: $? = 0
configure:25816: result: yes
configure:25836: checking for bison
configure:25852: found /usr/bin/bison
configure:25862: result: bison
configure:25875: checking version of bison
configure:25884: result: 2.3, ok
configure:25906: checking for CFPreferencesCopyAppValue
configure:25964: result: no
configure:25973: checking for CFLocaleCopyCurrent
configure:26031: result: no
configure:26048: checking whether NLS is requested
configure:26057: result: no
configure:26711: checking whether to use NLS
configure:26713: result: no
configure:26867: checking for pkg-config
configure:26885: found /usr/bin/pkg-config
configure:26897: result: /usr/bin/pkg-config
configure:26912: checking pkg-config is at least version 0.9.0
configure:26915: result: yes
configure:26926: checking for TICABLES
configure:26934: $PKG_CONFIG --exists --print-errors "ticables2 >= 1.0.4"
configure:26937: $? = 0
configure:26952: $PKG_CONFIG --exists --print-errors "ticables2 >= 1.0.4"
configure:26955: $? = 0
configure:27031: result: yes
configure:27040: checking for TICALCS
configure:27048: $PKG_CONFIG --exists --print-errors "ticalcs2 >= 1.0.5"
configure:27051: $? = 0
configure:27066: $PKG_CONFIG --exists --print-errors "ticalcs2 >= 1.0.5"
configure:27069: $? = 0
configure:27145: result: yes
configure:27154: checking for TIFILES
configure:27162: $PKG_CONFIG --exists --print-errors "tifiles2 >= 1.0.4"
configure:27165: $? = 0
configure:27180: $PKG_CONFIG --exists --print-errors "tifiles2 >= 1.0.4"
configure:27183: $? = 0
configure:27259: result: yes
configure:27268: checking for TICONV
configure:27276: $PKG_CONFIG --exists --print-errors "ticonv >= 1.0.0"
configure:27279: $? = 0
configure:27294: $PKG_CONFIG --exists --print-errors "ticonv >= 1.0.0"
configure:27297: $? = 0
configure:27373: result: yes
configure:27382: checking for GLIB
configure:27390: $PKG_CONFIG --exists --print-errors "glib-2.0 >= 2.6.0"
configure:27393: $? = 0
configure:27408: $PKG_CONFIG --exists --print-errors "glib-2.0 >= 2.6.0"
configure:27411: $? = 0
configure:27487: result: yes
configure:27496: checking for GTK
configure:27504: $PKG_CONFIG --exists --print-errors "gtk+-2.0 >= 2.6.0"
configure:27507: $? = 0
configure:27522: $PKG_CONFIG --exists --print-errors "gtk+-2.0 >= 2.6.0"
configure:27525: $? = 0
configure:27601: result: yes
configure:27610: checking for GLADE
configure:27618: $PKG_CONFIG --exists --print-errors "libglade-2.0 >= 2.4.0"
configure:27621: $? = 0
configure:27636: $PKG_CONFIG --exists --print-errors "libglade-2.0 >= 2.4.0"
configure:27639: $? = 0
configure:27715: result: yes
configure:27733: checking zlib.h usability
configure:27745: gcc -c -O2 -g -pipe -Wall -Wp,-D_FORTIFY_SOURCE=2 -fexceptions -fstack-protector --param=ssp-buffer-size=4 -m64 -mtune=generic  conftest.c >&5
configure:27751: $? = 0
configure:27755: test -z 
			 || test ! -s conftest.err
configure:27758: $? = 0
configure:27761: test -s conftest.o
configure:27764: $? = 0
configure:27774: result: yes
configure:27778: checking zlib.h presence
configure:27788: gcc -E  conftest.c
configure:27794: $? = 0
configure:27814: result: yes
configure:27849: checking for zlib.h
configure:27856: result: yes
configure:27863: checking for compress in -lz
configure:27893: gcc -o conftest -O2 -g -pipe -Wall -Wp,-D_FORTIFY_SOURCE=2 -fexceptions -fstack-protector --param=ssp-buffer-size=4 -m64 -mtune=generic   conftest.c -lz   >&5
configure:27899: $? = 0
configure:27903: test -z 
			 || test ! -s conftest.err
configure:27906: $? = 0
configure:27909: test -s conftest
configure:27912: $? = 0
configure:27925: result: yes
configure:27945: checking for ANSI C header files
configure:28101: result: yes
configure:28118: checking for stdlib.h
configure:28123: result: yes
configure:28118: checking for string.h
configure:28123: result: yes
configure:28118: checking for unistd.h
configure:28123: result: yes
configure:28279: checking tilp2/ticables.h usability
configure:28291: gcc -c -O2 -g -pipe -Wall -Wp,-D_FORTIFY_SOURCE=2 -fexceptions -fstack-protector --param=ssp-buffer-size=4 -m64 -mtune=generic  conftest.c >&5
configure:28297: $? = 0
configure:28301: test -z 
			 || test ! -s conftest.err
configure:28304: $? = 0
configure:28307: test -s conftest.o
configure:28310: $? = 0
configure:28320: result: yes
configure:28324: checking tilp2/ticables.h presence
configure:28334: gcc -E  conftest.c
configure:28340: $? = 0
configure:28360: result: yes
configure:28395: checking for tilp2/ticables.h
configure:28402: result: yes
configure:28279: checking tilp2/ticalcs.h usability
configure:28291: gcc -c -O2 -g -pipe -Wall -Wp,-D_FORTIFY_SOURCE=2 -fexceptions -fstack-protector --param=ssp-buffer-size=4 -m64 -mtune=generic  conftest.c >&5
In file included from conftest.c:127:
/usr/include/tilp2/ticalcs.h:29:22: error: ticables.h: No such file or directory
/usr/include/tilp2/ticalcs.h:30:21: error: tifiles.h: No such file or directory
In file included from conftest.c:127:
/usr/include/tilp2/ticalcs.h:454: error: expected '=', ',', ';', 'asm' or '__attribute__' before 'VarRequest'
/usr/include/tilp2/ticalcs.h:537: error: expected declaration specifiers or '...' before 'VarEntry'
/usr/include/tilp2/ticalcs.h:544: error: expected declaration specifiers or '...' before 'BackupContent'
/usr/include/tilp2/ticalcs.h:545: error: expected declaration specifiers or '...' before 'BackupContent'
/usr/include/tilp2/ticalcs.h:547: error: expected declaration specifiers or '...' before 'FileContent'
/usr/include/tilp2/ticalcs.h:548: error: expected declaration specifiers or '...' before 'FileContent'
/usr/include/tilp2/ticalcs.h:548: error: expected declaration specifiers or '...' before 'VarRequest'
/usr/include/tilp2/ticalcs.h:550: error: expected declaration specifiers or '...' before 'FileContent'
/usr/include/tilp2/ticalcs.h:551: error: expected declaration specifiers or '...' before 'FileContent'
/usr/include/tilp2/ticalcs.h:551: error: expected declaration specifiers or '...' before 'VarEntry'
/usr/include/tilp2/ticalcs.h:553: error: expected declaration specifiers or '...' before 'FlashContent'
/usr/include/tilp2/ticalcs.h:554: error: expected declaration specifiers or '...' before 'FlashContent'
/usr/include/tilp2/ticalcs.h:554: error: expected declaration specifiers or '...' before 'VarRequest'
/usr/include/tilp2/ticalcs.h:556: error: expected declaration specifiers or '...' before 'FlashContent'
/usr/include/tilp2/ticalcs.h:565: error: expected declaration specifiers or '...' before 'VarRequest'
/usr/include/tilp2/ticalcs.h:566: error: expected declaration specifiers or '...' before 'VarRequest'
/usr/include/tilp2/ticalcs.h:570: error: expected declaration specifiers or '...' before 'FlashContent'
/usr/include/tilp2/ticalcs.h:571: error: expected declaration specifiers or '...' before 'FlashContent'
/usr/include/tilp2/ticalcs.h:603: error: expected specifier-qualifier-list before 'CableHandle'
/usr/include/tilp2/ticalcs.h:619: error: expected specifier-qualifier-list before 'CableModel'
/usr/include/tilp2/ticalcs.h:651: error: expected declaration specifiers or '...' before 'CableHandle'
/usr/include/tilp2/ticalcs.h:662: error: expected declaration specifiers or '...' before 'VarEntry'
/usr/include/tilp2/ticalcs.h:670: error: expected declaration specifiers or '...' before 'BackupContent'
/usr/include/tilp2/ticalcs.h:671: error: expected declaration specifiers or '...' before 'BackupContent'
/usr/include/tilp2/ticalcs.h:673: error: expected declaration specifiers or '...' before 'FileContent'
/usr/include/tilp2/ticalcs.h:674: error: expected declaration specifiers or '...' before 'FileContent'
/usr/include/tilp2/ticalcs.h:674: error: expected declaration specifiers or '...' before 'VarRequest'
/usr/include/tilp2/ticalcs.h:676: error: expected declaration specifiers or '...' before 'FileContent'
/usr/include/tilp2/ticalcs.h:677: error: expected declaration specifiers or '...' before 'FileContent'
/usr/include/tilp2/ticalcs.h:677: error: expected declaration specifiers or '...' before 'VarEntry'
/usr/include/tilp2/ticalcs.h:679: error: expected declaration specifiers or '...' before 'FlashContent'
/usr/include/tilp2/ticalcs.h:680: error: expected declaration specifiers or '...' before 'FlashContent'
/usr/include/tilp2/ticalcs.h:680: error: expected declaration specifiers or '...' before 'VarRequest'
/usr/include/tilp2/ticalcs.h:682: error: expected declaration specifiers or '...' before 'FlashContent'
/usr/include/tilp2/ticalcs.h:691: error: expected declaration specifiers or '...' before 'VarRequest'
/usr/include/tilp2/ticalcs.h:692: error: expected declaration specifiers or '...' before 'VarRequest'
/usr/include/tilp2/ticalcs.h:695: error: expected declaration specifiers or '...' before 'FlashContent'
/usr/include/tilp2/ticalcs.h:696: error: expected declaration specifiers or '...' before 'FlashContent'
/usr/include/tilp2/ticalcs.h:698: error: expected declaration specifiers or '...' before 'TigContent'
/usr/include/tilp2/ticalcs.h:699: error: expected declaration specifiers or '...' before 'TigContent'
/usr/include/tilp2/ticalcs.h:706: error: expected declaration specifiers or '...' before 'VarRequest'
/usr/include/tilp2/ticalcs.h:709: error: expected declaration specifiers or '...' before 'VarEntry'
/usr/include/tilp2/ticalcs.h:712: error: expected declaration specifiers or '...' before 'VarRequest'
/usr/include/tilp2/ticalcs.h:730: error: expected '=', ',', ';', 'asm' or '__attribute__' before '*' token
/usr/include/tilp2/ticalcs.h:731: error: expected declaration specifiers or '...' before 'VarEntry'
/usr/include/tilp2/ticalcs.h:732: error: expected declaration specifiers or '...' before 'VarEntry'
/usr/include/tilp2/ticalcs.h:761: error: expected ')' before '*' token
/usr/include/tilp2/ticalcs.h:762: error: expected ')' before '*' token
/usr/include/tilp2/ticalcs.h:764: error: expected ')' before 'c_model'
configure:28297: $? = 1
configure: failed program was:
| /* confdefs.h.  */
| 
| #define PACKAGE_NAME "TiLP2"
| #define PACKAGE_TARNAME "tilp2"
| #define PACKAGE_VERSION "1.04"
| #define PACKAGE_STRING "TiLP2 1.04"
| #define PACKAGE_BUGREPORT "tilp-users@lists.sourceforge.net"
| #define PACKAGE "tilp2"
| #define VERSION "1.04"
| #define STDC_HEADERS 1
| #define HAVE_SYS_TYPES_H 1
| #define HAVE_SYS_STAT_H 1
| #define HAVE_STDLIB_H 1
| #define HAVE_STRING_H 1
| #define HAVE_MEMORY_H 1
| #define HAVE_STRINGS_H 1
| #define HAVE_INTTYPES_H 1
| #define HAVE_STDINT_H 1
| #define HAVE_UNISTD_H 1
| #define HAVE_DLFCN_H 1
| #ifdef __cplusplus
| extern "C" void std::exit (int) throw (); using std::exit;
| #endif
| #define HAVE_LONG_LONG 1
| #define HAVE_LONG_DOUBLE 1
| #define HAVE_WCHAR_T 1
| #define HAVE_WINT_T 1
| #define HAVE_INTTYPES_H_WITH_UINTMAX 1
| #define HAVE_STDINT_H_WITH_UINTMAX 1
| #define HAVE_INTMAX_T 1
| #define HAVE_POSIX_PRINTF 1
| #define HAVE_ALLOCA_H 1
| #define HAVE_ALLOCA 1
| #define HAVE_STDLIB_H 1
| #define HAVE_UNISTD_H 1
| #define HAVE_GETPAGESIZE 1
| #define HAVE_MMAP 1
| #define INTDIV0_RAISES_SIGFPE 1
| #define HAVE_UNSIGNED_LONG_LONG 1
| #define HAVE_UINTMAX_T 1
| #define HAVE_INTTYPES_H 1
| #define HAVE_STDINT_H 1
| #define HAVE_STDINT_H 1
| #define HAVE_ARGZ_H 1
| #define HAVE_LIMITS_H 1
| #define HAVE_LOCALE_H 1
| #define HAVE_NL_TYPES_H 1
| #define HAVE_MALLOC_H 1
| #define HAVE_STDDEF_H 1
| #define HAVE_STDLIB_H 1
| #define HAVE_STRING_H 1
| #define HAVE_UNISTD_H 1
| #define HAVE_SYS_PARAM_H 1
| #define HAVE_ASPRINTF 1
| #define HAVE_FWPRINTF 1
| #define HAVE_GETCWD 1
| #define HAVE_GETEGID 1
| #define HAVE_GETEUID 1
| #define HAVE_GETGID 1
| #define HAVE_GETUID 1
| #define HAVE_MEMPCPY 1
| #define HAVE_MUNMAP 1
| #define HAVE_PUTENV 1
| #define HAVE_SETENV 1
| #define HAVE_SETLOCALE 1
| #define HAVE_SNPRINTF 1
| #define HAVE_STPCPY 1
| #define HAVE_STRCASECMP 1
| #define HAVE_STRDUP 1
| #define HAVE_STRTOUL 1
| #define HAVE_TSEARCH 1
| #define HAVE_WCSLEN 1
| #define HAVE___ARGZ_COUNT 1
| #define HAVE___ARGZ_STRINGIFY 1
| #define HAVE___ARGZ_NEXT 1
| #define HAVE___FSETLOCKING 1
| #define HAVE_DECL__SNPRINTF 0
| #define HAVE_DECL__SNWPRINTF 0
| #define HAVE_DECL_FEOF_UNLOCKED 1
| #define HAVE_DECL_FGETS_UNLOCKED 0
| #define HAVE_DECL_GETC_UNLOCKED 1
| #define HAVE_ICONV 1
| #define ICONV_CONST 
| #define HAVE_LANGINFO_CODESET 1
| #define HAVE_LC_MESSAGES 1
| #define HAVE_LIBZ 1
| #define STDC_HEADERS 1
| #define HAVE_STDLIB_H 1
| #define HAVE_STRING_H 1
| #define HAVE_UNISTD_H 1
| #define HAVE_TILP2_TICABLES_H 1
| /* end confdefs.h.  */
| #include <stdio.h>
| #if HAVE_SYS_TYPES_H
| # include <sys/types.h>
| #endif
| #if HAVE_SYS_STAT_H
| # include <sys/stat.h>
| #endif
| #if STDC_HEADERS
| # include <stdlib.h>
| # include <stddef.h>
| #else
| # if HAVE_STDLIB_H
| #  include <stdlib.h>
| # endif
| #endif
| #if HAVE_STRING_H
| # if !STDC_HEADERS && HAVE_MEMORY_H
| #  include <memory.h>
| # endif
| # include <string.h>
| #endif
| #if HAVE_STRINGS_H
| # include <strings.h>
| #endif
| #if HAVE_INTTYPES_H
| # include <inttypes.h>
| #else
| # if HAVE_STDINT_H
| #  include <stdint.h>
| # endif
| #endif
| #if HAVE_UNISTD_H
| # include <unistd.h>
| #endif
| #include <tilp2/ticalcs.h>
configure:28320: result: no
configure:28324: checking tilp2/ticalcs.h presence
configure:28334: gcc -E  conftest.c
In file included from conftest.c:93:
/usr/include/tilp2/ticalcs.h:29:22: error: ticables.h: No such file or directory
/usr/include/tilp2/ticalcs.h:30:21: error: tifiles.h: No such file or directory
configure:28340: $? = 1
configure: failed program was:
| /* confdefs.h.  */
| 
| #define PACKAGE_NAME "TiLP2"
| #define PACKAGE_TARNAME "tilp2"
| #define PACKAGE_VERSION "1.04"
| #define PACKAGE_STRING "TiLP2 1.04"
| #define PACKAGE_BUGREPORT "tilp-users@lists.sourceforge.net"
| #define PACKAGE "tilp2"
| #define VERSION "1.04"
| #define STDC_HEADERS 1
| #define HAVE_SYS_TYPES_H 1
| #define HAVE_SYS_STAT_H 1
| #define HAVE_STDLIB_H 1
| #define HAVE_STRING_H 1
| #define HAVE_MEMORY_H 1
| #define HAVE_STRINGS_H 1
| #define HAVE_INTTYPES_H 1
| #define HAVE_STDINT_H 1
| #define HAVE_UNISTD_H 1
| #define HAVE_DLFCN_H 1
| #ifdef __cplusplus
| extern "C" void std::exit (int) throw (); using std::exit;
| #endif
| #define HAVE_LONG_LONG 1
| #define HAVE_LONG_DOUBLE 1
| #define HAVE_WCHAR_T 1
| #define HAVE_WINT_T 1
| #define HAVE_INTTYPES_H_WITH_UINTMAX 1
| #define HAVE_STDINT_H_WITH_UINTMAX 1
| #define HAVE_INTMAX_T 1
| #define HAVE_POSIX_PRINTF 1
| #define HAVE_ALLOCA_H 1
| #define HAVE_ALLOCA 1
| #define HAVE_STDLIB_H 1
| #define HAVE_UNISTD_H 1
| #define HAVE_GETPAGESIZE 1
| #define HAVE_MMAP 1
| #define INTDIV0_RAISES_SIGFPE 1
| #define HAVE_UNSIGNED_LONG_LONG 1
| #define HAVE_UINTMAX_T 1
| #define HAVE_INTTYPES_H 1
| #define HAVE_STDINT_H 1
| #define HAVE_STDINT_H 1
| #define HAVE_ARGZ_H 1
| #define HAVE_LIMITS_H 1
| #define HAVE_LOCALE_H 1
| #define HAVE_NL_TYPES_H 1
| #define HAVE_MALLOC_H 1
| #define HAVE_STDDEF_H 1
| #define HAVE_STDLIB_H 1
| #define HAVE_STRING_H 1
| #define HAVE_UNISTD_H 1
| #define HAVE_SYS_PARAM_H 1
| #define HAVE_ASPRINTF 1
| #define HAVE_FWPRINTF 1
| #define HAVE_GETCWD 1
| #define HAVE_GETEGID 1
| #define HAVE_GETEUID 1
| #define HAVE_GETGID 1
| #define HAVE_GETUID 1
| #define HAVE_MEMPCPY 1
| #define HAVE_MUNMAP 1
| #define HAVE_PUTENV 1
| #define HAVE_SETENV 1
| #define HAVE_SETLOCALE 1
| #define HAVE_SNPRINTF 1
| #define HAVE_STPCPY 1
| #define HAVE_STRCASECMP 1
| #define HAVE_STRDUP 1
| #define HAVE_STRTOUL 1
| #define HAVE_TSEARCH 1
| #define HAVE_WCSLEN 1
| #define HAVE___ARGZ_COUNT 1
| #define HAVE___ARGZ_STRINGIFY 1
| #define HAVE___ARGZ_NEXT 1
| #define HAVE___FSETLOCKING 1
| #define HAVE_DECL__SNPRINTF 0
| #define HAVE_DECL__SNWPRINTF 0
| #define HAVE_DECL_FEOF_UNLOCKED 1
| #define HAVE_DECL_FGETS_UNLOCKED 0
| #define HAVE_DECL_GETC_UNLOCKED 1
| #define HAVE_ICONV 1
| #define ICONV_CONST 
| #define HAVE_LANGINFO_CODESET 1
| #define HAVE_LC_MESSAGES 1
| #define HAVE_LIBZ 1
| #define STDC_HEADERS 1
| #define HAVE_STDLIB_H 1
| #define HAVE_STRING_H 1
| #define HAVE_UNISTD_H 1
| #define HAVE_TILP2_TICABLES_H 1
| /* end confdefs.h.  */
| #include <tilp2/ticalcs.h>
configure:28360: result: no
configure:28395: checking for tilp2/ticalcs.h
configure:28402: result: no
configure:28279: checking tilp2/tifiles.h usability
configure:28291: gcc -c -O2 -g -pipe -Wall -Wp,-D_FORTIFY_SOURCE=2 -fexceptions -fstack-protector --param=ssp-buffer-size=4 -m64 -mtune=generic  conftest.c >&5
configure:28297: $? = 0
configure:28301: test -z 
			 || test ! -s conftest.err
configure:28304: $? = 0
configure:28307: test -s conftest.o
configure:28310: $? = 0
configure:28320: result: yes
configure:28324: checking tilp2/tifiles.h presence
configure:28334: gcc -E  conftest.c
configure:28340: $? = 0
configure:28360: result: yes
configure:28395: checking for tilp2/tifiles.h
configure:28402: result: yes
configure:28417: checking for an ANSI C-conforming const
configure:28514: result: yes
configure:28524: checking whether stat file-mode macros are broken
configure:28572: result: no
configure:28582: checking for uid_t in sys/types.h
configure:28605: result: yes
configure:28620: checking for mode_t
configure:28644: gcc -c -O2 -g -pipe -Wall -Wp,-D_FORTIFY_SOURCE=2 -fexceptions -fstack-protector --param=ssp-buffer-size=4 -m64 -mtune=generic  conftest.c >&5
configure:28650: $? = 0
configure:28654: test -z 
			 || test ! -s conftest.err
configure:28657: $? = 0
configure:28660: test -s conftest.o
configure:28663: $? = 0
configure:28674: result: yes
configure:28686: checking for off_t
configure:28740: result: yes
configure:28752: checking whether struct tm is in sys/time.h or time.h
configure:28775: gcc -c -O2 -g -pipe -Wall -Wp,-D_FORTIFY_SOURCE=2 -fexceptions -fstack-protector --param=ssp-buffer-size=4 -m64 -mtune=generic  conftest.c >&5
conftest.c: In function 'main':
conftest.c:100: warning: statement with no effect
configure:28781: $? = 0
configure:28785: test -z 
			 || test ! -s conftest.err
configure:28788: $? = 0
configure:28791: test -s conftest.o
configure:28794: $? = 0
configure:28805: result: time.h
configure:28818: checking whether gcc needs -traditional
configure:28860: result: no
configure:28867: checking return type of signal handlers
configure:28898: gcc -c -O2 -g -pipe -Wall -Wp,-D_FORTIFY_SOURCE=2 -fexceptions -fstack-protector --param=ssp-buffer-size=4 -m64 -mtune=generic  conftest.c >&5
conftest.c: In function 'main':
conftest.c:108: warning: unused variable 'i'
configure:28904: $? = 0
configure:28908: test -z 
			 || test ! -s conftest.err
configure:28911: $? = 0
configure:28914: test -s conftest.o
configure:28917: $? = 0
configure:28928: result: void
configure:28936: checking whether lstat dereferences a symlink specified with a trailing slash
configure:28967: gcc -o conftest -O2 -g -pipe -Wall -Wp,-D_FORTIFY_SOURCE=2 -fexceptions -fstack-protector --param=ssp-buffer-size=4 -m64 -mtune=generic   conftest.c  >&5
configure:28970: $? = 0
configure:28972: ./conftest
configure:28975: $? = 0
configure:28996: result: yes
configure:29017: checking whether stat accepts an empty string
configure:29042: gcc -o conftest -O2 -g -pipe -Wall -Wp,-D_FORTIFY_SOURCE=2 -fexceptions -fstack-protector --param=ssp-buffer-size=4 -m64 -mtune=generic   conftest.c  >&5
configure:29045: $? = 0
configure:29047: ./conftest
configure:29050: $? = 1
configure: program exited with status 1
configure: failed program was:
| /* confdefs.h.  */
| 
| #define PACKAGE_NAME "TiLP2"
| #define PACKAGE_TARNAME "tilp2"
| #define PACKAGE_VERSION "1.04"
| #define PACKAGE_STRING "TiLP2 1.04"
| #define PACKAGE_BUGREPORT "tilp-users@lists.sourceforge.net"
| #define PACKAGE "tilp2"
| #define VERSION "1.04"
| #define STDC_HEADERS 1
| #define HAVE_SYS_TYPES_H 1
| #define HAVE_SYS_STAT_H 1
| #define HAVE_STDLIB_H 1
| #define HAVE_STRING_H 1
| #define HAVE_MEMORY_H 1
| #define HAVE_STRINGS_H 1
| #define HAVE_INTTYPES_H 1
| #define HAVE_STDINT_H 1
| #define HAVE_UNISTD_H 1
| #define HAVE_DLFCN_H 1
| #ifdef __cplusplus
| extern "C" void std::exit (int) throw (); using std::exit;
| #endif
| #define HAVE_LONG_LONG 1
| #define HAVE_LONG_DOUBLE 1
| #define HAVE_WCHAR_T 1
| #define HAVE_WINT_T 1
| #define HAVE_INTTYPES_H_WITH_UINTMAX 1
| #define HAVE_STDINT_H_WITH_UINTMAX 1
| #define HAVE_INTMAX_T 1
| #define HAVE_POSIX_PRINTF 1
| #define HAVE_ALLOCA_H 1
| #define HAVE_ALLOCA 1
| #define HAVE_STDLIB_H 1
| #define HAVE_UNISTD_H 1
| #define HAVE_GETPAGESIZE 1
| #define HAVE_MMAP 1
| #define INTDIV0_RAISES_SIGFPE 1
| #define HAVE_UNSIGNED_LONG_LONG 1
| #define HAVE_UINTMAX_T 1
| #define HAVE_INTTYPES_H 1
| #define HAVE_STDINT_H 1
| #define HAVE_STDINT_H 1
| #define HAVE_ARGZ_H 1
| #define HAVE_LIMITS_H 1
| #define HAVE_LOCALE_H 1
| #define HAVE_NL_TYPES_H 1
| #define HAVE_MALLOC_H 1
| #define HAVE_STDDEF_H 1
| #define HAVE_STDLIB_H 1
| #define HAVE_STRING_H 1
| #define HAVE_UNISTD_H 1
| #define HAVE_SYS_PARAM_H 1
| #define HAVE_ASPRINTF 1
| #define HAVE_FWPRINTF 1
| #define HAVE_GETCWD 1
| #define HAVE_GETEGID 1
| #define HAVE_GETEUID 1
| #define HAVE_GETGID 1
| #define HAVE_GETUID 1
| #define HAVE_MEMPCPY 1
| #define HAVE_MUNMAP 1
| #define HAVE_PUTENV 1
| #define HAVE_SETENV 1
| #define HAVE_SETLOCALE 1
| #define HAVE_SNPRINTF 1
| #define HAVE_STPCPY 1
| #define HAVE_STRCASECMP 1
| #define HAVE_STRDUP 1
| #define HAVE_STRTOUL 1
| #define HAVE_TSEARCH 1
| #define HAVE_WCSLEN 1
| #define HAVE___ARGZ_COUNT 1
| #define HAVE___ARGZ_STRINGIFY 1
| #define HAVE___ARGZ_NEXT 1
| #define HAVE___FSETLOCKING 1
| #define HAVE_DECL__SNPRINTF 0
| #define HAVE_DECL__SNWPRINTF 0
| #define HAVE_DECL_FEOF_UNLOCKED 1
| #define HAVE_DECL_FGETS_UNLOCKED 0
| #define HAVE_DECL_GETC_UNLOCKED 1
| #define HAVE_ICONV 1
| #define ICONV_CONST 
| #define HAVE_LANGINFO_CODESET 1
| #define HAVE_LC_MESSAGES 1
| #define HAVE_LIBZ 1
| #define STDC_HEADERS 1
| #define HAVE_STDLIB_H 1
| #define HAVE_STRING_H 1
| #define HAVE_UNISTD_H 1
| #define HAVE_TILP2_TICABLES_H 1
| #define HAVE_TILP2_TIFILES_H 1
| #define RETSIGTYPE void
| #define LSTAT_FOLLOWS_SLASHED_SYMLINK 1
| /* end confdefs.h.  */
| #include <stdio.h>
| #if HAVE_SYS_TYPES_H
| # include <sys/types.h>
| #endif
| #if HAVE_SYS_STAT_H
| # include <sys/stat.h>
| #endif
| #if STDC_HEADERS
| # include <stdlib.h>
| # include <stddef.h>
| #else
| # if HAVE_STDLIB_H
| #  include <stdlib.h>
| # endif
| #endif
| #if HAVE_STRING_H
| # if !STDC_HEADERS && HAVE_MEMORY_H
| #  include <memory.h>
| # endif
| # include <string.h>
| #endif
| #if HAVE_STRINGS_H
| # include <strings.h>
| #endif
| #if HAVE_INTTYPES_H
| # include <inttypes.h>
| #else
| # if HAVE_STDINT_H
| #  include <stdint.h>
| # endif
| #endif
| #if HAVE_UNISTD_H
| # include <unistd.h>
| #endif
| int
| main ()
| {
| struct stat sbuf;
|   exit (stat ("", &sbuf) ? 1 : 0);
|   ;
|   return 0;
| }
configure:29064: result: no
configure:29094: checking for getcwd
configure:29182: result: yes
configure:29094: checking for memset
configure:29151: gcc -o conftest -O2 -g -pipe -Wall -Wp,-D_FORTIFY_SOURCE=2 -fexceptions -fstack-protector --param=ssp-buffer-size=4 -m64 -mtune=generic   conftest.c  >&5
conftest.c:121: warning: conflicting types for built-in function 'memset'
configure:29157: $? = 0
configure:29161: test -z 
			 || test ! -s conftest.err
configure:29164: $? = 0
configure:29167: test -s conftest
configure:29170: $? = 0
configure:29182: result: yes
configure:29094: checking for mkdir
configure:29151: gcc -o conftest -O2 -g -pipe -Wall -Wp,-D_FORTIFY_SOURCE=2 -fexceptions -fstack-protector --param=ssp-buffer-size=4 -m64 -mtune=generic   conftest.c  >&5
configure:29157: $? = 0
configure:29161: test -z 
			 || test ! -s conftest.err
configure:29164: $? = 0
configure:29167: test -s conftest
configure:29170: $? = 0
configure:29182: result: yes
configure:29094: checking for strcasecmp
configure:29182: result: yes
configure:29094: checking for strchr
configure:29151: gcc -o conftest -O2 -g -pipe -Wall -Wp,-D_FORTIFY_SOURCE=2 -fexceptions -fstack-protector --param=ssp-buffer-size=4 -m64 -mtune=generic   conftest.c  >&5
conftest.c:124: warning: conflicting types for built-in function 'strchr'
configure:29157: $? = 0
configure:29161: test -z 
			 || test ! -s conftest.err
configure:29164: $? = 0
configure:29167: test -s conftest
configure:29170: $? = 0
configure:29182: result: yes
configure:29094: checking for strdup
configure:29182: result: yes
configure:29094: checking for strrchr
configure:29151: gcc -o conftest -O2 -g -pipe -Wall -Wp,-D_FORTIFY_SOURCE=2 -fexceptions -fstack-protector --param=ssp-buffer-size=4 -m64 -mtune=generic   conftest.c  >&5
conftest.c:126: warning: conflicting types for built-in function 'strrchr'
configure:29157: $? = 0
configure:29161: test -z 
			 || test ! -s conftest.err
configure:29164: $? = 0
configure:29167: test -s conftest
configure:29170: $? = 0
configure:29182: result: yes
configure:29094: checking for strstr
configure:29151: gcc -o conftest -O2 -g -pipe -Wall -Wp,-D_FORTIFY_SOURCE=2 -fexceptions -fstack-protector --param=ssp-buffer-size=4 -m64 -mtune=generic   conftest.c  >&5
conftest.c:127: warning: conflicting types for built-in function 'strstr'
configure:29157: $? = 0
configure:29161: test -z 
			 || test ! -s conftest.err
configure:29164: $? = 0
configure:29167: test -s conftest
configure:29170: $? = 0
configure:29182: result: yes
configure:29094: checking for strtol
configure:29151: gcc -o conftest -O2 -g -pipe -Wall -Wp,-D_FORTIFY_SOURCE=2 -fexceptions -fstack-protector --param=ssp-buffer-size=4 -m64 -mtune=generic   conftest.c  >&5
configure:29157: $? = 0
configure:29161: test -z 
			 || test ! -s conftest.err
configure:29164: $? = 0
configure:29167: test -s conftest
configure:29170: $? = 0
configure:29182: result: yes
configure:29316: checking for C++ compiler version
configure:29319: g++ --version </dev/null >&5
g++ (GCC) 4.1.1 20070105 (Red Hat 4.1.1-52)
Copyright (C) 2006 Free Software Foundation, Inc.
This is free software; see the source for copying conditions.  There is NO
warranty; not even for MERCHANTABILITY or FITNESS FOR A PARTICULAR PURPOSE.

configure:29322: $? = 0
configure:29324: g++ -v </dev/null >&5
Using built-in specs.
Target: x86_64-redhat-linux
Configured with: ../configure --prefix=/usr --mandir=/usr/share/man --infodir=/usr/share/info --enable-shared --enable-threads=posix --enable-checking=release --with-system-zlib --enable-__cxa_atexit --disable-libunwind-exceptions --enable-libgcj-multifile --enable-languages=c,c++,objc,obj-c++,java,fortran,ada --enable-java-awt=gtk --disable-dssi --enable-plugin --with-java-home=/usr/lib/jvm/java-1.4.2-gcj-1.4.2.0/jre --with-cpu=generic --host=x86_64-redhat-linux
Thread model: posix
gcc version 4.1.1 20070105 (Red Hat 4.1.1-52)
configure:29327: $? = 0
configure:29329: g++ -V </dev/null >&5
g++: '-V' option must have argument
configure:29332: $? = 1
configure:29335: checking whether we are using the GNU C++ compiler
configure:29391: result: yes
configure:29397: checking whether g++ accepts -g
configure:29448: result: yes
configure:29490: g++ -c -g -O2  conftest.cc >&5
configure:29496: $? = 0
configure:29500: test -z 
			 || test ! -s conftest.err
configure:29503: $? = 0
configure:29506: test -s conftest.o
configure:29509: $? = 0
configure:29535: g++ -c -g -O2  conftest.cc >&5
configure:29541: $? = 0
configure:29545: test -z 
			 || test ! -s conftest.err
configure:29548: $? = 0
configure:29551: test -s conftest.o
configure:29554: $? = 0
configure:29579: checking dependency style of g++
configure:29669: result: gcc3
configure:29693: checking for main in -lutil
configure:29717: gcc -o conftest -O2 -g -pipe -Wall -Wp,-D_FORTIFY_SOURCE=2 -fexceptions -fstack-protector --param=ssp-buffer-size=4 -m64 -mtune=generic -D__LINUX__   conftest.c -lutil   >&5
configure:29723: $? = 0
configure:29727: test -z 
			 || test ! -s conftest.err
configure:29730: $? = 0
configure:29733: test -s conftest
configure:29736: $? = 0
configure:29749: result: yes
configure:29755: checking for main in -lcompat
configure:29779: gcc -o conftest -O2 -g -pipe -Wall -Wp,-D_FORTIFY_SOURCE=2 -fexceptions -fstack-protector --param=ssp-buffer-size=4 -m64 -mtune=generic -D__LINUX__   conftest.c -lcompat   >&5
/usr/bin/ld: cannot find -lcompat
collect2: ld returned 1 exit status
configure:29785: $? = 1
configure: failed program was:
| /* confdefs.h.  */
| 
| #define PACKAGE_NAME "TiLP2"
| #define PACKAGE_TARNAME "tilp2"
| #define PACKAGE_VERSION "1.04"
| #define PACKAGE_STRING "TiLP2 1.04"
| #define PACKAGE_BUGREPORT "tilp-users@lists.sourceforge.net"
| #define PACKAGE "tilp2"
| #define VERSION "1.04"
| #define STDC_HEADERS 1
| #define HAVE_SYS_TYPES_H 1
| #define HAVE_SYS_STAT_H 1
| #define HAVE_STDLIB_H 1
| #define HAVE_STRING_H 1
| #define HAVE_MEMORY_H 1
| #define HAVE_STRINGS_H 1
| #define HAVE_INTTYPES_H 1
| #define HAVE_STDINT_H 1
| #define HAVE_UNISTD_H 1
| #define HAVE_DLFCN_H 1
| #ifdef __cplusplus
| extern "C" void std::exit (int) throw (); using std::exit;
| #endif
| #define HAVE_LONG_LONG 1
| #define HAVE_LONG_DOUBLE 1
| #define HAVE_WCHAR_T 1
| #define HAVE_WINT_T 1
| #define HAVE_INTTYPES_H_WITH_UINTMAX 1
| #define HAVE_STDINT_H_WITH_UINTMAX 1
| #define HAVE_INTMAX_T 1
| #define HAVE_POSIX_PRINTF 1
| #define HAVE_ALLOCA_H 1
| #define HAVE_ALLOCA 1
| #define HAVE_STDLIB_H 1
| #define HAVE_UNISTD_H 1
| #define HAVE_GETPAGESIZE 1
| #define HAVE_MMAP 1
| #define INTDIV0_RAISES_SIGFPE 1
| #define HAVE_UNSIGNED_LONG_LONG 1
| #define HAVE_UINTMAX_T 1
| #define HAVE_INTTYPES_H 1
| #define HAVE_STDINT_H 1
| #define HAVE_STDINT_H 1
| #define HAVE_ARGZ_H 1
| #define HAVE_LIMITS_H 1
| #define HAVE_LOCALE_H 1
| #define HAVE_NL_TYPES_H 1
| #define HAVE_MALLOC_H 1
| #define HAVE_STDDEF_H 1
| #define HAVE_STDLIB_H 1
| #define HAVE_STRING_H 1
| #define HAVE_UNISTD_H 1
| #define HAVE_SYS_PARAM_H 1
| #define HAVE_ASPRINTF 1
| #define HAVE_FWPRINTF 1
| #define HAVE_GETCWD 1
| #define HAVE_GETEGID 1
| #define HAVE_GETEUID 1
| #define HAVE_GETGID 1
| #define HAVE_GETUID 1
| #define HAVE_MEMPCPY 1
| #define HAVE_MUNMAP 1
| #define HAVE_PUTENV 1
| #define HAVE_SETENV 1
| #define HAVE_SETLOCALE 1
| #define HAVE_SNPRINTF 1
| #define HAVE_STPCPY 1
| #define HAVE_STRCASECMP 1
| #define HAVE_STRDUP 1
| #define HAVE_STRTOUL 1
| #define HAVE_TSEARCH 1
| #define HAVE_WCSLEN 1
| #define HAVE___ARGZ_COUNT 1
| #define HAVE___ARGZ_STRINGIFY 1
| #define HAVE___ARGZ_NEXT 1
| #define HAVE___FSETLOCKING 1
| #define HAVE_DECL__SNPRINTF 0
| #define HAVE_DECL__SNWPRINTF 0
| #define HAVE_DECL_FEOF_UNLOCKED 1
| #define HAVE_DECL_FGETS_UNLOCKED 0
| #define HAVE_DECL_GETC_UNLOCKED 1
| #define HAVE_ICONV 1
| #define ICONV_CONST 
| #define HAVE_LANGINFO_CODESET 1
| #define HAVE_LC_MESSAGES 1
| #define HAVE_LIBZ 1
| #define STDC_HEADERS 1
| #define HAVE_STDLIB_H 1
| #define HAVE_STRING_H 1
| #define HAVE_UNISTD_H 1
| #define HAVE_TILP2_TICABLES_H 1
| #define HAVE_TILP2_TIFILES_H 1
| #define RETSIGTYPE void
| #define LSTAT_FOLLOWS_SLASHED_SYMLINK 1
| #define HAVE_GETCWD 1
| #define HAVE_MEMSET 1
| #define HAVE_MKDIR 1
| #define HAVE_STRCASECMP 1
| #define HAVE_STRCHR 1
| #define HAVE_STRDUP 1
| #define HAVE_STRRCHR 1
| #define HAVE_STRSTR 1
| #define HAVE_STRTOL 1
| /* end confdefs.h.  */
| 
| 
| int
| main ()
| {
| main ();
|   ;
|   return 0;
| }
configure:29811: result: no
configure:29818: checking for crypt in -lcrypt
configure:29848: gcc -o conftest -O2 -g -pipe -Wall -Wp,-D_FORTIFY_SOURCE=2 -fexceptions -fstack-protector --param=ssp-buffer-size=4 -m64 -mtune=generic -D__LINUX__   conftest.c -lcrypt   >&5
configure:29854: $? = 0
configure:29858: test -z 
			 || test ! -s conftest.err
configure:29861: $? = 0
configure:29864: test -s conftest
configure:29867: $? = 0
configure:29880: result: yes
configure:29974: checking for socklen_t
configure:30015: g++ -c -g -O2  conftest.cc >&5
configure:30021: $? = 0
configure:30025: test -z 
			 || test ! -s conftest.err
configure:30028: $? = 0
configure:30031: test -s conftest.o
configure:30034: $? = 0
configure:30106: result: socklen_t
configure:30128: checking for dnet_ntoa in -ldnet
configure:30158: gcc -o conftest -O2 -g -pipe -Wall -Wp,-D_FORTIFY_SOURCE=2 -fexceptions -fstack-protector --param=ssp-buffer-size=4 -m64 -mtune=generic -D__LINUX__   conftest.c -ldnet   >&5
/usr/bin/ld: cannot find -ldnet
collect2: ld returned 1 exit status
configure:30164: $? = 1
configure: failed program was:
| /* confdefs.h.  */
| 
| #define PACKAGE_NAME "TiLP2"
| #define PACKAGE_TARNAME "tilp2"
| #define PACKAGE_VERSION "1.04"
| #define PACKAGE_STRING "TiLP2 1.04"
| #define PACKAGE_BUGREPORT "tilp-users@lists.sourceforge.net"
| #define PACKAGE "tilp2"
| #define VERSION "1.04"
| #define STDC_HEADERS 1
| #define HAVE_SYS_TYPES_H 1
| #define HAVE_SYS_STAT_H 1
| #define HAVE_STDLIB_H 1
| #define HAVE_STRING_H 1
| #define HAVE_MEMORY_H 1
| #define HAVE_STRINGS_H 1
| #define HAVE_INTTYPES_H 1
| #define HAVE_STDINT_H 1
| #define HAVE_UNISTD_H 1
| #define HAVE_DLFCN_H 1
| #ifdef __cplusplus
| extern "C" void std::exit (int) throw (); using std::exit;
| #endif
| #define HAVE_LONG_LONG 1
| #define HAVE_LONG_DOUBLE 1
| #define HAVE_WCHAR_T 1
| #define HAVE_WINT_T 1
| #define HAVE_INTTYPES_H_WITH_UINTMAX 1
| #define HAVE_STDINT_H_WITH_UINTMAX 1
| #define HAVE_INTMAX_T 1
| #define HAVE_POSIX_PRINTF 1
| #define HAVE_ALLOCA_H 1
| #define HAVE_ALLOCA 1
| #define HAVE_STDLIB_H 1
| #define HAVE_UNISTD_H 1
| #define HAVE_GETPAGESIZE 1
| #define HAVE_MMAP 1
| #define INTDIV0_RAISES_SIGFPE 1
| #define HAVE_UNSIGNED_LONG_LONG 1
| #define HAVE_UINTMAX_T 1
| #define HAVE_INTTYPES_H 1
| #define HAVE_STDINT_H 1
| #define HAVE_STDINT_H 1
| #define HAVE_ARGZ_H 1
| #define HAVE_LIMITS_H 1
| #define HAVE_LOCALE_H 1
| #define HAVE_NL_TYPES_H 1
| #define HAVE_MALLOC_H 1
| #define HAVE_STDDEF_H 1
| #define HAVE_STDLIB_H 1
| #define HAVE_STRING_H 1
| #define HAVE_UNISTD_H 1
| #define HAVE_SYS_PARAM_H 1
| #define HAVE_ASPRINTF 1
| #define HAVE_FWPRINTF 1
| #define HAVE_GETCWD 1
| #define HAVE_GETEGID 1
| #define HAVE_GETEUID 1
| #define HAVE_GETGID 1
| #define HAVE_GETUID 1
| #define HAVE_MEMPCPY 1
| #define HAVE_MUNMAP 1
| #define HAVE_PUTENV 1
| #define HAVE_SETENV 1
| #define HAVE_SETLOCALE 1
| #define HAVE_SNPRINTF 1
| #define HAVE_STPCPY 1
| #define HAVE_STRCASECMP 1
| #define HAVE_STRDUP 1
| #define HAVE_STRTOUL 1
| #define HAVE_TSEARCH 1
| #define HAVE_WCSLEN 1
| #define HAVE___ARGZ_COUNT 1
| #define HAVE___ARGZ_STRINGIFY 1
| #define HAVE___ARGZ_NEXT 1
| #define HAVE___FSETLOCKING 1
| #define HAVE_DECL__SNPRINTF 0
| #define HAVE_DECL__SNWPRINTF 0
| #define HAVE_DECL_FEOF_UNLOCKED 1
| #define HAVE_DECL_FGETS_UNLOCKED 0
| #define HAVE_DECL_GETC_UNLOCKED 1
| #define HAVE_ICONV 1
| #define ICONV_CONST 
| #define HAVE_LANGINFO_CODESET 1
| #define HAVE_LC_MESSAGES 1
| #define HAVE_LIBZ 1
| #define STDC_HEADERS 1
| #define HAVE_STDLIB_H 1
| #define HAVE_STRING_H 1
| #define HAVE_UNISTD_H 1
| #define HAVE_TILP2_TICABLES_H 1
| #define HAVE_TILP2_TIFILES_H 1
| #define RETSIGTYPE void
| #define LSTAT_FOLLOWS_SLASHED_SYMLINK 1
| #define HAVE_GETCWD 1
| #define HAVE_MEMSET 1
| #define HAVE_MKDIR 1
| #define HAVE_STRCASECMP 1
| #define HAVE_STRCHR 1
| #define HAVE_STRDUP 1
| #define HAVE_STRRCHR 1
| #define HAVE_STRSTR 1
| #define HAVE_STRTOL 1
| #define HAVE_CRYPT 1
| #define ksize_t socklen_t
| /* end confdefs.h.  */
| 
| /* Override any gcc2 internal prototype to avoid an error.  */
| #ifdef __cplusplus
| extern "C"
| #endif
| /* We use char because int might match the return type of a gcc2
|    builtin and then its argument prototype would still apply.  */
| char dnet_ntoa ();
| int
| main ()
| {
| dnet_ntoa ();
|   ;
|   return 0;
| }
configure:30190: result: no
configure:30197: checking for dnet_ntoa in -ldnet_stub
configure:30227: gcc -o conftest -O2 -g -pipe -Wall -Wp,-D_FORTIFY_SOURCE=2 -fexceptions -fstack-protector --param=ssp-buffer-size=4 -m64 -mtune=generic -D__LINUX__   conftest.c -ldnet_stub   >&5
/usr/bin/ld: cannot find -ldnet_stub
collect2: ld returned 1 exit status
configure:30233: $? = 1
configure: failed program was:
| /* confdefs.h.  */
| 
| #define PACKAGE_NAME "TiLP2"
| #define PACKAGE_TARNAME "tilp2"
| #define PACKAGE_VERSION "1.04"
| #define PACKAGE_STRING "TiLP2 1.04"
| #define PACKAGE_BUGREPORT "tilp-users@lists.sourceforge.net"
| #define PACKAGE "tilp2"
| #define VERSION "1.04"
| #define STDC_HEADERS 1
| #define HAVE_SYS_TYPES_H 1
| #define HAVE_SYS_STAT_H 1
| #define HAVE_STDLIB_H 1
| #define HAVE_STRING_H 1
| #define HAVE_MEMORY_H 1
| #define HAVE_STRINGS_H 1
| #define HAVE_INTTYPES_H 1
| #define HAVE_STDINT_H 1
| #define HAVE_UNISTD_H 1
| #define HAVE_DLFCN_H 1
| #ifdef __cplusplus
| extern "C" void std::exit (int) throw (); using std::exit;
| #endif
| #define HAVE_LONG_LONG 1
| #define HAVE_LONG_DOUBLE 1
| #define HAVE_WCHAR_T 1
| #define HAVE_WINT_T 1
| #define HAVE_INTTYPES_H_WITH_UINTMAX 1
| #define HAVE_STDINT_H_WITH_UINTMAX 1
| #define HAVE_INTMAX_T 1
| #define HAVE_POSIX_PRINTF 1
| #define HAVE_ALLOCA_H 1
| #define HAVE_ALLOCA 1
| #define HAVE_STDLIB_H 1
| #define HAVE_UNISTD_H 1
| #define HAVE_GETPAGESIZE 1
| #define HAVE_MMAP 1
| #define INTDIV0_RAISES_SIGFPE 1
| #define HAVE_UNSIGNED_LONG_LONG 1
| #define HAVE_UINTMAX_T 1
| #define HAVE_INTTYPES_H 1
| #define HAVE_STDINT_H 1
| #define HAVE_STDINT_H 1
| #define HAVE_ARGZ_H 1
| #define HAVE_LIMITS_H 1
| #define HAVE_LOCALE_H 1
| #define HAVE_NL_TYPES_H 1
| #define HAVE_MALLOC_H 1
| #define HAVE_STDDEF_H 1
| #define HAVE_STDLIB_H 1
| #define HAVE_STRING_H 1
| #define HAVE_UNISTD_H 1
| #define HAVE_SYS_PARAM_H 1
| #define HAVE_ASPRINTF 1
| #define HAVE_FWPRINTF 1
| #define HAVE_GETCWD 1
| #define HAVE_GETEGID 1
| #define HAVE_GETEUID 1
| #define HAVE_GETGID 1
| #define HAVE_GETUID 1
| #define HAVE_MEMPCPY 1
| #define HAVE_MUNMAP 1
| #define HAVE_PUTENV 1
| #define HAVE_SETENV 1
| #define HAVE_SETLOCALE 1
| #define HAVE_SNPRINTF 1
| #define HAVE_STPCPY 1
| #define HAVE_STRCASECMP 1
| #define HAVE_STRDUP 1
| #define HAVE_STRTOUL 1
| #define HAVE_TSEARCH 1
| #define HAVE_WCSLEN 1
| #define HAVE___ARGZ_COUNT 1
| #define HAVE___ARGZ_STRINGIFY 1
| #define HAVE___ARGZ_NEXT 1
| #define HAVE___FSETLOCKING 1
| #define HAVE_DECL__SNPRINTF 0
| #define HAVE_DECL__SNWPRINTF 0
| #define HAVE_DECL_FEOF_UNLOCKED 1
| #define HAVE_DECL_FGETS_UNLOCKED 0
| #define HAVE_DECL_GETC_UNLOCKED 1
| #define HAVE_ICONV 1
| #define ICONV_CONST 
| #define HAVE_LANGINFO_CODESET 1
| #define HAVE_LC_MESSAGES 1
| #define HAVE_LIBZ 1
| #define STDC_HEADERS 1
| #define HAVE_STDLIB_H 1
| #define HAVE_STRING_H 1
| #define HAVE_UNISTD_H 1
| #define HAVE_TILP2_TICABLES_H 1
| #define HAVE_TILP2_TIFILES_H 1
| #define RETSIGTYPE void
| #define LSTAT_FOLLOWS_SLASHED_SYMLINK 1
| #define HAVE_GETCWD 1
| #define HAVE_MEMSET 1
| #define HAVE_MKDIR 1
| #define HAVE_STRCASECMP 1
| #define HAVE_STRCHR 1
| #define HAVE_STRDUP 1
| #define HAVE_STRRCHR 1
| #define HAVE_STRSTR 1
| #define HAVE_STRTOL 1
| #define HAVE_CRYPT 1
| #define ksize_t socklen_t
| /* end confdefs.h.  */
| 
| /* Override any gcc2 internal prototype to avoid an error.  */
| #ifdef __cplusplus
| extern "C"
| #endif
| /* We use char because int might match the return type of a gcc2
|    builtin and then its argument prototype would still apply.  */
| char dnet_ntoa ();
| int
| main ()
| {
| dnet_ntoa ();
|   ;
|   return 0;
| }
configure:30259: result: no
configure:30266: checking for inet_ntoa
configure:30323: gcc -o conftest -O2 -g -pipe -Wall -Wp,-D_FORTIFY_SOURCE=2 -fexceptions -fstack-protector --param=ssp-buffer-size=4 -m64 -mtune=generic -D__LINUX__   conftest.c  >&5
configure:30329: $? = 0
configure:30333: test -z 
			 || test ! -s conftest.err
configure:30336: $? = 0
configure:30339: test -s conftest
configure:30342: $? = 0
configure:30354: result: yes
configure:30427: checking for connect
configure:30484: gcc -o conftest -O2 -g -pipe -Wall -Wp,-D_FORTIFY_SOURCE=2 -fexceptions -fstack-protector --param=ssp-buffer-size=4 -m64 -mtune=generic -D__LINUX__   conftest.c  >&5
configure:30490: $? = 0
configure:30494: test -z 
			 || test ! -s conftest.err
configure:30497: $? = 0
configure:30500: test -s conftest
configure:30503: $? = 0
configure:30515: result: yes
configure:30589: checking for remove
configure:30646: gcc -o conftest -O2 -g -pipe -Wall -Wp,-D_FORTIFY_SOURCE=2 -fexceptions -fstack-protector --param=ssp-buffer-size=4 -m64 -mtune=generic -D__LINUX__   conftest.c  >&5
configure:30652: $? = 0
configure:30656: test -z 
			 || test ! -s conftest.err
configure:30659: $? = 0
configure:30662: test -s conftest
configure:30665: $? = 0
configure:30677: result: yes
configure:30752: checking for shmat
configure:30809: gcc -o conftest -O2 -g -pipe -Wall -Wp,-D_FORTIFY_SOURCE=2 -fexceptions -fstack-protector --param=ssp-buffer-size=4 -m64 -mtune=generic -D__LINUX__   conftest.c  >&5
configure:30815: $? = 0
configure:30819: test -z 
			 || test ! -s conftest.err
configure:30822: $? = 0
configure:30825: test -s conftest
configure:30828: $? = 0
configure:30840: result: yes
configure:30921: checking for res_init
configure:30978: gcc -o conftest -O2 -g -pipe -Wall -Wp,-D_FORTIFY_SOURCE=2 -fexceptions -fstack-protector --param=ssp-buffer-size=4 -m64 -mtune=generic -D__LINUX__   conftest.c  >&5
/tmp/ccOBNyEP.o: In function `main':
/home/tyler/rpmbuild/BUILD/tilp2-1.04/conftest.c:146: undefined reference to `res_init'
/tmp/ccOBNyEP.o:(.data+0x0): undefined reference to `res_init'
collect2: ld returned 1 exit status
configure:30984: $? = 1
configure: failed program was:
| /* confdefs.h.  */
| 
| #define PACKAGE_NAME "TiLP2"
| #define PACKAGE_TARNAME "tilp2"
| #define PACKAGE_VERSION "1.04"
| #define PACKAGE_STRING "TiLP2 1.04"
| #define PACKAGE_BUGREPORT "tilp-users@lists.sourceforge.net"
| #define PACKAGE "tilp2"
| #define VERSION "1.04"
| #define STDC_HEADERS 1
| #define HAVE_SYS_TYPES_H 1
| #define HAVE_SYS_STAT_H 1
| #define HAVE_STDLIB_H 1
| #define HAVE_STRING_H 1
| #define HAVE_MEMORY_H 1
| #define HAVE_STRINGS_H 1
| #define HAVE_INTTYPES_H 1
| #define HAVE_STDINT_H 1
| #define HAVE_UNISTD_H 1
| #define HAVE_DLFCN_H 1
| #ifdef __cplusplus
| extern "C" void std::exit (int) throw (); using std::exit;
| #endif
| #define HAVE_LONG_LONG 1
| #define HAVE_LONG_DOUBLE 1
| #define HAVE_WCHAR_T 1
| #define HAVE_WINT_T 1
| #define HAVE_INTTYPES_H_WITH_UINTMAX 1
| #define HAVE_STDINT_H_WITH_UINTMAX 1
| #define HAVE_INTMAX_T 1
| #define HAVE_POSIX_PRINTF 1
| #define HAVE_ALLOCA_H 1
| #define HAVE_ALLOCA 1
| #define HAVE_STDLIB_H 1
| #define HAVE_UNISTD_H 1
| #define HAVE_GETPAGESIZE 1
| #define HAVE_MMAP 1
| #define INTDIV0_RAISES_SIGFPE 1
| #define HAVE_UNSIGNED_LONG_LONG 1
| #define HAVE_UINTMAX_T 1
| #define HAVE_INTTYPES_H 1
| #define HAVE_STDINT_H 1
| #define HAVE_STDINT_H 1
| #define HAVE_ARGZ_H 1
| #define HAVE_LIMITS_H 1
| #define HAVE_LOCALE_H 1
| #define HAVE_NL_TYPES_H 1
| #define HAVE_MALLOC_H 1
| #define HAVE_STDDEF_H 1
| #define HAVE_STDLIB_H 1
| #define HAVE_STRING_H 1
| #define HAVE_UNISTD_H 1
| #define HAVE_SYS_PARAM_H 1
| #define HAVE_ASPRINTF 1
| #define HAVE_FWPRINTF 1
| #define HAVE_GETCWD 1
| #define HAVE_GETEGID 1
| #define HAVE_GETEUID 1
| #define HAVE_GETGID 1
| #define HAVE_GETUID 1
| #define HAVE_MEMPCPY 1
| #define HAVE_MUNMAP 1
| #define HAVE_PUTENV 1
| #define HAVE_SETENV 1
| #define HAVE_SETLOCALE 1
| #define HAVE_SNPRINTF 1
| #define HAVE_STPCPY 1
| #define HAVE_STRCASECMP 1
| #define HAVE_STRDUP 1
| #define HAVE_STRTOUL 1
| #define HAVE_TSEARCH 1
| #define HAVE_WCSLEN 1
| #define HAVE___ARGZ_COUNT 1
| #define HAVE___ARGZ_STRINGIFY 1
| #define HAVE___ARGZ_NEXT 1
| #define HAVE___FSETLOCKING 1
| #define HAVE_DECL__SNPRINTF 0
| #define HAVE_DECL__SNWPRINTF 0
| #define HAVE_DECL_FEOF_UNLOCKED 1
| #define HAVE_DECL_FGETS_UNLOCKED 0
| #define HAVE_DECL_GETC_UNLOCKED 1
| #define HAVE_ICONV 1
| #define ICONV_CONST 
| #define HAVE_LANGINFO_CODESET 1
| #define HAVE_LC_MESSAGES 1
| #define HAVE_LIBZ 1
| #define STDC_HEADERS 1
| #define HAVE_STDLIB_H 1
| #define HAVE_STRING_H 1
| #define HAVE_UNISTD_H 1
| #define HAVE_TILP2_TICABLES_H 1
| #define HAVE_TILP2_TIFILES_H 1
| #define RETSIGTYPE void
| #define LSTAT_FOLLOWS_SLASHED_SYMLINK 1
| #define HAVE_GETCWD 1
| #define HAVE_MEMSET 1
| #define HAVE_MKDIR 1
| #define HAVE_STRCASECMP 1
| #define HAVE_STRCHR 1
| #define HAVE_STRDUP 1
| #define HAVE_STRRCHR 1
| #define HAVE_STRSTR 1
| #define HAVE_STRTOL 1
| #define HAVE_CRYPT 1
| #define ksize_t socklen_t
| /* end confdefs.h.  */
| /* Define res_init to an innocuous variant, in case <limits.h> declares res_init.
|    For example, HP-UX 11i <limits.h> declares gettimeofday.  */
| #define res_init innocuous_res_init
| 
| /* System header to define __stub macros and hopefully few prototypes,
|     which can conflict with char res_init (); below.
|     Prefer <limits.h> to <assert.h> if __STDC__ is defined, since
|     <limits.h> exists even on freestanding compilers.  */
| 
| #ifdef __STDC__
| # include <limits.h>
| #else
| # include <assert.h>
| #endif
| 
| #undef res_init
| 
| /* Override any gcc2 internal prototype to avoid an error.  */
| #ifdef __cplusplus
| extern "C"
| {
| #endif
| /* We use char because int might match the return type of a gcc2
|    builtin and then its argument prototype would still apply.  */
| char res_init ();
| /* The GNU C library defines this for functions which it implements
|     to always fail with ENOSYS.  Some functions are actually named
|     something starting with __ and the normal name is an alias.  */
| #if defined (__stub_res_init) || defined (__stub___res_init)
| choke me
| #else
| char (*f) () = res_init;
| #endif
| #ifdef __cplusplus
| }
| #endif
| 
| int
| main ()
| {
| return f != res_init;
|   ;
|   return 0;
| }
configure:31009: result: no
configure:31040: gcc -o conftest -O2 -g -pipe -Wall -Wp,-D_FORTIFY_SOURCE=2 -fexceptions -fstack-protector --param=ssp-buffer-size=4 -m64 -mtune=generic -D__LINUX__   conftest.c   -lresolv >&5
configure:31046: $? = 0
configure:31050: test -z 
			 || test ! -s conftest.err
configure:31053: $? = 0
configure:31056: test -s conftest
configure:31059: $? = 0
configure:31086: checking for killpg in -lucb
configure:31116: gcc -o conftest -O2 -g -pipe -Wall -Wp,-D_FORTIFY_SOURCE=2 -fexceptions -fstack-protector --param=ssp-buffer-size=4 -m64 -mtune=generic -D__LINUX__   conftest.c -lucb   >&5
/usr/bin/ld: cannot find -lucb
collect2: ld returned 1 exit status
configure:31122: $? = 1
configure: failed program was:
| /* confdefs.h.  */
| 
| #define PACKAGE_NAME "TiLP2"
| #define PACKAGE_TARNAME "tilp2"
| #define PACKAGE_VERSION "1.04"
| #define PACKAGE_STRING "TiLP2 1.04"
| #define PACKAGE_BUGREPORT "tilp-users@lists.sourceforge.net"
| #define PACKAGE "tilp2"
| #define VERSION "1.04"
| #define STDC_HEADERS 1
| #define HAVE_SYS_TYPES_H 1
| #define HAVE_SYS_STAT_H 1
| #define HAVE_STDLIB_H 1
| #define HAVE_STRING_H 1
| #define HAVE_MEMORY_H 1
| #define HAVE_STRINGS_H 1
| #define HAVE_INTTYPES_H 1
| #define HAVE_STDINT_H 1
| #define HAVE_UNISTD_H 1
| #define HAVE_DLFCN_H 1
| #ifdef __cplusplus
| extern "C" void std::exit (int) throw (); using std::exit;
| #endif
| #define HAVE_LONG_LONG 1
| #define HAVE_LONG_DOUBLE 1
| #define HAVE_WCHAR_T 1
| #define HAVE_WINT_T 1
| #define HAVE_INTTYPES_H_WITH_UINTMAX 1
| #define HAVE_STDINT_H_WITH_UINTMAX 1
| #define HAVE_INTMAX_T 1
| #define HAVE_POSIX_PRINTF 1
| #define HAVE_ALLOCA_H 1
| #define HAVE_ALLOCA 1
| #define HAVE_STDLIB_H 1
| #define HAVE_UNISTD_H 1
| #define HAVE_GETPAGESIZE 1
| #define HAVE_MMAP 1
| #define INTDIV0_RAISES_SIGFPE 1
| #define HAVE_UNSIGNED_LONG_LONG 1
| #define HAVE_UINTMAX_T 1
| #define HAVE_INTTYPES_H 1
| #define HAVE_STDINT_H 1
| #define HAVE_STDINT_H 1
| #define HAVE_ARGZ_H 1
| #define HAVE_LIMITS_H 1
| #define HAVE_LOCALE_H 1
| #define HAVE_NL_TYPES_H 1
| #define HAVE_MALLOC_H 1
| #define HAVE_STDDEF_H 1
| #define HAVE_STDLIB_H 1
| #define HAVE_STRING_H 1
| #define HAVE_UNISTD_H 1
| #define HAVE_SYS_PARAM_H 1
| #define HAVE_ASPRINTF 1
| #define HAVE_FWPRINTF 1
| #define HAVE_GETCWD 1
| #define HAVE_GETEGID 1
| #define HAVE_GETEUID 1
| #define HAVE_GETGID 1
| #define HAVE_GETUID 1
| #define HAVE_MEMPCPY 1
| #define HAVE_MUNMAP 1
| #define HAVE_PUTENV 1
| #define HAVE_SETENV 1
| #define HAVE_SETLOCALE 1
| #define HAVE_SNPRINTF 1
| #define HAVE_STPCPY 1
| #define HAVE_STRCASECMP 1
| #define HAVE_STRDUP 1
| #define HAVE_STRTOUL 1
| #define HAVE_TSEARCH 1
| #define HAVE_WCSLEN 1
| #define HAVE___ARGZ_COUNT 1
| #define HAVE___ARGZ_STRINGIFY 1
| #define HAVE___ARGZ_NEXT 1
| #define HAVE___FSETLOCKING 1
| #define HAVE_DECL__SNPRINTF 0
| #define HAVE_DECL__SNWPRINTF 0
| #define HAVE_DECL_FEOF_UNLOCKED 1
| #define HAVE_DECL_FGETS_UNLOCKED 0
| #define HAVE_DECL_GETC_UNLOCKED 1
| #define HAVE_ICONV 1
| #define ICONV_CONST 
| #define HAVE_LANGINFO_CODESET 1
| #define HAVE_LC_MESSAGES 1
| #define HAVE_LIBZ 1
| #define STDC_HEADERS 1
| #define HAVE_STDLIB_H 1
| #define HAVE_STRING_H 1
| #define HAVE_UNISTD_H 1
| #define HAVE_TILP2_TICABLES_H 1
| #define HAVE_TILP2_TIFILES_H 1
| #define RETSIGTYPE void
| #define LSTAT_FOLLOWS_SLASHED_SYMLINK 1
| #define HAVE_GETCWD 1
| #define HAVE_MEMSET 1
| #define HAVE_MKDIR 1
| #define HAVE_STRCASECMP 1
| #define HAVE_STRCHR 1
| #define HAVE_STRDUP 1
| #define HAVE_STRRCHR 1
| #define HAVE_STRSTR 1
| #define HAVE_STRTOL 1
| #define HAVE_CRYPT 1
| #define ksize_t socklen_t
| #define HAVE_RES_INIT 1
| /* end confdefs.h.  */
| 
| /* Override any gcc2 internal prototype to avoid an error.  */
| #ifdef __cplusplus
| extern "C"
| #endif
| /* We use char because int might match the return type of a gcc2
|    builtin and then its argument prototype would still apply.  */
| char killpg ();
| int
| main ()
| {
| killpg ();
|   ;
|   return 0;
| }
configure:31148: result: no
configure:31231: checking for int
configure:31255: gcc -c -O2 -g -pipe -Wall -Wp,-D_FORTIFY_SOURCE=2 -fexceptions -fstack-protector --param=ssp-buffer-size=4 -m64 -mtune=generic -D__LINUX__  conftest.c >&5
configure:31261: $? = 0
configure:31265: test -z 
			 || test ! -s conftest.err
configure:31268: $? = 0
configure:31271: test -s conftest.o
configure:31274: $? = 0
configure:31285: result: yes
configure:31288: checking size of int
configure:31607: gcc -o conftest -O2 -g -pipe -Wall -Wp,-D_FORTIFY_SOURCE=2 -fexceptions -fstack-protector --param=ssp-buffer-size=4 -m64 -mtune=generic -D__LINUX__   conftest.c  >&5
configure:31610: $? = 0
configure:31612: ./conftest
configure:31615: $? = 0
configure:31638: result: 4
configure:31644: checking for long
configure:31668: gcc -c -O2 -g -pipe -Wall -Wp,-D_FORTIFY_SOURCE=2 -fexceptions -fstack-protector --param=ssp-buffer-size=4 -m64 -mtune=generic -D__LINUX__  conftest.c >&5
configure:31674: $? = 0
configure:31678: test -z 
			 || test ! -s conftest.err
configure:31681: $? = 0
configure:31684: test -s conftest.o
configure:31687: $? = 0
configure:31698: result: yes
configure:31701: checking size of long
configure:32020: gcc -o conftest -O2 -g -pipe -Wall -Wp,-D_FORTIFY_SOURCE=2 -fexceptions -fstack-protector --param=ssp-buffer-size=4 -m64 -mtune=generic -D__LINUX__   conftest.c  >&5
configure:32023: $? = 0
configure:32025: ./conftest
configure:32028: $? = 0
configure:32051: result: 8
configure:32057: checking for char *
configure:32081: gcc -c -O2 -g -pipe -Wall -Wp,-D_FORTIFY_SOURCE=2 -fexceptions -fstack-protector --param=ssp-buffer-size=4 -m64 -mtune=generic -D__LINUX__  conftest.c >&5
configure:32087: $? = 0
configure:32091: test -z 
			 || test ! -s conftest.err
configure:32094: $? = 0
configure:32097: test -s conftest.o
configure:32100: $? = 0
configure:32111: result: yes
configure:32114: checking size of char *
configure:32433: gcc -o conftest -O2 -g -pipe -Wall -Wp,-D_FORTIFY_SOURCE=2 -fexceptions -fstack-protector --param=ssp-buffer-size=4 -m64 -mtune=generic -D__LINUX__   conftest.c  >&5
configure:32436: $? = 0
configure:32438: ./conftest
configure:32441: $? = 0
configure:32464: result: 8
configure:32470: checking for char
configure:32494: gcc -c -O2 -g -pipe -Wall -Wp,-D_FORTIFY_SOURCE=2 -fexceptions -fstack-protector --param=ssp-buffer-size=4 -m64 -mtune=generic -D__LINUX__  conftest.c >&5
configure:32500: $? = 0
configure:32504: test -z 
			 || test ! -s conftest.err
configure:32507: $? = 0
configure:32510: test -s conftest.o
configure:32513: $? = 0
configure:32524: result: yes
configure:32527: checking size of char
configure:32846: gcc -o conftest -O2 -g -pipe -Wall -Wp,-D_FORTIFY_SOURCE=2 -fexceptions -fstack-protector --param=ssp-buffer-size=4 -m64 -mtune=generic -D__LINUX__   conftest.c  >&5
configure:32849: $? = 0
configure:32851: ./conftest
configure:32854: $? = 0
configure:32877: result: 1
configure:32885: checking for dlopen in -ldl
configure:32915: gcc -o conftest -O2 -g -pipe -Wall -Wp,-D_FORTIFY_SOURCE=2 -fexceptions -fstack-protector --param=ssp-buffer-size=4 -m64 -mtune=generic -D__LINUX__   conftest.c -ldl   >&5
configure:32921: $? = 0
configure:32925: test -z 
			 || test ! -s conftest.err
configure:32928: $? = 0
configure:32931: test -s conftest
configure:32934: $? = 0
configure:32947: result: yes
configure:32957: checking for shl_unload in -ldld
configure:32987: gcc -o conftest -O2 -g -pipe -Wall -Wp,-D_FORTIFY_SOURCE=2 -fexceptions -fstack-protector --param=ssp-buffer-size=4 -m64 -mtune=generic -D__LINUX__   conftest.c -ldld   >&5
/usr/bin/ld: cannot find -ldld
collect2: ld returned 1 exit status
configure:32993: $? = 1
configure: failed program was:
| /* confdefs.h.  */
| 
| #define PACKAGE_NAME "TiLP2"
| #define PACKAGE_TARNAME "tilp2"
| #define PACKAGE_VERSION "1.04"
| #define PACKAGE_STRING "TiLP2 1.04"
| #define PACKAGE_BUGREPORT "tilp-users@lists.sourceforge.net"
| #define PACKAGE "tilp2"
| #define VERSION "1.04"
| #define STDC_HEADERS 1
| #define HAVE_SYS_TYPES_H 1
| #define HAVE_SYS_STAT_H 1
| #define HAVE_STDLIB_H 1
| #define HAVE_STRING_H 1
| #define HAVE_MEMORY_H 1
| #define HAVE_STRINGS_H 1
| #define HAVE_INTTYPES_H 1
| #define HAVE_STDINT_H 1
| #define HAVE_UNISTD_H 1
| #define HAVE_DLFCN_H 1
| #ifdef __cplusplus
| extern "C" void std::exit (int) throw (); using std::exit;
| #endif
| #define HAVE_LONG_LONG 1
| #define HAVE_LONG_DOUBLE 1
| #define HAVE_WCHAR_T 1
| #define HAVE_WINT_T 1
| #define HAVE_INTTYPES_H_WITH_UINTMAX 1
| #define HAVE_STDINT_H_WITH_UINTMAX 1
| #define HAVE_INTMAX_T 1
| #define HAVE_POSIX_PRINTF 1
| #define HAVE_ALLOCA_H 1
| #define HAVE_ALLOCA 1
| #define HAVE_STDLIB_H 1
| #define HAVE_UNISTD_H 1
| #define HAVE_GETPAGESIZE 1
| #define HAVE_MMAP 1
| #define INTDIV0_RAISES_SIGFPE 1
| #define HAVE_UNSIGNED_LONG_LONG 1
| #define HAVE_UINTMAX_T 1
| #define HAVE_INTTYPES_H 1
| #define HAVE_STDINT_H 1
| #define HAVE_STDINT_H 1
| #define HAVE_ARGZ_H 1
| #define HAVE_LIMITS_H 1
| #define HAVE_LOCALE_H 1
| #define HAVE_NL_TYPES_H 1
| #define HAVE_MALLOC_H 1
| #define HAVE_STDDEF_H 1
| #define HAVE_STDLIB_H 1
| #define HAVE_STRING_H 1
| #define HAVE_UNISTD_H 1
| #define HAVE_SYS_PARAM_H 1
| #define HAVE_ASPRINTF 1
| #define HAVE_FWPRINTF 1
| #define HAVE_GETCWD 1
| #define HAVE_GETEGID 1
| #define HAVE_GETEUID 1
| #define HAVE_GETGID 1
| #define HAVE_GETUID 1
| #define HAVE_MEMPCPY 1
| #define HAVE_MUNMAP 1
| #define HAVE_PUTENV 1
| #define HAVE_SETENV 1
| #define HAVE_SETLOCALE 1
| #define HAVE_SNPRINTF 1
| #define HAVE_STPCPY 1
| #define HAVE_STRCASECMP 1
| #define HAVE_STRDUP 1
| #define HAVE_STRTOUL 1
| #define HAVE_TSEARCH 1
| #define HAVE_WCSLEN 1
| #define HAVE___ARGZ_COUNT 1
| #define HAVE___ARGZ_STRINGIFY 1
| #define HAVE___ARGZ_NEXT 1
| #define HAVE___FSETLOCKING 1
| #define HAVE_DECL__SNPRINTF 0
| #define HAVE_DECL__SNWPRINTF 0
| #define HAVE_DECL_FEOF_UNLOCKED 1
| #define HAVE_DECL_FGETS_UNLOCKED 0
| #define HAVE_DECL_GETC_UNLOCKED 1
| #define HAVE_ICONV 1
| #define ICONV_CONST 
| #define HAVE_LANGINFO_CODESET 1
| #define HAVE_LC_MESSAGES 1
| #define HAVE_LIBZ 1
| #define STDC_HEADERS 1
| #define HAVE_STDLIB_H 1
| #define HAVE_STRING_H 1
| #define HAVE_UNISTD_H 1
| #define HAVE_TILP2_TICABLES_H 1
| #define HAVE_TILP2_TIFILES_H 1
| #define RETSIGTYPE void
| #define LSTAT_FOLLOWS_SLASHED_SYMLINK 1
| #define HAVE_GETCWD 1
| #define HAVE_MEMSET 1
| #define HAVE_MKDIR 1
| #define HAVE_STRCASECMP 1
| #define HAVE_STRCHR 1
| #define HAVE_STRDUP 1
| #define HAVE_STRRCHR 1
| #define HAVE_STRSTR 1
| #define HAVE_STRTOL 1
| #define HAVE_CRYPT 1
| #define ksize_t socklen_t
| #define HAVE_RES_INIT 1
| #define SIZEOF_INT 4
| #define SIZEOF_LONG 8
| #define SIZEOF_CHAR_P 8
| #define SIZEOF_CHAR 1
| /* end confdefs.h.  */
| 
| /* Override any gcc2 internal prototype to avoid an error.  */
| #ifdef __cplusplus
| extern "C"
| #endif
| /* We use char because int might match the return type of a gcc2
|    builtin and then its argument prototype would still apply.  */
| char shl_unload ();
| int
| main ()
| {
| shl_unload ();
|   ;
|   return 0;
| }
configure:33019: result: no
configure:33054: checking for X
configure:33096: gcc -E  conftest.c
configure:33102: $? = 0
configure:33193: gcc -o conftest -O2 -g -pipe -Wall -Wp,-D_FORTIFY_SOURCE=2 -fexceptions -fstack-protector --param=ssp-buffer-size=4 -m64 -mtune=generic -D__LINUX__   conftest.c -lXt  >&5
conftest.c: In function 'main':
conftest.c:116: warning: implicit declaration of function 'XtMalloc'
configure:33199: $? = 0
configure:33203: test -z 
			 || test ! -s conftest.err
configure:33206: $? = 0
configure:33209: test -s conftest
configure:33212: $? = 0
configure:33358: result: libraries /usr/lib64, headers .
configure:33392: checking for IceConnectionNumber in -lICE
configure:33422: gcc -o conftest -O2 -g -pipe -Wall -Wp,-D_FORTIFY_SOURCE=2 -fexceptions -fstack-protector --param=ssp-buffer-size=4 -m64 -mtune=generic -D__LINUX__   -L/usr/lib64 conftest.c -lICE  -lresolv  >&5
configure:33428: $? = 0
configure:33432: test -z 
			 || test ! -s conftest.err
configure:33435: $? = 0
configure:33438: test -s conftest
configure:33441: $? = 0
configure:33454: result: yes
configure:33468: checking for libXext
configure:33503: gcc -o conftest -O2 -g -pipe -Wall -Wp,-D_FORTIFY_SOURCE=2 -fexceptions -fstack-protector --param=ssp-buffer-size=4 -m64 -mtune=generic -D__LINUX__   -L/usr/lib64  conftest.c -lXext -lX11  -lresolv >&5
configure:33509: $? = 0
configure:33513: test -z 
			 || test ! -s conftest.err
configure:33516: $? = 0
configure:33519: test -s conftest
configure:33522: $? = 0
configure:33541: result: yes
configure:33554: checking for Xinerama
configure:33638: result: no
configure:33757: checking for pthread_create in -lpthread
configure:33787: gcc -o conftest -O2 -g -pipe -Wall -Wp,-D_FORTIFY_SOURCE=2 -fexceptions -fstack-protector --param=ssp-buffer-size=4 -m64 -mtune=generic -D__LINUX__   conftest.c -lpthread   >&5
configure:33793: $? = 0
configure:33797: test -z 
			 || test ! -s conftest.err
configure:33800: $? = 0
configure:33803: test -s conftest
configure:33806: $? = 0
configure:33819: result: yes
configure:34275: checking for extra includes
configure:34303: result: no
configure:34307: checking for extra libs
configure:34336: result: no
configure:34342: checking for libz
configure:34376: gcc -o conftest -O2 -g -pipe -Wall -Wp,-D_FORTIFY_SOURCE=2 -fexceptions -fstack-protector --param=ssp-buffer-size=4 -m64 -mtune=generic -D__LINUX__ -I.   -D_REENTRANT  conftest.c -L/usr/lib64  -lz  -lresolv >&5
configure:34382: $? = 0
configure:34386: test -z 
			 || test ! -s conftest.err
configure:34389: $? = 0
configure:34392: test -s conftest
configure:34395: $? = 0
configure:34418: result: -lz
configure:34431: checking for libpng
configure:34473: gcc -o conftest -O2 -g -pipe -Wall -Wp,-D_FORTIFY_SOURCE=2 -fexceptions -fstack-protector --param=ssp-buffer-size=4 -m64 -mtune=generic -D__LINUX__ -I.   -D_REENTRANT  conftest.c  -L/usr/lib64  -lpng -lz -lm -lX11  -lresolv >&5
configure:34479: $? = 0
configure:34483: test -z 
			 || test ! -s conftest.err
configure:34486: $? = 0
configure:34489: test -s conftest
configure:34492: $? = 0
configure:34516: result: -lpng -lz -lm
configure:34527: checking for libjpeg6b
configure:34573: gcc -o conftest -O2 -g -pipe -Wall -Wp,-D_FORTIFY_SOURCE=2 -fexceptions -fstack-protector --param=ssp-buffer-size=4 -m64 -mtune=generic -D__LINUX__ -I.   -D_REENTRANT  conftest.c -L/usr/lib64  -ljpeg6b -lm >&5
/usr/bin/ld: cannot find -ljpeg6b
collect2: ld returned 1 exit status
configure:34579: $? = 1
configure: failed program was:
| /* confdefs.h.  */
| 
| #define PACKAGE_NAME "TiLP2"
| #define PACKAGE_TARNAME "tilp2"
| #define PACKAGE_VERSION "1.04"
| #define PACKAGE_STRING "TiLP2 1.04"
| #define PACKAGE_BUGREPORT "tilp-users@lists.sourceforge.net"
| #define PACKAGE "tilp2"
| #define VERSION "1.04"
| #define STDC_HEADERS 1
| #define HAVE_SYS_TYPES_H 1
| #define HAVE_SYS_STAT_H 1
| #define HAVE_STDLIB_H 1
| #define HAVE_STRING_H 1
| #define HAVE_MEMORY_H 1
| #define HAVE_STRINGS_H 1
| #define HAVE_INTTYPES_H 1
| #define HAVE_STDINT_H 1
| #define HAVE_UNISTD_H 1
| #define HAVE_DLFCN_H 1
| #ifdef __cplusplus
| extern "C" void std::exit (int) throw (); using std::exit;
| #endif
| #define HAVE_LONG_LONG 1
| #define HAVE_LONG_DOUBLE 1
| #define HAVE_WCHAR_T 1
| #define HAVE_WINT_T 1
| #define HAVE_INTTYPES_H_WITH_UINTMAX 1
| #define HAVE_STDINT_H_WITH_UINTMAX 1
| #define HAVE_INTMAX_T 1
| #define HAVE_POSIX_PRINTF 1
| #define HAVE_ALLOCA_H 1
| #define HAVE_ALLOCA 1
| #define HAVE_STDLIB_H 1
| #define HAVE_UNISTD_H 1
| #define HAVE_GETPAGESIZE 1
| #define HAVE_MMAP 1
| #define INTDIV0_RAISES_SIGFPE 1
| #define HAVE_UNSIGNED_LONG_LONG 1
| #define HAVE_UINTMAX_T 1
| #define HAVE_INTTYPES_H 1
| #define HAVE_STDINT_H 1
| #define HAVE_STDINT_H 1
| #define HAVE_ARGZ_H 1
| #define HAVE_LIMITS_H 1
| #define HAVE_LOCALE_H 1
| #define HAVE_NL_TYPES_H 1
| #define HAVE_MALLOC_H 1
| #define HAVE_STDDEF_H 1
| #define HAVE_STDLIB_H 1
| #define HAVE_STRING_H 1
| #define HAVE_UNISTD_H 1
| #define HAVE_SYS_PARAM_H 1
| #define HAVE_ASPRINTF 1
| #define HAVE_FWPRINTF 1
| #define HAVE_GETCWD 1
| #define HAVE_GETEGID 1
| #define HAVE_GETEUID 1
| #define HAVE_GETGID 1
| #define HAVE_GETUID 1
| #define HAVE_MEMPCPY 1
| #define HAVE_MUNMAP 1
| #define HAVE_PUTENV 1
| #define HAVE_SETENV 1
| #define HAVE_SETLOCALE 1
| #define HAVE_SNPRINTF 1
| #define HAVE_STPCPY 1
| #define HAVE_STRCASECMP 1
| #define HAVE_STRDUP 1
| #define HAVE_STRTOUL 1
| #define HAVE_TSEARCH 1
| #define HAVE_WCSLEN 1
| #define HAVE___ARGZ_COUNT 1
| #define HAVE___ARGZ_STRINGIFY 1
| #define HAVE___ARGZ_NEXT 1
| #define HAVE___FSETLOCKING 1
| #define HAVE_DECL__SNPRINTF 0
| #define HAVE_DECL__SNWPRINTF 0
| #define HAVE_DECL_FEOF_UNLOCKED 1
| #define HAVE_DECL_FGETS_UNLOCKED 0
| #define HAVE_DECL_GETC_UNLOCKED 1
| #define HAVE_ICONV 1
| #define ICONV_CONST 
| #define HAVE_LANGINFO_CODESET 1
| #define HAVE_LC_MESSAGES 1
| #define HAVE_LIBZ 1
| #define STDC_HEADERS 1
| #define HAVE_STDLIB_H 1
| #define HAVE_STRING_H 1
| #define HAVE_UNISTD_H 1
| #define HAVE_TILP2_TICABLES_H 1
| #define HAVE_TILP2_TIFILES_H 1
| #define RETSIGTYPE void
| #define LSTAT_FOLLOWS_SLASHED_SYMLINK 1
| #define HAVE_GETCWD 1
| #define HAVE_MEMSET 1
| #define HAVE_MKDIR 1
| #define HAVE_STRCASECMP 1
| #define HAVE_STRCHR 1
| #define HAVE_STRDUP 1
| #define HAVE_STRRCHR 1
| #define HAVE_STRSTR 1
| #define HAVE_STRTOL 1
| #define HAVE_CRYPT 1
| #define ksize_t socklen_t
| #define HAVE_RES_INIT 1
| #define SIZEOF_INT 4
| #define SIZEOF_LONG 8
| #define SIZEOF_CHAR_P 8
| #define SIZEOF_CHAR 1
| #define HAVE_LIBZ 1
| #define HAVE_LIBPNG 1
| /* end confdefs.h.  */
| /* Override any gcc2 internal prototype to avoid an error.  */
| struct jpeg_decompress_struct;
| typedef struct jpeg_decompress_struct * j_decompress_ptr;
| typedef int size_t;
| #ifdef __cplusplus
| extern "C" {
| #endif
|     void jpeg_CreateDecompress(j_decompress_ptr cinfo,
|                                     int version, size_t structsize);
| #ifdef __cplusplus
| }
| #endif
| /* We use char because int might match the return type of a gcc2
|     builtin and then its argument prototype would still apply.  */
| 
| int
| main ()
| {
| jpeg_CreateDecompress(0L, 0, 0);
|   ;
|   return 0;
| }
configure:34614: result: no
configure:34617: checking for libjpeg
configure:34663: gcc -o conftest -O2 -g -pipe -Wall -Wp,-D_FORTIFY_SOURCE=2 -fexceptions -fstack-protector --param=ssp-buffer-size=4 -m64 -mtune=generic -D__LINUX__ -I.   -D_REENTRANT  conftest.c -L/usr/lib64  -ljpeg -lm >&5
configure:34669: $? = 0
configure:34673: test -z 
			 || test ! -s conftest.err
configure:34676: $? = 0
configure:34679: test -s conftest
configure:34682: $? = 0
configure:34701: result: -ljpeg
configure: 34725: /usr/include/jpeglib.h
taking that
configure:34895: checking for Qt
configure: 34960: /usr/lib64/qt-3.3/include/qstyle.h
taking that
tried NO
configure:35072: rm -rf SunWS_cache; g++ -o conftest -g -O2 -I/usr/lib64/qt-3.3/include -I.  -DQT_THREAD_SUPPORT  -D_REENTRANT  -L/usr/lib64/qt-3.3/lib -L/usr/lib64   conftest.cc  -lqt-mt -lpng -lz -lm -ljpeg -ldl  -lXext -lX11 -lSM -lICE  -lresolv -lpthread 1>&5
configure:35075: $? = 0
configure:35134: result: libraries /usr/lib64/qt-3.3/lib, headers /usr/lib64/qt-3.3/include using -mt
configure:35144: checking if Qt compiles without flags
configure:35241: rm -rf SunWS_cache; g++ -o conftest -g -O2 -I/usr/lib64/qt-3.3/include  -DQT_THREAD_SUPPORT  -D_REENTRANT  -L/usr/lib64 conftest.cc -lqt-mt -lpng -lz -lm -ljpeg -ldl  -lXext -lX11 -lSM -lICE  -lresolv -lXext -lX11  -lresolv 1>&5
/usr/bin/ld: cannot find -lqt-mt
collect2: ld returned 1 exit status
configure:35244: $? = 1
configure: failed program was:
#include "confdefs.h"
#include <qglobal.h>
#include <qapplication.h>
#include <qcursor.h>
#include <qstylefactory.h>
#include <private/qucomextra_p.h>
#if ! (QT_VERSION >= 302)
#error 1
#endif

int main() {
    (void)QStyleFactory::create(QString::null);
    QCursor c(Qt::WhatsThisCursor);
    return 0;
}
configure:35277: result: no
configure:35315: checking for moc
configure:35384: result: /usr/lib64/qt-3.3/bin/moc
configure:35392: checking for uic
configure:35443: result: /usr/lib64/qt-3.3/bin/uic
configure:35471: checking whether uic supports -L 
configure:35482: /usr/lib64/qt-3.3/bin/uic -L /nonexistant conftest.ui >/dev/null
configure:35485: $? = 0
configure:35497: result: yes
configure:35509: checking whether uic supports -nounload 
configure:35520: /usr/lib64/qt-3.3/bin/uic -nounload  conftest.ui >/dev/null
configure:35523: $? = 0
configure:35535: result: yes
configure:35570: checking if Qt needs -ljpeg
configure:35611: rm -rf SunWS_cache; g++ -o conftest -g -O2 -I/usr/lib64/qt-3.3/include -I.   -DQT_THREAD_SUPPORT  -D_REENTRANT  conftest.cc -L/usr/lib64 -L/usr/lib64/qt-3.3/lib -lqt-mt -lpng -lz -lm  -ldl -lXext -lX11 -lSM -lICE -lresolv 1>&5
configure:35617: $? = 0
configure:35621: test -z 
			 || test ! -s conftest.err
configure:35624: $? = 0
configure:35627: test -s conftest
configure:35630: $? = 0
configure:35658: result: no
configure:35682: checking for rpath
configure:35708: result: yes
configure:35711: checking for KDE
configure: 35756: /usr/include/ksharedptr.h
configure: 35756: /usr/include/kde3/ksharedptr.h
configure: 35756: /usr/include/kde/ksharedptr.h
taking that
configure: 35785: /usr/lib/libkio.la
taking that
configure:35845: result: libraries /usr/lib, headers /usr/include/kde
configure:35900: checking for KDE paths
configure:36460: result: defaults
configure:36479: checking for dcopidl
configure:36538: result: /usr/bin/dcopidl
configure:36545: checking for dcopidl2cpp
configure:36604: result: /usr/bin/dcopidl2cpp
configure:36611: checking for kde-config
configure:36662: result: /usr/bin/kde-config
configure:36857: checking whether gcc accepts -fvisibility
configure:36872: result: -fvisibility=hidden
configure:37065: creating ./config.status

## ---------------------- ##
## Running config.status. ##
## ---------------------- ##

This file was extended by TiLP2 config.status 1.04, which was
generated by GNU Autoconf 2.59.  Invocation command line was

  CONFIG_FILES    = 
  CONFIG_HEADERS  = 
  CONFIG_LINKS    = 
  CONFIG_COMMANDS = 
  $ ./config.status 

on joe

config.status:872: creating Makefile
config.status:872: creating build/Makefile
config.status:872: creating glade/Makefile
config.status:872: creating help/Makefile
config.status:872: creating icons/Makefile
config.status:872: creating intl/Makefile
config.status:872: creating man/Makefile
config.status:872: creating pixmaps/Makefile
config.status:872: creating po/Makefile.in
config.status:872: creating src/Makefile
config.status:976: creating config.h
config.status:1484: executing depfiles commands
config.status:1484: executing default-1 commands

## ---------------- ##
## Cache variables. ##
## ---------------- ##

ac_cv_build=x86_64-unknown-linux-gnu
ac_cv_build_alias=x86_64-unknown-linux-gnu
ac_cv_c_compiler_gnu=yes
ac_cv_c_const=yes
ac_cv_c_inline=inline
ac_cv_cxx_compiler_gnu=yes
ac_cv_env_CC_set=
ac_cv_env_CC_value=
ac_cv_env_CFLAGS_set=set
ac_cv_env_CFLAGS_value='-O2 -g -pipe -Wall -Wp,-D_FORTIFY_SOURCE=2 -fexceptions -fstack-protector --param=ssp-buffer-size=4 -m64 -mtune=generic'
ac_cv_env_CPPFLAGS_set=
ac_cv_env_CPPFLAGS_value=
ac_cv_env_CPP_set=
ac_cv_env_CPP_value=
ac_cv_env_CXXCPP_set=
ac_cv_env_CXXCPP_value=
ac_cv_env_CXXFLAGS_set=
ac_cv_env_CXXFLAGS_value=
ac_cv_env_CXX_set=
ac_cv_env_CXX_value=
ac_cv_env_F77_set=
ac_cv_env_F77_value=
ac_cv_env_FFLAGS_set=
ac_cv_env_FFLAGS_value=
ac_cv_env_GLADE_CFLAGS_set=
ac_cv_env_GLADE_CFLAGS_value=
ac_cv_env_GLADE_LIBS_set=
ac_cv_env_GLADE_LIBS_value=
ac_cv_env_GLIB_CFLAGS_set=
ac_cv_env_GLIB_CFLAGS_value=
ac_cv_env_GLIB_LIBS_set=
ac_cv_env_GLIB_LIBS_value=
ac_cv_env_GTK_CFLAGS_set=
ac_cv_env_GTK_CFLAGS_value=
ac_cv_env_GTK_LIBS_set=
ac_cv_env_GTK_LIBS_value=
ac_cv_env_LDFLAGS_set=
ac_cv_env_LDFLAGS_value=
ac_cv_env_PKG_CONFIG_set=
ac_cv_env_PKG_CONFIG_value=
ac_cv_env_TICABLES_CFLAGS_set=
ac_cv_env_TICABLES_CFLAGS_value=
ac_cv_env_TICABLES_LIBS_set=
ac_cv_env_TICABLES_LIBS_value=
ac_cv_env_TICALCS_CFLAGS_set=
ac_cv_env_TICALCS_CFLAGS_value=
ac_cv_env_TICALCS_LIBS_set=
ac_cv_env_TICALCS_LIBS_value=
ac_cv_env_TICONV_CFLAGS_set=
ac_cv_env_TICONV_CFLAGS_value=
ac_cv_env_TICONV_LIBS_set=
ac_cv_env_TICONV_LIBS_value=
ac_cv_env_TIFILES_CFLAGS_set=
ac_cv_env_TIFILES_CFLAGS_value=
ac_cv_env_TIFILES_LIBS_set=
ac_cv_env_TIFILES_LIBS_value=
ac_cv_env_build_alias_set=
ac_cv_env_build_alias_value=
ac_cv_env_host_alias_set=
ac_cv_env_host_alias_value=
ac_cv_env_target_alias_set=
ac_cv_env_target_alias_value=
ac_cv_exeext=
ac_cv_f77_compiler_gnu=yes
ac_cv_func___argz_count=yes
ac_cv_func___argz_next=yes
ac_cv_func___argz_stringify=yes
ac_cv_func___fsetlocking=yes
ac_cv_func_alloca_works=yes
ac_cv_func_asprintf=yes
ac_cv_func_connect=yes
ac_cv_func_fwprintf=yes
ac_cv_func_getcwd=yes
ac_cv_func_getegid=yes
ac_cv_func_geteuid=yes
ac_cv_func_getgid=yes
ac_cv_func_getpagesize=yes
ac_cv_func_getuid=yes
ac_cv_func_inet_ntoa=yes
ac_cv_func_lstat_dereferences_slashed_symlink=yes
ac_cv_func_mempcpy=yes
ac_cv_func_memset=yes
ac_cv_func_mkdir=yes
ac_cv_func_mmap_fixed_mapped=yes
ac_cv_func_munmap=yes
ac_cv_func_putenv=yes
ac_cv_func_remove=yes
ac_cv_func_res_init=no
ac_cv_func_setenv=yes
ac_cv_func_setlocale=yes
ac_cv_func_shmat=yes
ac_cv_func_snprintf=yes
ac_cv_func_stat_empty_string_bug=no
ac_cv_func_stpcpy=yes
ac_cv_func_strcasecmp=yes
ac_cv_func_strchr=yes
ac_cv_func_strdup=yes
ac_cv_func_strrchr=yes
ac_cv_func_strstr=yes
ac_cv_func_strtol=yes
ac_cv_func_strtoul=yes
ac_cv_func_tsearch=yes
ac_cv_func_wcslen=yes
ac_cv_gnu_library_2=yes
ac_cv_gnu_library_2_1=yes
ac_cv_have_decl__snprintf=no
ac_cv_have_decl__snwprintf=no
ac_cv_have_decl_feof_unlocked=yes
ac_cv_have_decl_fgets_unlocked=no
ac_cv_have_decl_getc_unlocked=yes
ac_cv_have_dlfcn=yes
ac_cv_have_kde='have_kde=yes     ac_kde_includes=/usr/include/kde ac_kde_libraries=/usr/lib'
ac_cv_have_qt='have_qt=yes     ac_qt_includes=/usr/lib64/qt-3.3/include ac_qt_libraries=/usr/lib64/qt-3.3/lib'
ac_cv_have_xinerama=no
ac_cv_header_argz_h=yes
ac_cv_header_dlfcn_h=yes
ac_cv_header_inttypes_h=yes
ac_cv_header_limits_h=yes
ac_cv_header_locale_h=yes
ac_cv_header_malloc_h=yes
ac_cv_header_memory_h=yes
ac_cv_header_nl_types_h=yes
ac_cv_header_stat_broken=no
ac_cv_header_stdc=yes
ac_cv_header_stddef_h=yes
ac_cv_header_stdint_h=yes
ac_cv_header_stdlib_h=yes
ac_cv_header_string_h=yes
ac_cv_header_strings_h=yes
ac_cv_header_sys_param_h=yes
ac_cv_header_sys_stat_h=yes
ac_cv_header_sys_types_h=yes
ac_cv_header_tilp2_ticables_h=yes
ac_cv_header_tilp2_ticalcs_h=no
ac_cv_header_tilp2_tifiles_h=yes
ac_cv_header_unistd_h=yes
ac_cv_header_zlib_h=yes
ac_cv_host=x86_64-unknown-linux-gnu
ac_cv_host_alias=x86_64-unknown-linux-gnu
ac_cv_lib_ICE_IceConnectionNumber=yes
ac_cv_lib_compat_main=no
ac_cv_lib_cposix_strerror=no
ac_cv_lib_crypt_crypt=yes
ac_cv_lib_dl_dlopen=yes
ac_cv_lib_dld_shl_unload=no
ac_cv_lib_dnet_dnet_ntoa=no
ac_cv_lib_dnet_stub_dnet_ntoa=no
ac_cv_lib_jpeg_6b=no
ac_cv_lib_jpeg_normal=-ljpeg
ac_cv_lib_png='-lpng -lz -lm'
ac_cv_lib_pthread_pthread_create=yes
ac_cv_lib_ucb_killpg=no
ac_cv_lib_util_main=yes
ac_cv_lib_z=-lz
ac_cv_lib_z_compress=yes
ac_cv_objext=o
ac_cv_path_GMSGFMT=/usr/bin/msgfmt
ac_cv_path_MSGFMT=/usr/bin/msgfmt
ac_cv_path_MSGMERGE=/usr/bin/msgmerge
ac_cv_path_XGETTEXT=/usr/bin/xgettext
ac_cv_path_ac_pt_PKG_CONFIG=/usr/bin/pkg-config
ac_cv_path_install='/usr/bin/install -c'
ac_cv_prog_AWK=gawk
ac_cv_prog_CPP='gcc -E'
ac_cv_prog_CXXCPP='g++ -E'
ac_cv_prog_GROFF=yes
ac_cv_prog_INTLBISON=bison
ac_cv_prog_ac_ct_AR=ar
ac_cv_prog_ac_ct_CC=gcc
ac_cv_prog_ac_ct_CXX=g++
ac_cv_prog_ac_ct_F77=f95
ac_cv_prog_ac_ct_RANLIB=ranlib
ac_cv_prog_ac_ct_STRIP=strip
ac_cv_prog_cc_g=yes
ac_cv_prog_cc_stdc=
ac_cv_prog_cxx_g=yes
ac_cv_prog_egrep='grep -E'
ac_cv_prog_f77_g=yes
ac_cv_prog_gcc_traditional=no
ac_cv_prog_make_make_set=yes
ac_cv_sizeof_char=1
ac_cv_sizeof_char_p=8
ac_cv_sizeof_int=4
ac_cv_sizeof_long=8
ac_cv_socklen_t=socklen_t
ac_cv_struct_tm=time.h
ac_cv_type_char=yes
ac_cv_type_char_p=yes
ac_cv_type_int=yes
ac_cv_type_long=yes
ac_cv_type_long_long=yes
ac_cv_type_mode_t=yes
ac_cv_type_off_t=yes
ac_cv_type_ptrdiff_t=yes
ac_cv_type_signal=void
ac_cv_type_size_t=yes
ac_cv_type_uid_t=yes
ac_cv_type_unsigned_long_long=yes
ac_cv_working_alloca_h=yes
acl_cv_hardcode_direct=no
acl_cv_hardcode_libdir_flag_spec='${wl}-rpath ${wl}$libdir'
acl_cv_hardcode_libdir_separator=
acl_cv_hardcode_minus_L=no
acl_cv_libext=a
acl_cv_path_LD='/usr/bin/ld -m elf_x86_64'
acl_cv_prog_gnu_ld=yes
acl_cv_rpath=done
acl_cv_shlibext=so
acl_cv_wl=-Wl,
am_cv_CC_dependencies_compiler_type=gcc3
am_cv_CXX_dependencies_compiler_type=gcc3
am_cv_func_iconv=yes
am_cv_langinfo_codeset=yes
am_cv_lib_iconv=no
am_cv_proto_iconv='extern size_t iconv (iconv_t cd, char * *inbuf, size_t *inbytesleft, char * *outbuf, size_t *outbytesleft);'
am_cv_proto_iconv_arg1=
bh_cv_c_signed=yes
gl_cv_header_inttypes_h=yes
gl_cv_header_stdint_h=yes
gt_cv_c_intmax_t=yes
gt_cv_c_long_double=yes
gt_cv_c_wchar_t=yes
gt_cv_c_wint_t=yes
gt_cv_func_CFLocaleCopyCurrent=no
gt_cv_func_CFPreferencesCopyAppValue=no
gt_cv_func_printf_posix=yes
gt_cv_header_inttypes_h=yes
gt_cv_int_divbyzero_sigfpe=yes
gt_cv_inttypes_pri_broken=no
gt_cv_val_LC_MESSAGES=yes
kde_cv_all_paths='kde_have_all_paths="yes" 	kde_htmldir="\${prefix}/share/doc/HTML" 	kde_appsdir="\${prefix}/share/applnk" 	kde_icondir="\${prefix}/share/icons" 	kde_sounddir="\${prefix}/share/sounds" 	kde_datadir="\${prefix}/share/apps" 	kde_locale="\${prefix}/share/locale" 	kde_cgidir="\${exec_prefix}/cgi-bin" 	kde_confdir="\${prefix}/share/config" 	kde_mimedir="\${prefix}/share/mimelnk" 	kde_toolbardir="\${prefix}/share/toolbar" 	kde_wallpaperdir="\${prefix}/share/wallpapers" 	kde_templatesdir="\${prefix}/share/templates" 	kde_bindir="\${exec_prefix}/bin" 	kde_servicesdir="\${prefix}/share/services" 	kde_servicetypesdir="\${prefix}/share/servicetypes" 	kde_moduledir="\${exec_prefix}/lib/kde3"    kde_styledir="\${exec_prefix}/lib/kde3/plugins/styles" 	kde_widgetdir="\${exec_prefix}/lib/kde3/plugins/designer" 	kde_result=defaults'
kde_cv_have_libXext=yes
kde_cv_have_x='have_x=yes          kde_x_includes=. kde_x_libraries=/usr/lib64'
kde_cv_path=/usr/bin/kde-config
kde_cv_path_dcopidl=/usr/bin/dcopidl
kde_cv_path_dcopidl2cpp=/usr/bin/dcopidl2cpp
kde_cv_path_kde_config=/usr/bin/kde-config
kde_cv_path_moc=/usr/lib64/qt-3.3/bin/moc
kde_cv_path_uic=/usr/lib64/qt-3.3/bin/uic
kde_cv_prog_uic_L=yes
kde_cv_prog_uic_nounload=yes
kde_cv_qt_direct=no
kde_cv_qt_jpeg=no
lt_cv_deplibs_check_method=pass_all
lt_cv_file_magic_cmd='$MAGIC_CMD'
lt_cv_file_magic_test_file=
lt_cv_ld_reload_flag=-r
lt_cv_objdir=.libs
lt_cv_path_LD=/usr/bin/ld
lt_cv_path_LDCXX='/usr/bin/ld -m elf_x86_64'
lt_cv_path_NM='/usr/bin/nm -B'
lt_cv_path_SED=/bin/sed
lt_cv_prog_compiler_c_o=yes
lt_cv_prog_compiler_c_o_CXX=yes
lt_cv_prog_compiler_c_o_F77=yes
lt_cv_prog_compiler_rtti_exceptions=no
lt_cv_prog_gnu_ld=yes
lt_cv_prog_gnu_ldcxx=yes
lt_cv_sys_global_symbol_pipe='sed -n -e '\''s/^.*[ 	]\([ABCDGIRSTW][ABCDGIRSTW]*\)[ 	][ 	]*\([_A-Za-z][_A-Za-z0-9]*\)$/\1 \2 \2/p'\'''
lt_cv_sys_global_symbol_to_c_name_address='sed -n -e '\''s/^: \([^ ]*\) $/  {\"\1\", (lt_ptr) 0},/p'\'' -e '\''s/^[BCDEGRST] \([^ ]*\) \([^ ]*\)$/  {"\2", (lt_ptr) \&\2},/p'\'''
lt_cv_sys_global_symbol_to_cdecl='sed -n -e '\''s/^. .* \(.*\)$/extern int \1;/p'\'''
lt_cv_sys_max_cmd_len=32768
lt_lt_cv_prog_compiler_c_o='"yes"'
lt_lt_cv_prog_compiler_c_o_CXX='"yes"'
lt_lt_cv_prog_compiler_c_o_F77='"yes"'
lt_lt_cv_sys_global_symbol_pipe='"sed -n -e '\''s/^.*[ 	]\\([ABCDGIRSTW][ABCDGIRSTW]*\\)[ 	][ 	]*\\([_A-Za-z][_A-Za-z0-9]*\\)\$/\\1 \\2 \\2/p'\''"'
lt_lt_cv_sys_global_symbol_to_c_name_address='"sed -n -e '\''s/^: \\([^ ]*\\) \$/  {\\\"\\1\\\", (lt_ptr) 0},/p'\'' -e '\''s/^[BCDEGRST] \\([^ ]*\\) \\([^ ]*\\)\$/  {\"\\2\", (lt_ptr) \\&\\2},/p'\''"'
lt_lt_cv_sys_global_symbol_to_cdecl='"sed -n -e '\''s/^. .* \\(.*\\)\$/extern int \\1;/p'\''"'
nls_cv_header_intl=
nls_cv_header_libgt=
pkg_cv_GLADE_CFLAGS='-I/usr/include/libglade-2.0 -I/usr/include/gtk-2.0 -I/usr/include/libxml2 -I/usr/lib64/gtk-2.0/include -I/usr/include/atk-1.0 -I/usr/include/cairo -I/usr/include/pango-1.0 -I/usr/include/glib-2.0 -I/usr/lib64/glib-2.0/include -I/usr/include/freetype2 -I/usr/include/libpng12  '
pkg_cv_GLADE_LIBS='-L/lib64 -lglade-2.0 -lgtk-x11-2.0 -lxml2 -lz -lgdk-x11-2.0 -latk-1.0 -lgdk_pixbuf-2.0 -lm -lpangocairo-1.0 -lpango-1.0 -lcairo -lgobject-2.0 -lgmodule-2.0 -ldl -lglib-2.0  '
pkg_cv_GLIB_CFLAGS='-I/usr/include/glib-2.0 -I/usr/lib64/glib-2.0/include  '
pkg_cv_GLIB_LIBS='-L/lib64 -lglib-2.0  '
pkg_cv_GTK_CFLAGS='-I/usr/include/gtk-2.0 -I/usr/lib64/gtk-2.0/include -I/usr/include/atk-1.0 -I/usr/include/cairo -I/usr/include/pango-1.0 -I/usr/include/glib-2.0 -I/usr/lib64/glib-2.0/include -I/usr/include/freetype2 -I/usr/include/libpng12  '
pkg_cv_GTK_LIBS='-L/lib64 -lgtk-x11-2.0 -lgdk-x11-2.0 -latk-1.0 -lgdk_pixbuf-2.0 -lm -lpangocairo-1.0 -lpango-1.0 -lcairo -lgobject-2.0 -lgmodule-2.0 -ldl -lglib-2.0  '
pkg_cv_TICABLES_CFLAGS='-I/usr/include/tilp2 -I/usr/include/glib-2.0 -I/usr/lib64/glib-2.0/include  '
pkg_cv_TICABLES_LIBS='-L/lib64 -lticables2 -lglib-2.0  '
pkg_cv_TICALCS_CFLAGS='-I/usr/include/tilp2 -I/usr/include/glib-2.0 -I/usr/lib64/glib-2.0/include  '
pkg_cv_TICALCS_LIBS='-L/lib64 -lticalcs2 -lticables2 -ltifiles2 -lticonv -lglib-2.0  '
pkg_cv_TICONV_CFLAGS='-I/usr/include/tilp2 -I/usr/include/glib-2.0 -I/usr/lib64/glib-2.0/include  '
pkg_cv_TICONV_LIBS='-L/lib64 -lticonv -lglib-2.0  '
pkg_cv_TIFILES_CFLAGS='-I/usr/include/tilp2 -I/usr/include/glib-2.0 -I/usr/lib64/glib-2.0/include  '
pkg_cv_TIFILES_LIBS='-L/lib64 -ltifiles2 -lticonv -lglib-2.0  '

## ----------------- ##
## Output variables. ##
## ----------------- ##

ACLOCAL='${SHELL} /home/tyler/rpmbuild/BUILD/tilp2-1.04/missing --run aclocal-1.9'
ALLOCA=''
AMDEPBACKSLASH='\'
AMDEP_FALSE='#'
AMDEP_TRUE=''
AMTAR='${SHELL} /home/tyler/rpmbuild/BUILD/tilp2-1.04/missing --run tar'
AR='ar'
AS='as'
AUTOCONF='${SHELL} /home/tyler/rpmbuild/BUILD/tilp2-1.04/missing --run autoconf'
AUTODIRS=''
AUTOHEADER='${SHELL} /home/tyler/rpmbuild/BUILD/tilp2-1.04/missing --run autoheader'
AUTOMAKE='${SHELL} /home/tyler/rpmbuild/BUILD/tilp2-1.04/missing --run automake-1.9'
AWK='gawk'
BUILD_INCLUDED_LIBINTL='no'
CATOBJEXT=''
CC='gcc'
CCDEPMODE='depmode=gcc3'
CFLAGS='-O2 -g -pipe -Wall -Wp,-D_FORTIFY_SOURCE=2 -fexceptions -fstack-protector --param=ssp-buffer-size=4 -m64 -mtune=generic -D__LINUX__ -fvisibility=hidden -DGTK_DISABLE_DEPRECATED'
CPP='gcc -E'
CPPFLAGS=' -DQT_THREAD_SUPPORT  -D_REENTRANT'
CXX='g++'
CXXCPP='g++ -E'
CXXDEPMODE='depmode=gcc3'
CXXFLAGS='-O2 -g -pipe -Wall -Wp,-D_FORTIFY_SOURCE=2 -fexceptions -fstack-protector --param=ssp-buffer-size=4 -m64 -mtune=generic -D__LINUX__ -fvisibility=hidden -DGTK_DISABLE_DEPRECATED -fno-rtti -fno-exceptions'
CYGPATH_W='echo'
DATADIRNAME='share'
DCOPIDL2CPP='/usr/bin/dcopidl2cpp'
DCOPIDL='/usr/bin/dcopidl'
DCOP_DEPENDENCIES='$(DCOPIDL)'
DEFS='-DHAVE_CONFIG_H'
DEPDIR='.deps'
DLLTOOL='dlltool'
ECHO='echo'
ECHO_C=''
ECHO_N='-n'
ECHO_T=''
EGREP='grep -E'
EXEEXT=''
F77='f95'
FFLAGS='-g -O2'
GENCAT='gencat'
GLADE_CFLAGS='-I/usr/include/libglade-2.0 -I/usr/include/gtk-2.0 -I/usr/include/libxml2 -I/usr/lib64/gtk-2.0/include -I/usr/include/atk-1.0 -I/usr/include/cairo -I/usr/include/pango-1.0 -I/usr/include/glib-2.0 -I/usr/lib64/glib-2.0/include -I/usr/include/freetype2 -I/usr/include/libpng12  '
GLADE_LIBS='-L/lib64 -lglade-2.0 -lgtk-x11-2.0 -lxml2 -lz -lgdk-x11-2.0 -latk-1.0 -lgdk_pixbuf-2.0 -lm -lpangocairo-1.0 -lpango-1.0 -lcairo -lgobject-2.0 -lgmodule-2.0 -ldl -lglib-2.0  '
GLIBC21='yes'
GLIBC2='yes'
GLIB_CFLAGS='-I/usr/include/glib-2.0 -I/usr/lib64/glib-2.0/include  '
GLIB_LIBS='-L/lib64 -lglib-2.0  '
GMSGFMT='/usr/bin/msgfmt'
GROFF='yes'
GTK_CFLAGS='-I/usr/include/gtk-2.0 -I/usr/lib64/gtk-2.0/include -I/usr/include/atk-1.0 -I/usr/include/cairo -I/usr/include/pango-1.0 -I/usr/include/glib-2.0 -I/usr/lib64/glib-2.0/include -I/usr/include/freetype2 -I/usr/include/libpng12  '
GTK_LIBS='-L/lib64 -lgtk-x11-2.0 -lgdk-x11-2.0 -latk-1.0 -lgdk_pixbuf-2.0 -lm -lpangocairo-1.0 -lpango-1.0 -lcairo -lgobject-2.0 -lgmodule-2.0 -ldl -lglib-2.0  '
HAVE_ASPRINTF='1'
HAVE_POSIX_PRINTF='1'
HAVE_SNPRINTF='1'
HAVE_WPRINTF='0'
INSTALL_DATA='${INSTALL} -m 644'
INSTALL_PROGRAM='${INSTALL} $(INSTALL_STRIP_FLAG)'
INSTALL_SCRIPT='${INSTALL}'
INSTALL_STRIP_PROGRAM='${SHELL} $(install_sh) -c -s'
INSTOBJEXT='.mo'
INTLBISON='bison'
INTLLIBS=''
INTLOBJS=''
INTL_LIBTOOL_SUFFIX_PREFIX=''
INTL_MACOSX_LIBS=''
KDECONFIG='/usr/bin/kde-config'
KDE_EXTRA_RPATH=''
KDE_INCLUDES='-I/usr/include/kde'
KDE_LDFLAGS='-L/usr/lib'
KDE_MT_LDFLAGS=''
KDE_MT_LIBS='-lpthread'
KDE_RPATH='-R $(kde_libraries) -R $(qt_libraries) -R $(x_libraries)'
LDFLAGS=' -Wl,--export-dynamic'
LIBCOMPAT=''
LIBCRYPT='-lcrypt'
LIBDL='-ldl'
LIBICONV=''
LIBINTL=''
LIBJPEG='-ljpeg'
LIBOBJS=''
LIBPNG='-lpng -lz -lm'
LIBPTHREAD='-lpthread'
LIBRESOLV='-lresolv'
LIBS=''
LIBSM='-lSM -lICE'
LIBSOCKET=' -lresolv'
LIBTOOL='$(SHELL) $(top_builddir)/libtool'
LIBUCB=''
LIBUTIL='-lutil'
LIBXINERAMA=''
LIBZ='-lz'
LIB_KAB='-lkab'
LIB_KDECORE='-lkdecore'
LIB_KDEPRINT='-lkdeprint'
LIB_KDEUI='-lkdeui'
LIB_KFILE='-lkio'
LIB_KFM=''
LIB_KHTML='-lkhtml'
LIB_KIO='-lkio'
LIB_KPARTS='-lkparts'
LIB_KSPELL='-lkspell'
LIB_KSYCOCA='-lkio'
LIB_QPE=''
LIB_QT='-lqt-mt  $(LIBPNG) -lXext $(LIB_X11) $(LIBSM) -lpthread'
LIB_SMB='-lsmb'
LIB_X11='-lX11 $(LIBSOCKET)'
LIB_XEXT='-lXext'
LN_S='ln -s'
LTLIBICONV=''
LTLIBINTL=''
LTLIBOBJS=''
MAINT='#'
MAINTAINER_MODE_FALSE=''
MAINTAINER_MODE_TRUE='#'
MAKEINFO='${SHELL} /home/tyler/rpmbuild/BUILD/tilp2-1.04/missing --run makeinfo'
MKINSTALLDIRS='$(top_builddir)/./mkinstalldirs'
MOC='/usr/lib64/qt-3.3/bin/moc'
MSGFMT='/usr/bin/msgfmt'
MSGMERGE='/usr/bin/msgmerge'
OBJDUMP='objdump'
OBJEXT='o'
PACKAGE='tilp2'
PACKAGE_BUGREPORT='tilp-users@lists.sourceforge.net'
PACKAGE_NAME='TiLP2'
PACKAGE_STRING='TiLP2 1.04'
PACKAGE_TARNAME='tilp2'
PACKAGE_VERSION='1.04'
PATH_SEPARATOR=':'
PKG_CONFIG='/usr/bin/pkg-config'
POSUB=''
QTE_NORTTI=''
QT_INCLUDES='-I/usr/lib64/qt-3.3/include'
QT_LDFLAGS='-L/usr/lib64/qt-3.3/lib'
RANLIB='ranlib'
SED='/bin/sed'
SET_MAKE=''
SHELL='/bin/sh'
STRIP='strip'
TICABLES_CFLAGS='-I/usr/include/tilp2 -I/usr/include/glib-2.0 -I/usr/lib64/glib-2.0/include  '
TICABLES_LIBS='-L/lib64 -lticables2 -lglib-2.0  '
TICALCS_CFLAGS='-I/usr/include/tilp2 -I/usr/include/glib-2.0 -I/usr/lib64/glib-2.0/include  '
TICALCS_LIBS='-L/lib64 -lticalcs2 -lticables2 -ltifiles2 -lticonv -lglib-2.0  '
TICONV_CFLAGS='-I/usr/include/tilp2 -I/usr/include/glib-2.0 -I/usr/lib64/glib-2.0/include  '
TICONV_LIBS='-L/lib64 -lticonv -lglib-2.0  '
TIFILES_CFLAGS='-I/usr/include/tilp2 -I/usr/include/glib-2.0 -I/usr/lib64/glib-2.0/include  '
TIFILES_LIBS='-L/lib64 -ltifiles2 -lticonv -lglib-2.0  '
UIC='/usr/lib64/qt-3.3/bin/uic -L $(kde_widgetdir) -nounload'
UIC_TR='tr2i18n'
USER_INCLUDES=''
USER_LDFLAGS=''
USE_GROFF_FALSE='#'
USE_GROFF_TRUE=''
USE_INCLUDED_LIBINTL='no'
USE_KDE_FALSE='#'
USE_KDE_TRUE=''
USE_NLS='no'
USE_THREADS=''
VERSION='1.04'
XGETTEXT='/usr/bin/xgettext'
X_EXTRA_LIBS=' -lresolv'
X_INCLUDES='-I.'
X_LDFLAGS='-L/usr/lib64'
X_PRE_LIBS=''
ac_ct_AR='ar'
ac_ct_AS=''
ac_ct_CC='gcc'
ac_ct_CXX='g++'
ac_ct_DLLTOOL=''
ac_ct_F77='f95'
ac_ct_OBJDUMP=''
ac_ct_RANLIB='ranlib'
ac_ct_STRIP='strip'
ac_pt_PKG_CONFIG='/usr/bin/pkg-config'
all_includes='-I/usr/include/kde -I/usr/lib64/qt-3.3/include -I. '
all_libraries='-L/usr/lib64 -L/usr/lib64/qt-3.3/lib -L/usr/lib '
am__fastdepCC_FALSE='#'
am__fastdepCC_TRUE=''
am__fastdepCXX_FALSE='#'
am__fastdepCXX_TRUE=''
am__include='include'
am__leading_dot='.'
am__quote=''
am__tar='${AMTAR} chof - "$$tardir"'
am__untar='${AMTAR} xf -'
bindir='${exec_prefix}/bin'
build='x86_64-unknown-linux-gnu'
build_alias=''
build_cpu='x86_64'
build_os='linux-gnu'
build_vendor='unknown'
datadir='${prefix}/share'
exec_prefix='${prefix}'
host='x86_64-unknown-linux-gnu'
host_alias=''
host_cpu='x86_64'
host_os='linux-gnu'
host_vendor='unknown'
includedir='${prefix}/include'
infodir='${prefix}/info'
install_sh='/home/tyler/rpmbuild/BUILD/tilp2-1.04/install-sh'
kde='yes'
kde_appsdir='${prefix}/share/applnk'
kde_bindir='${exec_prefix}/bin'
kde_confdir='${prefix}/share/config'
kde_datadir='${prefix}/share/apps'
kde_htmldir='${prefix}/share/doc/HTML'
kde_icondir='${prefix}/share/icons'
kde_includes='/usr/include/kde'
kde_libraries='/usr/lib'
kde_libs_htmldir='/usr/share/doc/HTML'
kde_libs_prefix='/usr'
kde_locale='${prefix}/share/locale'
kde_mimedir='${prefix}/share/mimelnk'
kde_moduledir='${exec_prefix}/lib/kde3'
kde_qtver='3'
kde_servicesdir='${prefix}/share/services'
kde_servicetypesdir='${prefix}/share/servicetypes'
kde_sounddir='${prefix}/share/sounds'
kde_styledir='${exec_prefix}/lib/kde3/plugins/styles'
kde_templatesdir='${prefix}/share/templates'
kde_wallpaperdir='${prefix}/share/wallpapers'
kde_widgetdir='${exec_prefix}/lib/kde3/plugins/designer'
libdir='/usr/lib64'
libexecdir='${exec_prefix}/libexec'
localstatedir='${prefix}/var'
mandir='/usr/share/man'
mkdir_p='mkdir -p --'
oldincludedir='/usr/include'
prefix='/usr'
program_transform_name='s,x,x,'
qt_includes='/usr/lib64/qt-3.3/include'
qt_libraries='/usr/lib64/qt-3.3/lib'
sbindir='${exec_prefix}/sbin'
sharedstatedir='${prefix}/com'
sysconfdir='${prefix}/etc'
target_alias=''
x_includes='.'
x_libraries='/usr/lib64'

## ----------- ##
## confdefs.h. ##
## ----------- ##

#define HAVE_ALLOCA 1
#define HAVE_ALLOCA_H 1
#define HAVE_ARGZ_H 1
#define HAVE_ASPRINTF 1
#define HAVE_CRYPT 1
#define HAVE_DECL_FEOF_UNLOCKED 1
#define HAVE_DECL_FGETS_UNLOCKED 0
#define HAVE_DECL_GETC_UNLOCKED 1
#define HAVE_DECL__SNPRINTF 0
#define HAVE_DECL__SNWPRINTF 0
#define HAVE_DLFCN_H 1
#define HAVE_FVISIBILITY 1
#define HAVE_FWPRINTF 1
#define HAVE_GETCWD 1
#define HAVE_GETCWD 1
#define HAVE_GETEGID 1
#define HAVE_GETEUID 1
#define HAVE_GETGID 1
#define HAVE_GETPAGESIZE 1
#define HAVE_GETUID 1
#define HAVE_ICONV 1
#define HAVE_INTMAX_T 1
#define HAVE_INTTYPES_H 1
#define HAVE_INTTYPES_H 1
#define HAVE_INTTYPES_H_WITH_UINTMAX 1
#define HAVE_LANGINFO_CODESET 1
#define HAVE_LC_MESSAGES 1
#define HAVE_LIBJPEG 1
#define HAVE_LIBPNG 1
#define HAVE_LIBPTHREAD 1
#define HAVE_LIBZ 1
#define HAVE_LIBZ 1
#define HAVE_LIMITS_H 1
#define HAVE_LOCALE_H 1
#define HAVE_LONG_DOUBLE 1
#define HAVE_LONG_LONG 1
#define HAVE_MALLOC_H 1
#define HAVE_MEMORY_H 1
#define HAVE_MEMPCPY 1
#define HAVE_MEMSET 1
#define HAVE_MKDIR 1
#define HAVE_MMAP 1
#define HAVE_MUNMAP 1
#define HAVE_NL_TYPES_H 1
#define HAVE_POSIX_PRINTF 1
#define HAVE_PUTENV 1
#define HAVE_RES_INIT 1
#define HAVE_SETENV 1
#define HAVE_SETLOCALE 1
#define HAVE_SNPRINTF 1
#define HAVE_STDDEF_H 1
#define HAVE_STDINT_H 1
#define HAVE_STDINT_H 1
#define HAVE_STDINT_H 1
#define HAVE_STDINT_H_WITH_UINTMAX 1
#define HAVE_STDLIB_H 1
#define HAVE_STDLIB_H 1
#define HAVE_STDLIB_H 1
#define HAVE_STDLIB_H 1
#define HAVE_STPCPY 1
#define HAVE_STRCASECMP 1
#define HAVE_STRCASECMP 1
#define HAVE_STRCHR 1
#define HAVE_STRDUP 1
#define HAVE_STRDUP 1
#define HAVE_STRINGS_H 1
#define HAVE_STRING_H 1
#define HAVE_STRING_H 1
#define HAVE_STRING_H 1
#define HAVE_STRRCHR 1
#define HAVE_STRSTR 1
#define HAVE_STRTOL 1
#define HAVE_STRTOUL 1
#define HAVE_SYS_PARAM_H 1
#define HAVE_SYS_STAT_H 1
#define HAVE_SYS_TYPES_H 1
#define HAVE_TILP2_TICABLES_H 1
#define HAVE_TILP2_TIFILES_H 1
#define HAVE_TSEARCH 1
#define HAVE_UINTMAX_T 1
#define HAVE_UNISTD_H 1
#define HAVE_UNISTD_H 1
#define HAVE_UNISTD_H 1
#define HAVE_UNISTD_H 1
#define HAVE_UNSIGNED_LONG_LONG 1
#define HAVE_WCHAR_T 1
#define HAVE_WCSLEN 1
#define HAVE_WINT_T 1
#define HAVE___ARGZ_COUNT 1
#define HAVE___ARGZ_NEXT 1
#define HAVE___ARGZ_STRINGIFY 1
#define HAVE___FSETLOCKING 1
#define ICONV_CONST 
#define INTDIV0_RAISES_SIGFPE 1
#define LSTAT_FOLLOWS_SLASHED_SYMLINK 1
#define PACKAGE "tilp2"
#define PACKAGE_BUGREPORT "tilp-users@lists.sourceforge.net"
#define PACKAGE_NAME "TiLP2"
#define PACKAGE_STRING "TiLP2 1.04"
#define PACKAGE_TARNAME "tilp2"
#define PACKAGE_VERSION "1.04"
#define RETSIGTYPE void
#define SIZEOF_CHAR 1
#define SIZEOF_CHAR_P 8
#define SIZEOF_INT 4
#define SIZEOF_LONG 8
#define STDC_HEADERS 1
#define STDC_HEADERS 1
#define VERSION "1.04"
#define WITH_KDE 1
#define ksize_t socklen_t
#endif
#ifdef __cplusplus
extern "C" void std::exit (int) throw (); using std::exit;

configure: exit 0