All pastes #60285 Raw Edit

Anonymous

public text v1 · immutable
#60285 ·published 2006-05-31 13:52 UTC
rendered paste body
------ Rebuild All started: Project: FreeSwitchVersion, Configuration: Release Win32 ------
Deleting intermediate and output files for project 'FreeSwitchVersion', configuration 'Release|Win32'
Generating switch_version.h
Complete
Build log was saved at "file://c:\svn\freeswitch\w32\vsnet\Release\BuildLog.htm"
FreeSwitchVersion - 0 error(s), 0 warning(s)
------ Rebuild All started: Project: FreeSwitchCoreLib, Configuration: Release Win32 ------
Deleting intermediate and output files for project 'FreeSwitchCoreLib', configuration 'Release|Win32'
Performing Pre-Build Event...
Detected VCBuild: C:\Program Files\Microsoft Visual Studio 8\VC\vcpackages\vcbuild.exe
Complete
Compiling...
switch_buffer.c
Compiling...
switch_xml.c
switch_utils.c
switch_stun.c
switch_rtp.c
switch_resample.c
switch_log.c
switch_loadable_module.c
switch_ivr.c
switch_event.c
switch_core.c
switch_console.c
switch_config.c
switch_channel.c
switch_caller.c
Generating Code...
Linking...
srtp.lib(srtp.obj) : MSIL .netmodule or module compiled with /GL found; restarting link with /LTCG; add /LTCG to the link command line to improve linker performance
   Creating library Release/FreeSwitchCore.lib and object Release/FreeSwitchCore.exp
Generating code
Finished generating code
Embedding manifest...
Performing Post-Build Event...
C:\svn\freeswitch\w32\vsnet\..\..\conf\freeswitch.xml
1 File(s) copied
0 File(s) copied
0 File(s) copied
Build log was saved at "file://c:\svn\freeswitch\w32\vsnet\Release\BuildLog.htm"
FreeSwitchCoreLib - 0 error(s), 0 warning(s)
------ Rebuild All started: Project: libteletone, Configuration: Release Win32 ------
Deleting intermediate and output files for project 'libteletone', configuration 'Release|Win32'
Compiling...
libteletone_generate.c
libteletone_detect.c
Linking...
   Creating library C:\svn\freeswitch\w32\vsnet\Release\libteletone.lib and object C:\svn\freeswitch\w32\vsnet\Release\libteletone.exp
Generating code
Finished generating code
Embedding manifest...
Build log was saved at "file://c:\svn\freeswitch\libs\libteletone\Release\BuildLog.htm"
libteletone - 0 error(s), 0 warning(s)
------ Rebuild All started: Project: FreeSwitchConsole, Configuration: Release Win32 ------
Deleting intermediate and output files for project 'FreeSwitchConsole', configuration 'Release|Win32'
Compiling...
switch.c
Linking...
Embedding manifest...
Build log was saved at "file://c:\svn\freeswitch\w32\vsnet\Release\BuildLog.htm"
FreeSwitchConsole - 0 error(s), 0 warning(s)
------ Rebuild All started: Project: mod_xmpp_event, Configuration: Release Win32 ------
Deleting intermediate and output files for project 'mod_xmpp_event', configuration 'Release|Win32'
Performing Pre-Build Event...
Detected VCBuild: C:\Program Files\Microsoft Visual Studio 8\VC\vcpackages\vcbuild.exe
Complete
Compiling...
mod_xmpp_event.c
Linking...
   Creating library Release/mod_xmpp_event.lib and object Release/mod_xmpp_event.exp
Generating code
Finished generating code
Embedding manifest...
Build log was saved at "file://c:\svn\freeswitch\src\mod\event_handlers\mod_xmpp_event\Release\BuildLog.htm"
mod_xmpp_event - 0 error(s), 0 warning(s)
------ Rebuild All started: Project: mod_sndfile, Configuration: Release Win32 ------
Deleting intermediate and output files for project 'mod_sndfile', configuration 'Release|Win32'
Performing Pre-Build Event...
Detected VCBuild: C:\Program Files\Microsoft Visual Studio 8\VC\vcpackages\vcbuild.exe
Complete
Compiling...
mod_sndfile.c
Linking...
   Creating library Release/mod_sndfile.lib and object Release/mod_sndfile.exp
Generating code
Finished generating code
Embedding manifest...
Build log was saved at "file://c:\svn\freeswitch\src\mod\formats\mod_sndfile\Release\BuildLog.htm"
mod_sndfile - 0 error(s), 0 warning(s)
------ Rebuild All started: Project: mod_bridgecall, Configuration: Release Win32 ------
Deleting intermediate and output files for project 'mod_bridgecall', configuration 'Release|Win32'
Compiling...
mod_bridgecall.c
Linking...
   Creating library Release/mod_bridgecall.lib and object Release/mod_bridgecall.exp
Embedding manifest...
Build log was saved at "file://c:\svn\freeswitch\src\mod\applications\mod_bridgecall\Release\BuildLog.htm"
mod_bridgecall - 0 error(s), 0 warning(s)
------ Rebuild All started: Project: mod_event_test, Configuration: Release Win32 ------
Deleting intermediate and output files for project 'mod_event_test', configuration 'Release|Win32'
Compiling...
mod_event_test.c
Linking...
   Creating library Release/mod_event_test.lib and object Release/mod_event_test.exp
Embedding manifest...
Build log was saved at "file://c:\svn\freeswitch\src\mod\event_handlers\mod_event_test\Release\BuildLog.htm"
mod_event_test - 0 error(s), 0 warning(s)
------ Rebuild All started: Project: mod_exosip, Configuration: Release Win32 ------
Deleting intermediate and output files for project 'mod_exosip', configuration 'Release|Win32'
Performing Pre-Build Event...
Detected VCBuild: C:\Program Files\Microsoft Visual Studio 8\VC\vcpackages\vcbuild.exe
Complete
Compiling...
mod_exosip.c
c:\svn\freeswitch\src\mod\endpoints\mod_exosip\mod_exosip.c(1392) : error C2220: warning treated as error - no 'object' file generated
c:\svn\freeswitch\src\mod\endpoints\mod_exosip\mod_exosip.c(1392) : warning C4701: potentially uninitialized local variable 'dpayload' used
Build log was saved at "file://c:\svn\freeswitch\src\mod\endpoints\mod_exosip\Release\BuildLog.htm"
mod_exosip - 1 error(s), 1 warning(s)
------ Rebuild All started: Project: mod_echo, Configuration: Release Win32 ------
Deleting intermediate and output files for project 'mod_echo', configuration 'Release|Win32'
Compiling...
mod_echo.c
Linking...
   Creating library Release/mod_echo.lib and object Release/mod_echo.exp
Embedding manifest...
Build log was saved at "file://c:\svn\freeswitch\src\mod\applications\mod_echo\Release\BuildLog.htm"
mod_echo - 0 error(s), 0 warning(s)
------ Skipped Rebuild All: Project: mod_perl, Configuration: Release Win32 ------
Project not selected to build for this solution configuration 
------ Skipped Rebuild All: Project: fs_perl, Configuration: Release Win32 ------
Project not selected to build for this solution configuration 
------ Rebuild All started: Project: mod_g711, Configuration: Release Win32 ------
Deleting intermediate and output files for project 'mod_g711', configuration 'Release|Win32'
Compiling...
mod_g711.c
g711.c
Generating Code...
Linking...
   Creating library Release/mod_g711.lib and object Release/mod_g711.exp
Embedding manifest...
Build log was saved at "file://c:\svn\freeswitch\src\mod\codecs\mod_g711\Release\BuildLog.htm"
mod_g711 - 0 error(s), 0 warning(s)
------ Rebuild All started: Project: mod_iax, Configuration: Release Win32 ------
Deleting intermediate and output files for project 'mod_iax', configuration 'Release|Win32'
Performing Pre-Build Event...
Detected VCBuild: C:\Program Files\Microsoft Visual Studio 8\VC\vcpackages\vcbuild.exe
Complete
Compiling...
mod_iax.c
Linking...
   Creating library Release/mod_iax.lib and object Release/mod_iax.exp
Generating code
Finished generating code
Embedding manifest...
Build log was saved at "file://c:\svn\freeswitch\src\mod\endpoints\mod_iax\Release\BuildLog.htm"
mod_iax - 0 error(s), 0 warning(s)
------ Rebuild All started: Project: mod_spidermonkey, Configuration: Release Win32 ------
Deleting intermediate and output files for project 'mod_spidermonkey', configuration 'Release|Win32'
Performing Pre-Build Event...
Detected VCBuild: C:\Program Files\Microsoft Visual Studio 8\VC\vcpackages\vcbuild.exe
Complete
Compiling...
mod_spidermonkey.c
Linking...
   Creating library Release/mod_spidermonkey.lib and object Release/mod_spidermonkey.exp
LINK : /LTCG specified but no code generation required; remove /LTCG from the link command line to improve linker performance
Embedding manifest...
Build log was saved at "file://c:\svn\freeswitch\src\mod\languages\mod_spidermonkey\Release\BuildLog.htm"
mod_spidermonkey - 0 error(s), 0 warning(s)
------ Rebuild All started: Project: mod_playback, Configuration: Release Win32 ------
Deleting intermediate and output files for project 'mod_playback', configuration 'Release|Win32'
Compiling...
mod_playback.c
Linking...
   Creating library Release/mod_playback.lib and object Release/mod_playback.exp
Embedding manifest...
Build log was saved at "file://c:\svn\freeswitch\src\mod\applications\mod_playback\Release\BuildLog.htm"
mod_playback - 0 error(s), 0 warning(s)
------ Rebuild All started: Project: mod_PortAudio, Configuration: Release Win32 ------
Deleting intermediate and output files for project 'mod_PortAudio', configuration 'Release|Win32'
Performing Pre-Build Event...
Detected VCBuild: C:\Program Files\Microsoft Visual Studio 8\VC\vcpackages\vcbuild.exe
Complete
Compiling...
ringbuffer.c
pablio.c
mod_portaudio.c
Generating Code...
Linking...
   Creating library Release/mod_PortAudio.lib and object Release/mod_PortAudio.exp
Embedding manifest...
Build log was saved at "file://c:\svn\freeswitch\src\mod\endpoints\mod_portaudio\Release\BuildLog.htm"
mod_PortAudio - 0 error(s), 0 warning(s)
------ Rebuild All started: Project: mod_event_multicast, Configuration: Release Win32 ------
Deleting intermediate and output files for project 'mod_event_multicast', configuration 'Release|Win32'
Compiling...
mod_event_multicast.c
Linking...
   Creating library Release/mod_event_multicast.lib and object Release/mod_event_multicast.exp
Embedding manifest...
Build log was saved at "file://c:\svn\freeswitch\src\mod\event_handlers\mod_event_multicast\Release\BuildLog.htm"
mod_event_multicast - 0 error(s), 0 warning(s)
------ Rebuild All started: Project: mod_zeroconf, Configuration: Release Win32 ------
Deleting intermediate and output files for project 'mod_zeroconf', configuration 'Release|Win32'
Performing Pre-Build Event...
Detected VCBuild: C:\Program Files\Microsoft Visual Studio 8\VC\vcpackages\vcbuild.exe
Complete
Compiling...
mod_zeroconf.c
Linking...
   Creating library Release/mod_zeroconf.lib and object Release/mod_zeroconf.exp
Embedding manifest...
Build log was saved at "file://c:\svn\freeswitch\src\mod\event_handlers\mod_zeroconf\Release\BuildLog.htm"
mod_zeroconf - 0 error(s), 0 warning(s)
------ Rebuild All started: Project: mod_dialplan_directory, Configuration: Release Win32 ------
Deleting intermediate and output files for project 'mod_dialplan_directory', configuration 'Release|Win32'
Compiling...
mod_dialplan_directory.c
Linking...
   Creating library Release/mod_dialplan_directory.lib and object Release/mod_dialplan_directory.exp
Embedding manifest...
Build log was saved at "file://c:\svn\freeswitch\src\mod\dialplans\mod_dialplan_directory\Release\BuildLog.htm"
mod_dialplan_directory - 0 error(s), 0 warning(s)
------ Rebuild All started: Project: mod_ldap, Configuration: Release Win32 ------
Deleting intermediate and output files for project 'mod_ldap', configuration 'Release|Win32'
Performing Pre-Build Event...
Detected VCBuild: C:\Program Files\Microsoft Visual Studio 8\VC\vcpackages\vcbuild.exe
Complete
Compiling...
mod_ldap.c
Linking...
   Creating library Release/mod_ldap.lib and object Release/mod_ldap.exp
Embedding manifest...
Build log was saved at "file://c:\svn\freeswitch\src\mod\directories\mod_ldap\Release\BuildLog.htm"
mod_ldap - 0 error(s), 0 warning(s)
------ Rebuild All started: Project: mod_l16, Configuration: Release Win32 ------
Deleting intermediate and output files for project 'mod_l16', configuration 'Release|Win32'
Compiling...
mod_l16.c
Linking...
   Creating library Release/mod_l16.lib and object Release/mod_l16.exp
Embedding manifest...
Build log was saved at "file://c:\svn\freeswitch\src\mod\codecs\mod_l16\Release\BuildLog.htm"
mod_l16 - 0 error(s), 0 warning(s)
------ Rebuild All started: Project: mod_softtimer, Configuration: Release Win32 ------
Deleting intermediate and output files for project 'mod_softtimer', configuration 'Release|Win32'
Compiling...
mod_softtimer.c
Linking...
   Creating library Release/mod_softtimer.lib and object Release/mod_softtimer.exp
Embedding manifest...
Build log was saved at "file://c:\svn\freeswitch\src\mod\timers\mod_softtimer\Release\BuildLog.htm"
mod_softtimer - 0 error(s), 0 warning(s)
------ Rebuild All started: Project: mod_ivrtest, Configuration: Release Win32 ------
Deleting intermediate and output files for project 'mod_ivrtest', configuration 'Release|Win32'
Compiling...
mod_ivrtest.c
Linking...
   Creating library Release/mod_ivrtest.lib and object Release/mod_ivrtest.exp
Embedding manifest...
Build log was saved at "file://c:\svn\freeswitch\src\mod\applications\mod_ivrtest\Release\BuildLog.htm"
mod_ivrtest - 0 error(s), 0 warning(s)
------ Rebuild All started: Project: mod_dialplan_xml, Configuration: Release Win32 ------
Deleting intermediate and output files for project 'mod_dialplan_xml', configuration 'Release|Win32'
Performing Pre-Build Event...
Detected VCBuild: C:\Program Files\Microsoft Visual Studio 8\VC\vcpackages\vcbuild.exe
Building : C:\svn\freeswitch\libs\pcre\win32\pcre_chartables.c.vcproj Config type: Release
Build started: Project: Generate pcre_chartables.c, Configuration: Release|Win32
Generate pcre_chartables.c - up-to-date
Building : C:\svn\freeswitch\libs\pcre\win32\libpcre.vcproj Config type: Release DLL
Build started: Project: libpcre, Configuration: Release DLL|Win32
Compiling...
pcre_compile.c
..\pcre_compile.c : warning C4819: The file contains a character that cannot be represented in the current code page (936). Save the file in Unicode format to prevent data loss
pcre_chartables.c
Generating Code...
Compiling...
pcreposix.c
pcre_xclass.c
pcre_version.c
pcre_valid_utf8.c
pcre_ucp_findchar.c
pcre_try_flipped.c
pcre_tables.c
pcre_study.c
pcre_refcount.c
pcre_ord2utf8.c
pcre_maketables.c
pcre_info.c
pcre_globals.c
pcre_get.c
pcre_fullinfo.c
pcre_exec.c
pcre_dfa_exec.c
pcre_config.c
Generating Code...
Linking...
   Creating library Release DLL\libpcre.lib and object Release DLL\libpcre.exp
Embedding manifest...
Build log was saved at "file://c:\svn\freeswitch\libs\pcre\win32\Release DLL\BuildLog.htm"
libpcre - 0 error(s), 0 warning(s)
Complete
Compiling...
mod_dialplan_xml.c
.\mod_dialplan_xml.c(36) : fatal error C1083: Cannot open include file: 'pcre.h': No such file or directory
Build log was saved at "file://c:\svn\freeswitch\src\mod\dialplans\mod_dialplan_xml\Release\BuildLog.htm"
mod_dialplan_xml - 1 error(s), 1 warning(s)
------ Rebuild All started: Project: mod_speex, Configuration: Release Win32 ------
Deleting intermediate and output files for project 'mod_speex', configuration 'Release|Win32'
Performing Pre-Build Event...
Detected VCBuild: C:\Program Files\Microsoft Visual Studio 8\VC\vcpackages\vcbuild.exe
Complete
Compiling...
mod_speex.c
Linking...
   Creating library Release/mod_speex.lib and object Release/mod_speex.exp
Embedding manifest...
Build log was saved at "file://c:\svn\freeswitch\src\mod\codecs\mod_speex\Release\BuildLog.htm"
mod_speex - 0 error(s), 0 warning(s)
------ Rebuild All started: Project: mod_gsm, Configuration: Release Win32 ------
Deleting intermediate and output files for project 'mod_gsm', configuration 'Release|Win32'
Performing Pre-Build Event...
Detected VCBuild: C:\Program Files\Microsoft Visual Studio 8\VC\vcpackages\vcbuild.exe
Complete
Compiling...
mod_gsm.c
Linking...
   Creating library Release/mod_gsm.lib and object Release/mod_gsm.exp
Generating code
Finished generating code
Embedding manifest...
Build log was saved at "file://c:\svn\freeswitch\src\mod\codecs\mod_gsm\Release\BuildLog.htm"
mod_gsm - 0 error(s), 0 warning(s)
------ Rebuild All started: Project: mod_woomera, Configuration: Release Win32 ------
Deleting intermediate and output files for project 'mod_woomera', configuration 'Release|Win32'
Compiling...
mod_woomera.c
Linking...
   Creating library Release/mod_woomera.lib and object Release/mod_woomera.exp
Embedding manifest...
Build log was saved at "file://c:\svn\freeswitch\src\mod\endpoints\mod_woomera\Release\BuildLog.htm"
mod_woomera - 0 error(s), 0 warning(s)
------ Skipped Rebuild All: Project: FreeSwitchSetup, Configuration: Release ------
Project not selected to build for this solution configuration 
------ Rebuild All started: Project: mod_xml_rpc, Configuration: Release Win32 ------
Deleting intermediate and output files for project 'mod_xml_rpc', configuration 'Release|Win32'
Performing Pre-Build Event...
Detected VCBuild: C:\Program Files\Microsoft Visual Studio 8\VC\vcpackages\vcbuild.exe
Complete
Compiling...
mod_xml_rpc.c
Linking...
LINK : fatal error LNK1181: cannot open input file 'curllib.lib'
Build log was saved at "file://c:\svn\freeswitch\src\mod\xml_int\mod_xml_rpc\Release\BuildLog.htm"
mod_xml_rpc - 1 error(s), 0 warning(s)
------ Skipped Rebuild All: Project: mod_cepstral, Configuration: Release Win32 ------
Project not selected to build for this solution configuration 
------ Rebuild All started: Project: mod_ilbc, Configuration: Release Win32 ------
Deleting intermediate and output files for project 'mod_ilbc', configuration 'Release|Win32'
Performing Pre-Build Event...
Detected VCBuild: C:\Program Files\Microsoft Visual Studio 8\VC\vcpackages\vcbuild.exe
Complete
Compiling...
mod_ilbc.c
Linking...
   Creating library Release/mod_ilbc.lib and object Release/mod_ilbc.exp
Generating code
Finished generating code
Embedding manifest...
Build log was saved at "file://c:\svn\freeswitch\src\mod\codecs\mod_ilbc\Release\BuildLog.htm"
mod_ilbc - 0 error(s), 0 warning(s)
------ Rebuild All started: Project: mod_dingaling, Configuration: Release Win32 ------
Deleting intermediate and output files for project 'mod_dingaling', configuration 'Release|Win32'
Performing Pre-Build Event...
Detected VCBuild: C:\Program Files\Microsoft Visual Studio 8\VC\vcpackages\vcbuild.exe
Complete
Compiling...
mod_dingaling.c
Linking...
libdingaling.lib(libdingaling.obj) : MSIL .netmodule or module compiled with /GL found; restarting link with /LTCG; add /LTCG to the link command line to improve linker performance
   Creating library Release/mod_dingaling.lib and object Release/mod_dingaling.exp
mod_dingaling.obj : error LNK2001: unresolved external symbol _ldl_session_set_value
mod_dingaling.obj : error LNK2001: unresolved external symbol _ldl_handle_stop
mod_dingaling.obj : error LNK2001: unresolved external symbol _ldl_session_get_value
..\..\..\..\w32\vsnet\Release/mod/mod_dingaling.dll : fatal error LNK1120: 3 unresolved externals
Build log was saved at "file://c:\svn\freeswitch\src\mod\endpoints\mod_dingaling\Release\BuildLog.htm"
mod_dingaling - 4 error(s), 0 warning(s)
------ Rebuild All started: Project: mod_commands, Configuration: Release Win32 ------
Deleting intermediate and output files for project 'mod_commands', configuration 'Release|Win32'
Compiling...
mod_commands.c
Linking...
   Creating library Release/mod_commands.lib and object Release/mod_commands.exp
Embedding manifest...
Build log was saved at "file://c:\svn\freeswitch\src\mod\applications\mod_commands\Release\BuildLog.htm"
mod_commands - 0 error(s), 0 warning(s)
------ Rebuild All started: Project: mod_console, Configuration: Release Win32 ------
Deleting intermediate and output files for project 'mod_console', configuration 'Release|Win32'
Compiling...
mod_console.c
Linking...
   Creating library Release/mod_console.lib and object Release/mod_console.exp
Embedding manifest...
Build log was saved at "file://c:\svn\freeswitch\src\mod\loggers\mod_console\Release\BuildLog.htm"
mod_console - 0 error(s), 0 warning(s)
------ Skipped Rebuild All: Project: docs (Docs\docs), Configuration: Release Win32 ------
Project not selected to build for this solution configuration 
------ Skipped Rebuild All: Project: mod_g729, Configuration: Release Win32 ------
Project not selected to build for this solution configuration 
========== Rebuild All: 27 succeeded, 4 failed, 6 skipped ==========