root at Unknown# gmake [~wow/trunk/src/game]
if g++ -DHAVE_CONFIG_H -I. -I. -I../.. -I/usr/include/mysql -I/usr/local/include/mysql -I/usr/include/openssl -I/usr/local/include/openssl -I. -I./../../dep/include -I./../shared -I./../framework -g -O2 -MT AggressorAI.o -MD -MP -MF ".deps/AggressorAI.Tpo" -c -o AggressorAI.o AggressorAI.cpp; \
then mv -f ".deps/AggressorAI.Tpo" ".deps/AggressorAI.Po"; else rm -f ".deps/AggressorAI.Tpo"; exit 1; fi
Unit.h:260: error: expected unqualified-id before â<<â token
AggressorAI.cpp:225: error: expected `}' at end of input
Unit.h: In member function âbool Unit::isAttackReady() constâ:
Unit.h:145: error: âm_attackTimerâ was not declared in this scope
Unit.h: In member function âvoid Unit::addAttacker(Unit*)â:
Unit.h:151: error: âm_attackersâ was not declared in this scope
Unit.h: In member function âvoid Unit::removeAttacker(Unit*)â:
Unit.h:158: error: âm_attackersâ was not declared in this scope
Unit.h: In member function âUnit* Unit::getAttackerForHelper()â:
Unit.h:177: error: âm_attackersâ was not declared in this scope
Unit.h: In member function âUnit* Unit::getVictim()â:
Unit.h:184: error: âm_attackingâ was not declared in this scope
Unit.h: In member function âvoid Unit::addUnitState(uint32)â:
Unit.h:186: error: âm_stateâ was not declared in this scope
Unit.h: In member function âbool Unit::hasUnitState(uint32) constâ:
Unit.h:187: error: âm_stateâ was not declared in this scope
Unit.h: In member function âvoid Unit::clearUnitState(uint32)â:
Unit.h:188: error: âm_stateâ was not declared in this scope
Unit.h: In member function âbool Unit::isStunned() constâ:
Unit.h:232: error: âm_attackTimerâ was not declared in this scope
Unit.h: In member function âbool Unit::isInCombat() constâ:
Unit.h:236: error: âm_stateâ was not declared in this scope
Unit.h: In member function âbool Unit::isAttacking() constâ:
Unit.h:237: error: âm_stateâ was not declared in this scope
Unit.h: In member function âbool Unit::isAttacked() constâ:
Unit.h:238: error: âm_stateâ was not declared in this scope
Unit.h: In member function âbool Unit::isAlive() constâ:
Unit.h:257: error: âm_deathStateâ was not declared in this scope
Unit.h: In member function âbool Unit::isDead() constâ:
Unit.h:258: error: âm_deathStateâ was not declared in this scope
Unit.h: In member function âDeathState Unit::getDeathState()â:
Unit.h:259: error: âm_deathStateâ was not declared in this scope
Unit.h: At global scope:
Unit.h:259: error: expected unqualified-id at end of input
gmake: *** [AggressorAI.o] Error 1
root at Unknown#