* Checking for suitable kernel configuration options... [ ok ]
>>> Unpacking source...
>>> Unpacking btsco-0.41.tar.gz to /var/tmp/portage/net-wireless/btsco-kernel-0.41/work
* Patching /var/tmp/portage/net-wireless/btsco-kernel-0.41/work/btsco-0.41/kernel/Makefile to use '/usr/src/linux'
>>> Source unpacked.
>>> Compiling source in /var/tmp/portage/net-wireless/btsco-kernel-0.41/work/btsco-0.41/kernel ...
* Preparing snd-bt-sco module
/var/tmp/portage/net-wireless/btsco-kernel-0.41/work/btsco-0.41/kernel/btsco.c:118: error: expected specifier-qualifier-list before ‘snd_card_t’
/var/tmp/portage/net-wireless/btsco-kernel-0.41/work/btsco-0.41/kernel/btsco.c:162: error: expected specifier-qualifier-list before ‘snd_pcm_substream_t’
/var/tmp/portage/net-wireless/btsco-kernel-0.41/work/btsco-0.41/kernel/btsco.c:165: error: expected ‘=’, ‘,’, ‘;’, ‘asm’ or ‘__attribute__’ before ‘*’ token
/var/tmp/portage/net-wireless/btsco-kernel-0.41/work/btsco-0.41/kernel/btsco.c:167: error: expected ‘)’ before ‘*’ token
/var/tmp/portage/net-wireless/btsco-kernel-0.41/work/btsco-0.41/kernel/btsco.c:188: error: expected ‘)’ before ‘*’ token
/var/tmp/portage/net-wireless/btsco-kernel-0.41/work/btsco-0.41/kernel/btsco.c:209: error: expected ‘)’ before ‘*’ token
/var/tmp/portage/net-wireless/btsco-kernel-0.41/work/btsco-0.41/kernel/btsco.c:230: error: expected ‘)’ before ‘*’ token
/var/tmp/portage/net-wireless/btsco-kernel-0.41/work/btsco-0.41/kernel/btsco.c:235: error: expected ‘)’ before ‘*’ token
/var/tmp/portage/net-wireless/btsco-kernel-0.41/work/btsco-0.41/kernel/btsco.c: In function ‘snd_card_bt_sco_pcm_receive’:
/var/tmp/portage/net-wireless/btsco-kernel-0.41/work/btsco-0.41/kernel/btsco.c:256: error: ‘snd_card_bt_sco_pcm_t’ has no member named ‘substream’
/var/tmp/portage/net-wireless/btsco-kernel-0.41/work/btsco-0.41/kernel/btsco.c:256: error: ‘snd_card_bt_sco_pcm_t’ has no member named ‘substream’
/var/tmp/portage/net-wireless/btsco-kernel-0.41/work/btsco-0.41/kernel/btsco.c:257: error: ‘snd_card_bt_sco_pcm_t’ has no member named ‘substream’
/var/tmp/portage/net-wireless/btsco-kernel-0.41/work/btsco-0.41/kernel/btsco.c:257: error: ‘snd_card_bt_sco_pcm_t’ has no member named ‘substream’
/var/tmp/portage/net-wireless/btsco-kernel-0.41/work/btsco-0.41/kernel/btsco.c:260: error: ‘snd_card_bt_sco_pcm_t’ has no member named ‘substream’
/var/tmp/portage/net-wireless/btsco-kernel-0.41/work/btsco-0.41/kernel/btsco.c:260: error: ‘snd_card_bt_sco_pcm_t’ has no member named ‘substream’
/var/tmp/portage/net-wireless/btsco-kernel-0.41/work/btsco-0.41/kernel/btsco.c:267: error: ‘snd_card_bt_sco_pcm_t’ has no member named ‘substream’
/var/tmp/portage/net-wireless/btsco-kernel-0.41/work/btsco-0.41/kernel/btsco.c: In function ‘snd_card_bt_sco_pcm_send’:
/var/tmp/portage/net-wireless/btsco-kernel-0.41/work/btsco-0.41/kernel/btsco.c:288: error: ‘snd_card_bt_sco_pcm_t’ has no member named ‘substream’
/var/tmp/portage/net-wireless/btsco-kernel-0.41/work/btsco-0.41/kernel/btsco.c:288: error: ‘snd_card_bt_sco_pcm_t’ has no member named ‘substream’
/var/tmp/portage/net-wireless/btsco-kernel-0.41/work/btsco-0.41/kernel/btsco.c:289: error: ‘snd_card_bt_sco_pcm_t’ has no member named ‘substream’
/var/tmp/portage/net-wireless/btsco-kernel-0.41/work/btsco-0.41/kernel/btsco.c:289: error: ‘snd_card_bt_sco_pcm_t’ has no member named ‘substream’
/var/tmp/portage/net-wireless/btsco-kernel-0.41/work/btsco-0.41/kernel/btsco.c:292: error: ‘snd_card_bt_sco_pcm_t’ has no member named ‘substream’
/var/tmp/portage/net-wireless/btsco-kernel-0.41/work/btsco-0.41/kernel/btsco.c:292: error: ‘snd_card_bt_sco_pcm_t’ has no member named ‘substream’
/var/tmp/portage/net-wireless/btsco-kernel-0.41/work/btsco-0.41/kernel/btsco.c:299: error: ‘snd_card_bt_sco_pcm_t’ has no member named ‘substream’
/var/tmp/portage/net-wireless/btsco-kernel-0.41/work/btsco-0.41/kernel/btsco.c: At top level:
/var/tmp/portage/net-wireless/btsco-kernel-0.41/work/btsco-0.41/kernel/btsco.c:305: error: expected ‘)’ before ‘*’ token
/var/tmp/portage/net-wireless/btsco-kernel-0.41/work/btsco-0.41/kernel/btsco.c:314: error: expected ‘)’ before ‘*’ token
/var/tmp/portage/net-wireless/btsco-kernel-0.41/work/btsco-0.41/kernel/btsco.c:322: error: expected ‘=’, ‘,’, ‘;’, ‘asm’ or ‘__attribute__’ before ‘snd_card_bt_sco_playback’
/var/tmp/portage/net-wireless/btsco-kernel-0.41/work/btsco-0.41/kernel/btsco.c:339: error: expected ‘=’, ‘,’, ‘;’, ‘asm’ or ‘__attribute__’ before ‘snd_card_bt_sco_capture’
/var/tmp/portage/net-wireless/btsco-kernel-0.41/work/btsco-0.41/kernel/btsco.c:356: error: expected ‘)’ before ‘*’ token
/var/tmp/portage/net-wireless/btsco-kernel-0.41/work/btsco-0.41/kernel/btsco.c:362: error: expected ‘)’ before ‘*’ token
/var/tmp/portage/net-wireless/btsco-kernel-0.41/work/btsco-0.41/kernel/btsco.c:395: error: expected ‘)’ before ‘*’ token
/var/tmp/portage/net-wireless/btsco-kernel-0.41/work/btsco-0.41/kernel/btsco.c:429: error: expected ‘)’ before ‘*’ token
/var/tmp/portage/net-wireless/btsco-kernel-0.41/work/btsco-0.41/kernel/btsco.c:451: error: expected ‘)’ before ‘*’ token
/var/tmp/portage/net-wireless/btsco-kernel-0.41/work/btsco-0.41/kernel/btsco.c:474: error: expected ‘=’, ‘,’, ‘;’, ‘asm’ or ‘__attribute__’ before ‘snd_card_bt_sco_playback_ops’
/var/tmp/portage/net-wireless/btsco-kernel-0.41/work/btsco-0.41/kernel/btsco.c:483: error: expected ‘=’, ‘,’, ‘;’, ‘asm’ or ‘__attribute__’ before ‘snd_card_bt_sco_capture_ops’
/var/tmp/portage/net-wireless/btsco-kernel-0.41/work/btsco-0.41/kernel/btsco.c: In function ‘snd_card_bt_sco_pcm’:
/var/tmp/portage/net-wireless/btsco-kernel-0.41/work/btsco-0.41/kernel/btsco.c:494: error: ‘snd_pcm_t’ undeclared (first use in this function)
/var/tmp/portage/net-wireless/btsco-kernel-0.41/work/btsco-0.41/kernel/btsco.c:494: error: (Each undeclared identifier is reported only once
/var/tmp/portage/net-wireless/btsco-kernel-0.41/work/btsco-0.41/kernel/btsco.c:494: error: for each function it appears in.)
/var/tmp/portage/net-wireless/btsco-kernel-0.41/work/btsco-0.41/kernel/btsco.c:494: error: ‘pcm’ undeclared (first use in this function)
/var/tmp/portage/net-wireless/btsco-kernel-0.41/work/btsco-0.41/kernel/btsco.c:495: warning: ISO C90 forbids mixed declarations and code
/var/tmp/portage/net-wireless/btsco-kernel-0.41/work/btsco-0.41/kernel/btsco.c:498: error: ‘snd_card_bt_sco_t’ has no member named ‘card’
/var/tmp/portage/net-wireless/btsco-kernel-0.41/work/btsco-0.41/kernel/btsco.c:501: error: ‘snd_card_bt_sco_playback_ops’ undeclared (first use in this function)
/var/tmp/portage/net-wireless/btsco-kernel-0.41/work/btsco-0.41/kernel/btsco.c:503: error: ‘snd_card_bt_sco_capture_ops’ undeclared (first use in this function)
/var/tmp/portage/net-wireless/btsco-kernel-0.41/work/btsco-0.41/kernel/btsco.c: At top level:
/var/tmp/portage/net-wireless/btsco-kernel-0.41/work/btsco-0.41/kernel/btsco.c:516: error: expected ‘)’ before ‘*’ token
/var/tmp/portage/net-wireless/btsco-kernel-0.41/work/btsco-0.41/kernel/btsco.c:526: error: expected ‘)’ before ‘*’ token
/var/tmp/portage/net-wireless/btsco-kernel-0.41/work/btsco-0.41/kernel/btsco.c:539: error: expected ‘)’ before ‘*’ token
/var/tmp/portage/net-wireless/btsco-kernel-0.41/work/btsco-0.41/kernel/btsco.c:565: error: expected ‘)’ before ‘*’ token
/var/tmp/portage/net-wireless/btsco-kernel-0.41/work/btsco-0.41/kernel/btsco.c:575: error: expected ‘)’ before ‘*’ token
/var/tmp/portage/net-wireless/btsco-kernel-0.41/work/btsco-0.41/kernel/btsco.c:587: error: expected ‘)’ before ‘*’ token
/var/tmp/portage/net-wireless/btsco-kernel-0.41/work/btsco-0.41/kernel/btsco.c:605: error: expected ‘)’ before ‘*’ token
/var/tmp/portage/net-wireless/btsco-kernel-0.41/work/btsco-0.41/kernel/btsco.c:617: error: expected ‘)’ before ‘*’ token
/var/tmp/portage/net-wireless/btsco-kernel-0.41/work/btsco-0.41/kernel/btsco.c:637: error: expected ‘=’, ‘,’, ‘;’, ‘asm’ or ‘__attribute__’ before ‘snd_bt_sco_controls’
/var/tmp/portage/net-wireless/btsco-kernel-0.41/work/btsco-0.41/kernel/btsco.c: In function ‘snd_card_bt_sco_new_mixer’:
/var/tmp/portage/net-wireless/btsco-kernel-0.41/work/btsco-0.41/kernel/btsco.c:661: error: ‘snd_card_t’ undeclared (first use in this function)
/var/tmp/portage/net-wireless/btsco-kernel-0.41/work/btsco-0.41/kernel/btsco.c:661: error: ‘card’ undeclared (first use in this function)
/var/tmp/portage/net-wireless/btsco-kernel-0.41/work/btsco-0.41/kernel/btsco.c:661: error: ‘snd_card_bt_sco_t’ has no member named ‘card’
/var/tmp/portage/net-wireless/btsco-kernel-0.41/work/btsco-0.41/kernel/btsco.c:663: warning: ISO C90 forbids mixed declarations and code
/var/tmp/portage/net-wireless/btsco-kernel-0.41/work/btsco-0.41/kernel/btsco.c:667: error: ‘snd_card_bt_sco_t’ has no member named ‘mixer_lock’
/var/tmp/portage/net-wireless/btsco-kernel-0.41/work/btsco-0.41/kernel/btsco.c:670: error: ‘snd_bt_sco_controls’ undeclared (first use in this function)
/var/tmp/portage/net-wireless/btsco-kernel-0.41/work/btsco-0.41/kernel/btsco.c:670: error: ‘snd_kcontrol_new_t’ undeclared (first use in this function)
/var/tmp/portage/net-wireless/btsco-kernel-0.41/work/btsco-0.41/kernel/btsco.c:671: error: ‘snd_card_bt_sco_t’ has no member named ‘mixer_controls’
/var/tmp/portage/net-wireless/btsco-kernel-0.41/work/btsco-0.41/kernel/btsco.c:674: error: ‘snd_card_bt_sco_t’ has no member named ‘mixer_controls’
/var/tmp/portage/net-wireless/btsco-kernel-0.41/work/btsco-0.41/kernel/btsco.c: At top level:
/var/tmp/portage/net-wireless/btsco-kernel-0.41/work/btsco-0.41/kernel/btsco.c:680: error: expected ‘)’ before ‘*’ token
/var/tmp/portage/net-wireless/btsco-kernel-0.41/work/btsco-0.41/kernel/btsco.c:685: error: expected ‘)’ before ‘*’ token
/var/tmp/portage/net-wireless/btsco-kernel-0.41/work/btsco-0.41/kernel/btsco.c:690: error: expected ‘)’ before ‘*’ token
/var/tmp/portage/net-wireless/btsco-kernel-0.41/work/btsco-0.41/kernel/btsco.c:744: error: expected ‘)’ before ‘*’ token
/var/tmp/portage/net-wireless/btsco-kernel-0.41/work/btsco-0.41/kernel/btsco.c:779: error: expected ‘)’ before ‘*’ token
/var/tmp/portage/net-wireless/btsco-kernel-0.41/work/btsco-0.41/kernel/btsco.c:833: error: expected ‘)’ before ‘*’ token
/var/tmp/portage/net-wireless/btsco-kernel-0.41/work/btsco-0.41/kernel/btsco.c: In function ‘snd_card_bt_sco_thread’:
/var/tmp/portage/net-wireless/btsco-kernel-0.41/work/btsco-0.41/kernel/btsco.c:857: error: ‘snd_card_t’ undeclared (first use in this function)
/var/tmp/portage/net-wireless/btsco-kernel-0.41/work/btsco-0.41/kernel/btsco.c:857: error: ‘card’ undeclared (first use in this function)
/var/tmp/portage/net-wireless/btsco-kernel-0.41/work/btsco-0.41/kernel/btsco.c:857: error: expected expression before ‘)’ token
/var/tmp/portage/net-wireless/btsco-kernel-0.41/work/btsco-0.41/kernel/btsco.c:858: warning: ISO C90 forbids mixed declarations and code
/var/tmp/portage/net-wireless/btsco-kernel-0.41/work/btsco-0.41/kernel/btsco.c:891: error: ‘snd_card_bt_sco_t’ has no member named ‘thread_sem’
/var/tmp/portage/net-wireless/btsco-kernel-0.41/work/btsco-0.41/kernel/btsco.c:903: error: ‘snd_card_bt_sco_t’ has no member named ‘sco_sock’
/var/tmp/portage/net-wireless/btsco-kernel-0.41/work/btsco-0.41/kernel/btsco.c:903: error: ‘snd_card_bt_sco_t’ has no member named ‘wait’
/var/tmp/portage/net-wireless/btsco-kernel-0.41/work/btsco-0.41/kernel/btsco.c:903: error: ‘snd_card_bt_sco_t’ has no member named ‘sco_sock’
/var/tmp/portage/net-wireless/btsco-kernel-0.41/work/btsco-0.41/kernel/btsco.c:903: error: ‘snd_card_bt_sco_t’ has no member named ‘wait’
/var/tmp/portage/net-wireless/btsco-kernel-0.41/work/btsco-0.41/kernel/btsco.c:904: error: ‘snd_card_bt_sco_t’ has no member named ‘thread_exit’
/var/tmp/portage/net-wireless/btsco-kernel-0.41/work/btsco-0.41/kernel/btsco.c:907: error: ‘snd_card_bt_sco_t’ has no member named ‘sock_sem’
/var/tmp/portage/net-wireless/btsco-kernel-0.41/work/btsco-0.41/kernel/btsco.c:908: error: ‘snd_card_bt_sco_t’ has no member named ‘sco_sock’
/var/tmp/portage/net-wireless/btsco-kernel-0.41/work/btsco-0.41/kernel/btsco.c:911: error: ‘snd_card_bt_sco_t’ has no member named ‘sock_sem’
/var/tmp/portage/net-wireless/btsco-kernel-0.41/work/btsco-0.41/kernel/btsco.c:969: error: ‘snd_card_bt_sco_t’ has no member named ‘agc’
/var/tmp/portage/net-wireless/btsco-kernel-0.41/work/btsco-0.41/kernel/btsco.c:972: error: ‘snd_card_bt_sco_t’ has no member named ‘agc’
/var/tmp/portage/net-wireless/btsco-kernel-0.41/work/btsco-0.41/kernel/btsco.c:994: error: ‘snd_card_bt_sco_t’ has no member named ‘agc’
/var/tmp/portage/net-wireless/btsco-kernel-0.41/work/btsco-0.41/kernel/btsco.c:1006: error: ‘snd_card_bt_sco_t’ has no member named ‘capture_sem’
/var/tmp/portage/net-wireless/btsco-kernel-0.41/work/btsco-0.41/kernel/btsco.c:1007: error: ‘snd_card_bt_sco_t’ has no member named ‘capture’
/var/tmp/portage/net-wireless/btsco-kernel-0.41/work/btsco-0.41/kernel/btsco.c:1009: error: ‘snd_card_bt_sco_t’ has no member named ‘capture’
/var/tmp/portage/net-wireless/btsco-kernel-0.41/work/btsco-0.41/kernel/btsco.c:1011: error: ‘snd_card_bt_sco_t’ has no member named ‘capture_sem’
/var/tmp/portage/net-wireless/btsco-kernel-0.41/work/btsco-0.41/kernel/btsco.c:1013: error: ‘snd_card_bt_sco_t’ has no member named ‘playback_sem’
/var/tmp/portage/net-wireless/btsco-kernel-0.41/work/btsco-0.41/kernel/btsco.c:1015: error: ‘snd_card_bt_sco_t’ has no member named ‘playback’
/var/tmp/portage/net-wireless/btsco-kernel-0.41/work/btsco-0.41/kernel/btsco.c:1015: error: ‘snd_card_bt_sco_t’ has no member named ‘loopback’
/var/tmp/portage/net-wireless/btsco-kernel-0.41/work/btsco-0.41/kernel/btsco.c:1029: error: ‘snd_card_bt_sco_t’ has no member named ‘playback’
/var/tmp/portage/net-wireless/btsco-kernel-0.41/work/btsco-0.41/kernel/btsco.c:1033: error: ‘snd_card_bt_sco_t’ has no member named ‘playback’
/var/tmp/portage/net-wireless/btsco-kernel-0.41/work/btsco-0.41/kernel/btsco.c:1050: error: ‘snd_card_bt_sco_t’ has no member named ‘playback_sem’
/var/tmp/portage/net-wireless/btsco-kernel-0.41/work/btsco-0.41/kernel/btsco.c:1095: error: ‘snd_card_bt_sco_t’ has no member named ‘thread_exit’
/var/tmp/portage/net-wireless/btsco-kernel-0.41/work/btsco-0.41/kernel/btsco.c:1100: error: ‘snd_card_bt_sco_t’ has no member named ‘thread_done’
/var/tmp/portage/net-wireless/btsco-kernel-0.41/work/btsco-0.41/kernel/btsco.c: At top level:
/var/tmp/portage/net-wireless/btsco-kernel-0.41/work/btsco-0.41/kernel/btsco.c:1103: error: expected ‘)’ before ‘*’ token
/var/tmp/portage/net-wireless/btsco-kernel-0.41/work/btsco-0.41/kernel/btsco.c: In function ‘snd_card_bt_sco_probe’:
/var/tmp/portage/net-wireless/btsco-kernel-0.41/work/btsco-0.41/kernel/btsco.c:1125: error: ‘snd_card_t’ undeclared (first use in this function)
/var/tmp/portage/net-wireless/btsco-kernel-0.41/work/btsco-0.41/kernel/btsco.c:1125: error: ‘card’ undeclared (first use in this function)
/var/tmp/portage/net-wireless/btsco-kernel-0.41/work/btsco-0.41/kernel/btsco.c:1126: warning: ISO C90 forbids mixed declarations and code
/var/tmp/portage/net-wireless/btsco-kernel-0.41/work/btsco-0.41/kernel/btsco.c:1128: error: ‘snd_hwdep_t’ undeclared (first use in this function)
/var/tmp/portage/net-wireless/btsco-kernel-0.41/work/btsco-0.41/kernel/btsco.c:1128: error: ‘hw’ undeclared (first use in this function)
/var/tmp/portage/net-wireless/btsco-kernel-0.41/work/btsco-0.41/kernel/btsco.c:1141: error: ‘snd_card_bt_private_free’ undeclared (first use in this function)
/var/tmp/portage/net-wireless/btsco-kernel-0.41/work/btsco-0.41/kernel/btsco.c:1143: error: ‘snd_card_bt_sco_t’ has no member named ‘card’
/var/tmp/portage/net-wireless/btsco-kernel-0.41/work/btsco-0.41/kernel/btsco.c:1145: error: ‘snd_card_bt_sco_t’ has no member named ‘thread_done’
/var/tmp/portage/net-wireless/btsco-kernel-0.41/work/btsco-0.41/kernel/btsco.c:1146: error: ‘snd_card_bt_sco_t’ has no member named ‘thread_sem’
/var/tmp/portage/net-wireless/btsco-kernel-0.41/work/btsco-0.41/kernel/btsco.c:1147: error: ‘snd_card_bt_sco_t’ has no member named ‘sock_sem’
/var/tmp/portage/net-wireless/btsco-kernel-0.41/work/btsco-0.41/kernel/btsco.c:1148: error: ‘snd_card_bt_sco_t’ has no member named ‘capture_sem’
/var/tmp/portage/net-wireless/btsco-kernel-0.41/work/btsco-0.41/kernel/btsco.c:1149: error: ‘snd_card_bt_sco_t’ has no member named ‘playback_sem’
/var/tmp/portage/net-wireless/btsco-kernel-0.41/work/btsco-0.41/kernel/btsco.c:1150: error: ‘snd_card_bt_sco_t’ has no member named ‘wait’
/var/tmp/portage/net-wireless/btsco-kernel-0.41/work/btsco-0.41/kernel/btsco.c:1151: error: ‘snd_card_bt_sco_t’ has no member named ‘hwdep_wait’
/var/tmp/portage/net-wireless/btsco-kernel-0.41/work/btsco-0.41/kernel/btsco.c:1152: error: ‘snd_card_bt_sco_t’ has no member named ‘mixer_changed_lock’
/var/tmp/portage/net-wireless/btsco-kernel-0.41/work/btsco-0.41/kernel/btsco.c:1153: error: ‘snd_card_bt_sco_t’ has no member named ‘count_changed_lock’
/var/tmp/portage/net-wireless/btsco-kernel-0.41/work/btsco-0.41/kernel/btsco.c:1157: error: ‘snd_card_bt_sco_t’ has no member named ‘thread_pid’
/var/tmp/portage/net-wireless/btsco-kernel-0.41/work/btsco-0.41/kernel/btsco.c:1159: error: ‘snd_card_bt_sco_t’ has no member named ‘thread_pid’
/var/tmp/portage/net-wireless/btsco-kernel-0.41/work/btsco-0.41/kernel/btsco.c:1160: error: ‘snd_card_bt_sco_t’ has no member named ‘thread_pid’
/var/tmp/portage/net-wireless/btsco-kernel-0.41/work/btsco-0.41/kernel/btsco.c:1164: error: ‘snd_card_bt_sco_t’ has no member named ‘thread_sem’
/var/tmp/portage/net-wireless/btsco-kernel-0.41/work/btsco-0.41/kernel/btsco.c:1180: error: ‘snd_card_bt_open’ undeclared (first use in this function)
/var/tmp/portage/net-wireless/btsco-kernel-0.41/work/btsco-0.41/kernel/btsco.c:1181: error: ‘snd_card_bt_ioctl’ undeclared (first use in this function)
/var/tmp/portage/net-wireless/btsco-kernel-0.41/work/btsco-0.41/kernel/btsco.c:1182: error: ‘snd_card_bt_release’ undeclared (first use in this function)
/var/tmp/portage/net-wireless/btsco-kernel-0.41/work/btsco-0.41/kernel/btsco.c:1183: error: ‘snd_card_bt_read’ undeclared (first use in this function)
/var/tmp/portage/net-wireless/btsco-kernel-0.41/work/btsco-0.41/kernel/btsco.c:1184: error: ‘snd_card_bt_write’ undeclared (first use in this function)
/var/tmp/portage/net-wireless/btsco-kernel-0.41/work/btsco-0.41/kernel/btsco.c:1185: error: ‘snd_card_bt_poll’ undeclared (first use in this function)
/var/tmp/portage/net-wireless/btsco-kernel-0.41/work/btsco-0.41/kernel/btsco.c:1188: error: ‘snd_bt_sco_cards’ undeclared (first use in this function)
/var/tmp/portage/net-wireless/btsco-kernel-0.41/work/btsco-0.41/kernel/btsco.c: In function ‘alsa_card_bt_sco_exit’:
/var/tmp/portage/net-wireless/btsco-kernel-0.41/work/btsco-0.41/kernel/btsco.c:1215: error: ‘snd_bt_sco_cards’ undeclared (first use in this function)
make[2]: *** [/var/tmp/portage/net-wireless/btsco-kernel-0.41/work/btsco-0.41/kernel/btsco.o] Error 1
make[1]: *** [_module_/var/tmp/portage/net-wireless/btsco-kernel-0.41/work/btsco-0.41/kernel] Error 2
make: *** [default] Error 2
*
* ERROR: net-wireless/btsco-kernel-0.41 failed.
* Call stack:
* ebuild.sh, line 1642: Called dyn_compile
* ebuild.sh, line 988: Called qa_call 'src_compile'
* ebuild.sh, line 44: Called src_compile
* ebuild.sh, line 1327: Called linux-mod_src_compile
* linux-mod.eclass, line 516: Called die
*
* Unable to make -j1 default.
* If you need support, post the topmost build error, and the call stack if relevant.
* A complete build log is located at '/var/tmp/portage/net-wireless/btsco-kernel-0.41/temp/build.log'.
*