rendered paste bodyscanning dependencies of target trash_panelapplet
cd /home/kde-devel/kde/build/KDE/kdebase && /usr/bin/cmake -E cmake_depends "Unix Makefiles" /home/kde-devel/kde/src/KDE/kdebase /home/kde-devel/kde/src/KDE/kdebase/workspace/kicker/applets/trash /home/kde-devel/kde/build/KDE/kdebase /home/kde-devel/kde/build/KDE/kdebase/workspace/kicker/applets/trash /home/kde-devel/kde/build/KDE/kdebase/workspace/kicker/applets/trash/CMakeFiles/trash_panelapplet.dir/DependInfo.cmake
make[2]: Leaving directory `/home/kde-devel/kde/build/KDE/kdebase'
/usr/bin/make -f workspace/kicker/applets/trash/CMakeFiles/trash_panelapplet.dir/build.make workspace/kicker/applets/trash/CMakeFiles/trash_panelapplet.dir/build
make[2]: Entering directory `/home/kde-devel/kde/build/KDE/kdebase'
/usr/bin/cmake -E cmake_progress_report /home/kde-devel/kde/build/KDE/kdebase/CMakeFiles
[ 73%] Building CXX object workspace/kicker/applets/trash/CMakeFiles/trash_panelapplet.dir/trashbutton.o
/usr/bin/c++ -Dtrash_panelapplet_EXPORTS -Wnon-virtual-dtor -Wno-long-long -ansi -Wundef -Wcast-align -Wchar-subscripts -Wall -W -Wpointer-arith -Wformat-security -fno-exceptions -fno-check-new -fno-common -fvisibility=hidden -Wnon-virtual-dtor -Wno-long-long -ansi -Wundef -Wcast-align -Wchar-subscripts -Wall -W -Wpointer-arith -Wformat-security -fno-exceptions -fno-check-new -fno-common -fvisibility=hidden -g3 -fno-inline -fPIC -I/home/kde-devel/kde/build/KDE/kdebase/workspace/kicker/applets/trash -I/home/kde-devel/kde/src/KDE/kdebase/workspace/kicker/applets/trash -I/home/kde-devel/kde/src/KDE/kdebase -I/home/kde-devel/kde/build/KDE/kdebase -I/home/kde-devel/kde/build/KDE/kdebase/workspace/kicker/libkicker -I/home/kde-devel/kde/build/KDE/kdebase/workspace -I/home/kde-devel/kde/src/KDE/kdebase/workspace/kdm -I/home/kde-devel/kde/src/KDE/kdebase/workspace/kicker/libkicker -I/home/kde-devel/kde/src/KDE/kdebase/workspace/libs -I/home/kde-devel/kde/src/KDE/kdebase/workspace/libs/workspace -I/home/kde-devel/kde/src/KDE/kdebase/apps/lib/konq -I/home/kde-devel/kde/src/KDE/kdebase/workspace/kicker -I/home/kde-devel/kde/build/KDE/kdebase/workspace/kicker -I/home/kde-devel/kde/build/KDE/kdebase/workspace/kicker/kicker -I/home/kde-devel/kde/src/KDE/kdebase/workspace/lib -I/home/kde-devel/kde/build/KDE/kdebase/workspace/lib -I/home/kde-devel/kde/src/KDE/kdebase/libkonq -I/home/kde-devel/kde/src/KDE/kdebase/kicker/core -I/home/kde-devel/qt-copy/-qdbus/include -I/home/kde-devel/qt-copy/-qdbus/include/Qt -I/home/kde-devel/qt-copy/-qdbus/mkspecs/default -I/home/kde-devel/qt-copy/-qdbus/include/QtCore -I/home/kde-devel/qt-copy/-qdbus/include/QtGui -I/home/kde-devel/qt-copy/-qdbus/include/Qt3Support -I/home/kde-devel/qt-copy/-qdbus/include/QtAssistant -I/home/kde-devel/qt-copy/-qdbus/include/QtDesigner -I/home/kde-devel/qt-copy/-qdbus/include/QtNetwork -I/home/kde-devel/qt-copy/-qdbus/include/QtOpenGL -I/home/kde-devel/qt-copy/-qdbus/include/QtSql -I/home/kde-devel/qt-copy/-qdbus/include/QtXml -I/home/kde-devel/qt-copy/-qdbus/include/QtSvg -I/home/kde-devel/qt-copy/-qdbus/include/QtScript -I/home/kde-devel/qt-copy/-qdbus/include/QtUiTools -I/home/kde-devel/qt-copy/-qdbus/include/QtTest -I/home/kde-devel/qt-copy/-qdbus/include/QtDBus -I/home/kde-devel/kde/include -I/home/kde-devel/kde/include/KDE -I/usr/local/include -D_BSD_SOURCE -D_XOPEN_SOURCE=500 -D_BSD_SOURCE -D_GNU_SOURCE -DQT_NO_STL -DQT_NO_CAST_TO_ASCII -D_REENTRANT -DKDE_DEPRECATED_WARNINGS -DHAVE_CONFIG_H=1 -D_BSD_SOURCE -D_XOPEN_SOURCE=500 -D_BSD_SOURCE -D_GNU_SOURCE -DQT_NO_STL -DQT_NO_CAST_TO_ASCII -D_REENTRANT -DKDE_DEPRECATED_WARNINGS -DHAVE_CONFIG_H=1 -DQT3_SUPPORT -o workspace/kicker/applets/trash/CMakeFiles/trash_panelapplet.dir/trashbutton.o -c /home/kde-devel/kde/src/KDE/kdebase/workspace/kicker/applets/trash/trashbutton.cpp
/home/kde-devel/kde/src/KDE/kdebase/workspace/kicker/kicker/ui/addapplet.h:68: error: ‘Ui’ has not been declared
/home/kde-devel/kde/src/KDE/kdebase/workspace/kicker/kicker/ui/addapplet.h:68: error: ISO C++ forbids declaration of ‘AppletView’ with no type
/home/kde-devel/kde/src/KDE/kdebase/workspace/kicker/kicker/ui/addapplet.h:68: error: expected ‘;’ before ‘*’ token
/home/kde-devel/kde/src/KDE/kdebase/workspace/kicker/kicker/core/containerarea.cpp: In member function ‘void ContainerArea::initialize(bool)’:
/home/kde-devel/kde/src/KDE/kdebase/workspace/kicker/kicker/core/containerarea.cpp:131: warning: ‘setGroup’ is deprecated (declared at /home/kde-devel/kde/include/kconfigbase.h:1172)
/home/kde-devel/kde/src/KDE/kdebase/workspace/kicker/kicker/core/containerarea.cpp:141: warning: ‘readEntry’ is deprecated (declared at /home/kde-devel/kde/include/kconfigbase.h:245)
/home/kde-devel/kde/src/KDE/kdebase/workspace/kicker/applets/trash/trashbutton.cpp: In constructor ‘TrashButton::TrashButton(QWidget*)’:
/home/kde-devel/kde/src/KDE/kdebase/workspace/kicker/applets/trash/trashbutton.cpp:43: warning: ‘assign’ is deprecated (declared at /home/kde-devel/kde/include/kfileitem.h:503)
make[2]: *** [workspace/kicker/applets/launcher/CMakeFiles/launcher_panelapplet.dir/home/kde-devel/kde/src/KDE/kdebase/workspace/kicker/kicker/core/containerarea.o] Error 1
make[2]: Leaving directory `/home/kde-devel/kde/build/KDE/kdebase'
make[1]: *** [workspace/kicker/applets/launcher/CMakeFiles/launcher_panelapplet.dir/all] Error 2
make[1]: *** Waiting for unfinished jobs....
/usr/bin/cmake -E cmake_progress_report /home/kde-devel/kde/build/KDE/kdebase/CMakeFiles
[ 73%] Building CXX object workspace/kicker/applets/trash/CMakeFiles/trash_panelapplet.dir/trashapplet.o
/usr/bin/c++ -Dtrash_panelapplet_EXPORTS -Wnon-virtual-dtor -Wno-long-long -ansi -Wundef -Wcast-align -Wchar-subscripts -Wall -W -Wpointer-arith -Wformat-security -fno-exceptions -fno-check-new -fno-common -fvisibility=hidden -Wnon-virtual-dtor -Wno-long-long -ansi -Wundef -Wcast-align -Wchar-subscripts -Wall -W -Wpointer-arith -Wformat-security -fno-exceptions -fno-check-new -fno-common -fvisibility=hidden -g3 -fno-inline -fPIC -I/home/kde-devel/kde/build/KDE/kdebase/workspace/kicker/applets/trash -I/home/kde-devel/kde/src/KDE/kdebase/workspace/kicker/applets/trash -I/home/kde-devel/kde/src/KDE/kdebase -I/home/kde-devel/kde/build/KDE/kdebase -I/home/kde-devel/kde/build/KDE/kdebase/workspace/kicker/libkicker -I/home/kde-devel/kde/build/KDE/kdebase/workspace -I/home/kde-devel/kde/src/KDE/kdebase/workspace/kdm -I/home/kde-devel/kde/src/KDE/kdebase/workspace/kicker/libkicker -I/home/kde-devel/kde/src/KDE/kdebase/workspace/libs -I/home/kde-devel/kde/src/KDE/kdebase/workspace/libs/workspace -I/home/kde-devel/kde/src/KDE/kdebase/apps/lib/konq -I/home/kde-devel/kde/src/KDE/kdebase/workspace/kicker -I/home/kde-devel/kde/build/KDE/kdebase/workspace/kicker -I/home/kde-devel/kde/build/KDE/kdebase/workspace/kicker/kicker -I/home/kde-devel/kde/src/KDE/kdebase/workspace/lib -I/home/kde-devel/kde/build/KDE/kdebase/workspace/lib -I/home/kde-devel/kde/src/KDE/kdebase/libkonq -I/home/kde-devel/kde/src/KDE/kdebase/kicker/core -I/home/kde-devel/qt-copy/-qdbus/include -I/home/kde-devel/qt-copy/-qdbus/include/Qt -I/home/kde-devel/qt-copy/-qdbus/mkspecs/default -I/home/kde-devel/qt-copy/-qdbus/include/QtCore -I/home/kde-devel/qt-copy/-qdbus/include/QtGui -I/home/kde-devel/qt-copy/-qdbus/include/Qt3Support -I/home/kde-devel/qt-copy/-qdbus/include/QtAssistant -I/home/kde-devel/qt-copy/-qdbus/include/QtDesigner -I/home/kde-devel/qt-copy/-qdbus/include/QtNetwork -I/home/kde-devel/qt-copy/-qdbus/include/QtOpenGL -I/home/kde-devel/qt-copy/-qdbus/include/QtSql -I/home/kde-devel/qt-copy/-qdbus/include/QtXml -I/home/kde-devel/qt-copy/-qdbus/include/QtSvg -I/home/kde-devel/qt-copy/-qdbus/include/QtScript -I/home/kde-devel/qt-copy/-qdbus/include/QtUiTools -I/home/kde-devel/qt-copy/-qdbus/include/QtTest -I/home/kde-devel/qt-copy/-qdbus/include/QtDBus -I/home/kde-devel/kde/include -I/home/kde-devel/kde/include/KDE -I/usr/local/include -D_BSD_SOURCE -D_XOPEN_SOURCE=500 -D_BSD_SOURCE -D_GNU_SOURCE -DQT_NO_STL -DQT_NO_CAST_TO_ASCII -D_REENTRANT -DKDE_DEPRECATED_WARNINGS -DHAVE_CONFIG_H=1 -D_BSD_SOURCE -D_XOPEN_SOURCE=500 -D_BSD_SOURCE -D_GNU_SOURCE -DQT_NO_STL -DQT_NO_CAST_TO_ASCII -D_REENTRANT -DKDE_DEPRECATED_WARNINGS -DHAVE_CONFIG_H=1 -DQT3_SUPPORT -o workspace/kicker/applets/trash/CMakeFiles/trash_panelapplet.dir/trashapplet.o -c /home/kde-devel/kde/src/KDE/kdebase/workspace/kicker/applets/trash/trashapplet.cpp
Linking CXX shared module ../../../../lib/trash_panelapplet.so
cd /home/kde-devel/kde/build/KDE/kdebase/workspace/kicker/applets/trash && /usr/bin/cmake -P CMakeFiles/trash_panelapplet.dir/cmake_clean_target.cmake
cd /home/kde-devel/kde/build/KDE/kdebase/workspace/kicker/applets/trash && /usr/bin/cmake -E cmake_link_script CMakeFiles/trash_panelapplet.dir/link.txt --verbose=1
/usr/bin/c++ -fPIC -Wnon-virtual-dtor -Wno-long-long -ansi -Wundef -Wcast-align -Wchar-subscripts -Wall -W -Wpointer-arith -Wformat-security -fno-exceptions -fno-check-new -fno-common -fvisibility=hidden -Wnon-virtual-dtor -Wno-long-long -ansi -Wundef -Wcast-align -Wchar-subscripts -Wall -W -Wpointer-arith -Wformat-security -fno-exceptions -fno-check-new -fno-common -fvisibility=hidden -g3 -fno-inline -Wl,--fatal-warnings -Wl,--no-undefined -lc -Wl,--fatal-warnings -Wl,--no-undefined -lc -shared -Wl,-soname,trash_panelapplet.so -o ../../../../lib/trash_panelapplet.so "CMakeFiles/trash_panelapplet.dir/trashbutton.o" "CMakeFiles/trash_panelapplet.dir/trashapplet.o" -L/usr/local/lib -L/home/kde-devel/kde/build/KDE/kdebase/lib -L/home/kde-devel/qt-copy/-qdbus/lib -L/home/kde-devel/kde/lib -lkickermain -lkonq -lQtSvg -lQtCore -lpthread -lkdecore -lSM -lICE -lX11 -lXext -lXau -lXdmcp -lQtGui -lQtXml -lkdefx -lkdeui -lQtCore -lpthread -lkdecore -lkdeui -lz -lstreamanalyzer -lstreams -lQtCore -lpthread -lkdecore -lsolid -lkdesu -lkio -lQtCore -lpthread -lkdecore -lkdeui -lkio -lkutils -lkworkspace -lkio -lkparts -lkio -lQt3Support -lkde3support -lkdefx -lkdesu -lQtCore -lpthread -lkdecore -lkdeui -lQtSvg -lSM -lICE -lX11 -lXext -lXau -lXdmcp -lkdefx -lQtGui -lz -lstreamanalyzer -lstreams -lQtCore -lpthread -lkdecore -lQtNetwork -lutil -lbz2 -lresolv -lsolid -lQtDBus -lQtXml -lkdesu
make[2]: Leaving directory `/home/kde-devel/kde/build/KDE/kdebase'
/usr/bin/cmake -E cmake_progress_report /home/kde-devel/kde/build/KDE/kdebase/CMakeFiles
[ 73%] Built target trash_panelapplet
make[1]: Leaving directory `/home/kde-devel/kde/build/KDE/kdebase'
make: *** [all] Error 2
makeobj[0]: Leaving directory `/home/kde-devel/kde/build/KDE/kdebase'