rendered paste bodymake -C src all
make[4]: Entering directory `/home/ubuntu/ar7/build_mipsel/elinks-0.11.3/src'
make -C bfu all
make[5]: Entering directory `/home/ubuntu/ar7/build_mipsel/elinks-0.11.3/src/bfu'
ccache mipsel-linux-uclibc-gcc -DHAVE_CONFIG_H -I../.. -I../.././src -Os -pipe -mips32 -mtune=mips32 -funit-at-a-time -Wall -fno-strict-aliasing -Wno-pointer-sign -o button.o -c button.c
In file included from ../.././src/main/timer.h:5,
from ../.././src/bfu/dialog.h:7,
from button.c:13:
../.././src/util/time.h:47: error: expected ')' before 'n'
make[5]: *** [button.o] Error 1
make[5]: Leaving directory `/home/ubuntu/ar7/build_mipsel/elinks-0.11.3/src/bfu'
make[4]: *** [all-recursive] Error 1
make[4]: Leaving directory `/home/ubuntu/ar7/build_mipsel/elinks-0.11.3/src'
make[3]: *** [all-recursive] Error 1
make[3]: Leaving directory `/home/ubuntu/ar7/build_mipsel/elinks-0.11.3'
make[2]: *** [/home/ubuntu/ar7/build_mipsel/elinks-0.11.3/.built] Error 2
make[2]: Leaving directory `/home/ubuntu/packages/net/elinks'
*** elinks compile failed
make[1]: *** [elinks-compile] Error 1
make[1]: Leaving directory `/home/ubuntu/ar7/package'
Build failed. Please re-run make with V=99 to see what's going on
make: *** [package/elinks-compile] Fehler 1