rendered paste bodyerdinger@box0:~/OE/org.openembedded.dev/packages/aircrack$ bitbake -c rebuild -b aircrack-ng_1.0-svn.bb
NOTE: package aircrack-ng-0.9.99+svn20070629: started
NOTE: package aircrack-ng-0.9.99+svn20070629-r0: task do_rebuild: started
NOTE: package aircrack-ng-0.9.99+svn20070629-r0: task do_clean: started
NOTE: removing /home/erdinger/OE/build/tmp/akita/work/armv5te-angstrom-linux-gnueabi/aircrack-ng-0.9.99+svn20070629-r0
NOTE: removing /home/erdinger/OE/build/tmp/akita/stamps/armv5te-angstrom-linux-gnueabi/aircrack-ng-0.9.99+svn20070629-r0.*
NOTE: package aircrack-ng-0.9.99+svn20070629-r0: task do_clean: completed
NOTE: package aircrack-ng-0.9.99+svn20070629-r0: task do_fetch: started
NOTE: aircrack-ng-0.9.99+svn20070629-svn://trac.aircrack-ng.org/svn/branch has no section, not checking URI
NOTE: aircrack-ng-0.9.99+svn20070629-file://makefile-ldflags.patch has no section, not checking URI
NOTE: package aircrack-ng-0.9.99+svn20070629-r0: task do_fetch: completed
NOTE: package aircrack-ng-0.9.99+svn20070629-r0: task do_unpack: started
NOTE: Unpacking /home/erdinger/OE/downloads/1.0-dev_trac.aircrack-ng.org_.svn.branch__20070629.tar.gz to /home/erdinger/OE/build/tmp/akita/work/armv5te-angstrom-linux-gnueabi/aircrack-ng-0.9.99+svn20070629-r0/
NOTE: package aircrack-ng-0.9.99+svn20070629-r0: task do_unpack: completed
NOTE: package aircrack-ng-0.9.99+svn20070629-r0: task do_patch: started
NOTE: Applying patch 'makefile-ldflags.patch'
NOTE: package aircrack-ng-0.9.99+svn20070629-r0: task do_patch: completed
NOTE: package aircrack-ng-0.9.99+svn20070629-r0: task do_configure: started
NOTE: package aircrack-ng-0.9.99+svn20070629-r0: task do_configure: completed
NOTE: package aircrack-ng-0.9.99+svn20070629-r0: task do_qa_configure: started
NOTE: Checking sanity of the config.log file
NOTE: package aircrack-ng-0.9.99+svn20070629-r0: task do_qa_configure: completed
NOTE: package aircrack-ng-0.9.99+svn20070629-r0: task do_compile: started
ERROR: function do_compile failed
ERROR: see log in /home/erdinger/OE/build/tmp/akita/work/armv5te-angstrom-linux-gnueabi/aircrack-ng-0.9.99+svn20070629-r0/temp/log.do_compile.334
NOTE: Task failed: /home/erdinger/OE/build/tmp/akita/work/armv5te-angstrom-linux-gnueabi/aircrack-ng-0.9.99+svn20070629-r0/temp/log.do_compile.334
NOTE: package aircrack-ng-0.9.99+svn20070629-r0: task do_compile: failed
ERROR: Error in executing:
ERROR: Exception:<class 'bb.build.EventException'> Message:('Function failed in task: /home/erdinger/OE/build/tmp/akita/work/armv5te-angstrom-linux-gnueabi/aircrack-ng-0.9.99+svn20070629-r0/temp/log.do_compile.334', <bb.build.TaskFailed instance at 0x830b4ac>)
ERROR: Printing the environment of the function
ERROR: Error in executing:
ERROR: Exception:<class 'bb.build.EventException'> Message:('Function failed in task: /home/erdinger/OE/build/tmp/akita/work/armv5te-angstrom-linux-gnueabi/aircrack-ng-0.9.99+svn20070629-r0/temp/log.do_compile.334', <bb.build.TaskFailed instance at 0x830b4ac>)
ERROR: Printing the environment of the function
ERROR: TaskFailed event exception, aborting
NOTE: package aircrack-ng-0.9.99+svn20070629: failed
ERROR: Build of 'aircrack-ng' failed
erdinger@box0:~/OE/org.openembedded.dev/packages/aircrack$
erdinger@box0:~/OE/org.openembedded.dev/packages/aircrack$ cat /home/erdinger/OE/build/tmp/akita/work/armv5te-angstrom-linux-gnueabi/aircrack-ng-0.9.99+svn20070629-r0/temp/log.do_compile.334
NOTE: make -j4 -e MAKEFLAGS=
make -C src all
make[1]: Entering directory `/home/erdinger/OE/build/tmp/akita/work/armv5te-angstrom-linux-gnueabi/aircrack-ng-0.9.99+svn20070629-r0/1.0-dev/src'
make -C osdep
make[2]: Entering directory `/home/erdinger/OE/build/tmp/akita/work/armv5te-angstrom-linux-gnueabi/aircrack-ng-0.9.99+svn20070629-r0/1.0-dev/src/osdep'
Building for Linux
make[3]: Entering directory `/home/erdinger/OE/build/tmp/akita/work/armv5te-angstrom-linux-gnueabi/aircrack-ng-0.9.99+svn20070629-r0/1.0-dev/src/osdep'
arm-angstrom-linux-gnueabi-gcc -isystem/home/erdinger/OE/build/tmp/akita/staging/arm-angstrom-linux-gnueabi/include -fexpensive-optimizations -fomit-frame-pointer -frename-registers -Os -D_FILE_OFFSET_BITS=64 -D_REVISION=`../evalrev` -Iinclude -D_FILE_OFFSET_BITS=64 -D_REVISION=`../../evalrev` -fPIC -I.. -D_FILE_OFFSET_BITS=64 -D_REVISION=`../../evalrev` -fPIC -I.. -isystem/home/erdinger/OE/build/tmp/akita/staging/arm-angstrom-linux-gnueabi/include -c -o osdep.o osdep.c
/bin/sh: ../evalrev: No such file or directory
<command line>:1:1: warning: "_REVISION" redefined
<command line>:1:1: warning: this is the location of the previous definition
arm-angstrom-linux-gnueabi-gcc -isystem/home/erdinger/OE/build/tmp/akita/staging/arm-angstrom-linux-gnueabi/include -fexpensive-optimizations -fomit-frame-pointer -frename-registers -Os -D_FILE_OFFSET_BITS=64 -D_REVISION=`../evalrev` -Iinclude -D_FILE_OFFSET_BITS=64 -D_REVISION=`../../evalrev` -fPIC -I.. -D_FILE_OFFSET_BITS=64 -D_REVISION=`../../evalrev` -fPIC -I.. -isystem/home/erdinger/OE/build/tmp/akita/staging/arm-angstrom-linux-gnueabi/include -c -o network.o network.c
/bin/sh: ../evalrev: No such file or directory
<command line>:1:1: warning: "_REVISION" redefined
<command line>:1:1: warning: this is the location of the previous definition
arm-angstrom-linux-gnueabi-gcc -isystem/home/erdinger/OE/build/tmp/akita/staging/arm-angstrom-linux-gnueabi/include -fexpensive-optimizations -fomit-frame-pointer -frename-registers -Os -D_FILE_OFFSET_BITS=64 -D_REVISION=`../evalrev` -Iinclude -D_FILE_OFFSET_BITS=64 -D_REVISION=`../../evalrev` -fPIC -I.. -D_FILE_OFFSET_BITS=64 -D_REVISION=`../../evalrev` -fPIC -I.. -isystem/home/erdinger/OE/build/tmp/akita/staging/arm-angstrom-linux-gnueabi/include -c -o linux.o linux.c
/bin/sh: ../evalrev: No such file or directory
<command line>:1:1: warning: "_REVISION" redefined
<command line>:1:1: warning: this is the location of the previous definition
arm-angstrom-linux-gnueabi-gcc -isystem/home/erdinger/OE/build/tmp/akita/staging/arm-angstrom-linux-gnueabi/include -fexpensive-optimizations -fomit-frame-pointer -frename-registers -Os -D_FILE_OFFSET_BITS=64 -D_REVISION=`../evalrev` -Iinclude -D_FILE_OFFSET_BITS=64 -D_REVISION=`../../evalrev` -fPIC -I.. -D_FILE_OFFSET_BITS=64 -D_REVISION=`../../evalrev` -fPIC -I.. -isystem/home/erdinger/OE/build/tmp/akita/staging/arm-angstrom-linux-gnueabi/include -c -o linux_tap.o linux_tap.c
/bin/sh: ../evalrev: No such file or directory
<command line>:1:1: warning: "_REVISION" redefined
<command line>:1:1: warning: this is the location of the previous definition
arm-angstrom-linux-gnueabi-ar cru libosdep.a osdep.o network.o linux.o linux_tap.o
arm-angstrom-linux-gnueabi-ranlib libosdep.a
touch .os.Linux
make[3]: Leaving directory `/home/erdinger/OE/build/tmp/akita/work/armv5te-angstrom-linux-gnueabi/aircrack-ng-0.9.99+svn20070629-r0/1.0-dev/src/osdep'
make[2]: Leaving directory `/home/erdinger/OE/build/tmp/akita/work/armv5te-angstrom-linux-gnueabi/aircrack-ng-0.9.99+svn20070629-r0/1.0-dev/src/osdep'
arm-angstrom-linux-gnueabi-gcc -isystem/home/erdinger/OE/build/tmp/akita/staging/arm-angstrom-linux-gnueabi/include -fexpensive-optimizations -fomit-frame-pointer -frename-registers -Os -D_FILE_OFFSET_BITS=64 -D_REVISION=`../evalrev` -Iinclude -isystem/home/erdinger/OE/build/tmp/akita/staging/arm-angstrom-linux-gnueabi/include -c -o aircrack-ng.o aircrack-ng.c
In file included from aircrack-ng.c:47:
crypto.h:12:26: error: openssl/hmac.h: No such file or directory
crypto.h:13:25: error: openssl/sha.h: No such file or directory
crypto.h:15:25: error: openssl/rc4.h: No such file or directory
crypto.h:16:25: error: openssl/aes.h: No such file or directory
make[1]: *** [aircrack-ng.o] Error 1
make[1]: Leaving directory `/home/erdinger/OE/build/tmp/akita/work/armv5te-angstrom-linux-gnueabi/aircrack-ng-0.9.99+svn20070629-r0/1.0-dev/src'
make: *** [all] Error 2
FATAL: oe_runmake failed