All pastes #596192 Raw Edit

Mine

public text v1 · immutable
#596192 ·published 2007-06-29 20:42 UTC
rendered paste body
m_sched.c:43: warning: function declaration isn't a prototype
m_sched.c:144: warning: function declaration isn't a prototype
m_sched.c: In function 'sys_addhist':
m_sched.c:163: error: expected expression before 'int'
m_sched.c: At top level:
m_sched.c:184: error: expected '=', ',', ';', 'asm' or '__attribute__' before 'oss_resync'
m_sched.c: In function 'glob_audiostatus':
m_sched.c:206: error: 'oss_resync' undeclared (first use in this function)
m_sched.c:206: error: (Each undeclared identifier is reported only once
m_sched.c:206: error: for each function it appears in.)
m_sched.c: In function 'sys_log_error':
m_sched.c:219: error: 'oss_resync' undeclared (first use in this function)
m_sched.c: At top level:
m_sched.c:232: warning: function declaration isn't a prototype
m_sched.c: In function 'sched_pollformeters':
m_sched.c:252: error: expected expression before 'int'
m_sched.c:253: error: expected expression before 'int'
m_sched.c: At top level:
m_sched.c:284: warning: function declaration isn't a prototype
m_sched.c:335: warning: function declaration isn't a prototype
m_sched.c:336: warning: function declaration isn't a prototype
m_sched.c:338: warning: function declaration isn't a prototype
m_sched.c:500: warning: function declaration isn't a prototype
m_sched.c: In function 'sys_callback':
m_sched.c:516: error: 't_sched_callback' undeclared (first use in this function)
m_sched.c:516: error: 'noo' undeclared (first use in this function)
m_sched.c:516: error: expected expression before ')' token
m_sched.c: At top level:
m_sched.c:530: warning: function declaration isn't a prototype
m_sched.c:534: error: expected '=', ',', ';', 'asm' or '__attribute__' before '*' token
m_sched.c:536: error: expected identifier or '(' before string constant
m_sched.c: In function 'run_idle_callbacks':
m_sched.c:579: error: 't_sched_callback' undeclared (first use in this function)
m_sched.c:579: error: 'new_callback' undeclared (first use in this function)
m_sched.c:583: error: expected expression before ')' token
m_sched.c:586: error: 'ringbuffer_head' undeclared (first use in this function)
m_sched.c:589: error: 'next' undeclared (first use in this function)
m_sched.c:597: error: 'idle_callback' undeclared (first use in this function)
m_sched.c:598: error: 'last' undeclared (first use in this function)
m_sched.c:627: error: expected expression before 'int'
m_sched.c: At top level:
m_sched.c:655: error: expected identifier or '(' before string constant
m_sched.c:666: error: expected identifier or '(' before string constant
make: *** [m_sched.o] Error 1