All pastes #595888 Raw Edit

Mine

public text v1 · immutable
#595888 ·published 2007-06-29 18:17 UTC
rendered paste body
Making IPC::SysV (dynamic)
| Checking if your kit is complete...
| Looks good
| Writing Makefile for IPC::SysV
| make[1]: Entering directory `/home/keizer/handheld/build/tmp/angstrom/work/x86_64-linux/perl-native-5.8.8-r12/perl-5.8.8/ext/IPC/SysV'
| make[1]: Leaving directory `/home/keizer/handheld/build/tmp/angstrom/work/x86_64-linux/perl-native-5.8.8-r12/perl-5.8.8/ext/IPC/SysV'
| make[1]: Entering directory `/home/keizer/handheld/build/tmp/angstrom/work/x86_64-linux/perl-native-5.8.8-r12/perl-5.8.8/ext/IPC/SysV'
| cp Msg.pm ../../../lib/IPC/Msg.pm
| cp Semaphore.pm ../../../lib/IPC/Semaphore.pm
| cp SysV.pm ../../../lib/IPC/SysV.pm
| ../../../miniperl "-I../../../lib" "-I../../../lib" ../../../lib/ExtUtils/xsubpp  -typemap ../../../lib/ExtUtils/typemap  SysV.xs > SysV.xsc && mv SysV.xsc SysV.c
| ccache gcc  -c   -D_REENTRANT -D_GNU_SOURCE -DTHREADS_HAVE_PIDS -fno-strict-aliasing -pipe -Wdeclaration-after-statement -D_LARGEFILE_SOURCE -D_FILE_OFFSET_BITS=64 -O2   -DVERSION=\"1.04\" -DXS_VERSION=\"1.04\" -fpic "-I../../.."   SysV.c
| SysV.xs:7:25: error: asm/page.h: No such file or directory
| make[1]: *** [SysV.o] Error 1
| make[1]: Leaving directory `/home/keizer/handheld/build/tmp/angstrom/work/x86_64-linux/perl-native-5.8.8-r12/perl-5.8.8/ext/IPC/SysV'
| make: *** [lib/auto/IPC/SysV/SysV.so] Error 2
| FATAL: oe_runmake failed
NOTE: Task failed: /home/keizer/handheld/build/tmp/angstrom/work/x86_64-linux/perl-native-5.8.8-r12/temp/log.do_compile.28097
NOTE: package perl-native-5.8.8-r12: task do_compile: failed
ERROR: Error in executing: 
ERROR: Exception:bb.build.EventException Message:('Function failed in task: /home/keizer/handheld/build/tmp/angstrom/work/x86_64-linux/perl-native-5.8.8-r12/temp/log.do_compile.28097', <bb.build.TaskFailed instance at 0x7355830>)
ERROR: Printing the environment of the function
ERROR: Error in executing: 
ERROR: Exception:bb.build.EventException Message:('Function failed in task: /home/keizer/handheld/build/tmp/angstrom/work/x86_64-linux/perl-native-5.8.8-r12/temp/log.do_compile.28097', <bb.build.TaskFailed instance at 0x7355830>)
ERROR: Printing the environment of the function
ERROR: TaskFailed event exception, aborting
NOTE: package perl-native-5.8.8: failed
ERROR: Build of /home/keizer/handheld/org.openembedded.dev/packages/perl/perl-native_5.8.8.bb do_rebuild failed
ERROR: Task 0 (/home/keizer/handheld/org.openembedded.dev/packages/perl/perl-native_5.8.8.bb, do_rebuild) failed
NOTE: Tasks Summary: Attempted 0 tasks of which 0 didn't need to be rerun and 1 failed.
ERROR: '/home/keizer/handheld/org.openembedded.dev/packages/perl/perl-native_5.8.8.bb' failed