rendered paste bodyThis file contains any messages produced by compilers while
running configure, to aid debugging if configure makes a mistake.
It was created by configure, which was
generated by GNU Autoconf 2.59. Invocation command line was
$ ./configure --enable-optimized
## --------- ##
## Platform. ##
## --------- ##
hostname = ubuntu-tyler
uname -m = x86_64
uname -r = 2.6.15-23-amd64-generic
uname -s = Linux
uname -v = #1 SMP PREEMPT Tue May 23 13:45:47 UTC 2006
/usr/bin/uname -p = unknown
/bin/uname -X = unknown
/bin/arch = x86_64
/usr/bin/arch -k = unknown
/usr/convex/getsysinfo = unknown
hostinfo = unknown
/bin/machine = unknown
/usr/bin/oslevel = unknown
/bin/universe = unknown
PATH: /usr/local/sbin
PATH: /usr/local/bin
PATH: /usr/sbin
PATH: /usr/bin
PATH: /sbin
PATH: /bin
PATH: /usr/bin/X11
PATH: /usr/games
## ----------- ##
## Core tests. ##
## ----------- ##
configure:1564: checking build system type
configure:1582: result: x86_64-unknown-linux-gnu
configure:1590: checking host system type
configure:1604: result: x86_64-unknown-linux-gnu
configure:1612: checking target system type
configure:1626: result: x86_64-unknown-linux-gnu
configure:1654: checking for a BSD-compatible install
configure:1709: result: /usr/bin/install -c
configure:1720: checking whether build environment is sane
configure:1763: result: yes
configure:1828: checking for gawk
configure:1857: result: no
configure:1828: checking for mawk
configure:1844: found /usr/bin/mawk
configure:1854: result: mawk
configure:1864: checking whether make sets $(MAKE)
configure:1884: result: yes
configure:2068: checking for whoami
configure:2084: found /usr/bin/whoami
configure:2095: result: yes
configure:2169: checking whether make sets $(MAKE)
configure:2189: result: yes
configure:2244: checking for gcc
configure:2260: found /usr/bin/gcc
configure:2270: result: gcc
configure:2514: checking for C compiler version
configure:2517: gcc --version </dev/null >&5
gcc (GCC) 4.0.3 (Ubuntu 4.0.3-1ubuntu5)
Copyright (C) 2006 Free Software Foundation, Inc.
This is free software; see the source for copying conditions. There is NO
warranty; not even for MERCHANTABILITY or FITNESS FOR A PARTICULAR PURPOSE.
configure:2520: $? = 0
configure:2522: gcc -v </dev/null >&5
Using built-in specs.
Target: x86_64-linux-gnu
Configured with: ../src/configure -v --enable-languages=c,c++,java,f95,objc,ada,treelang --prefix=/usr --enable-shared --with-system-zlib --libexecdir=/usr/lib --without-included-gettext --enable-threads=posix --enable-nls --program-suffix=-4.0 --enable-__cxa_atexit --enable-clocale=gnu --enable-libstdcxx-debug --enable-java-awt=gtk-default --enable-gtk-cairo --with-java-home=/usr/lib/jvm/java-1.4.2-gcj-4.0-1.4.2.0/jre --enable-mpfr --disable-werror --enable-checking=release x86_64-linux-gnu
Thread model: posix
gcc version 4.0.3 (Ubuntu 4.0.3-1ubuntu5)
configure:2525: $? = 0
configure:2527: gcc -V </dev/null >&5
gcc: '-V' option must have argument
configure:2530: $? = 1
configure:2553: checking for C compiler default output file name
configure:2556: gcc conftest.c >&5
configure:2559: $? = 0
configure:2605: result: a.out
configure:2610: checking whether the C compiler works
configure:2616: ./a.out
configure:2619: $? = 0
configure:2636: result: yes
configure:2643: checking whether we are cross compiling
configure:2645: result: no
configure:2648: checking for suffix of executables
configure:2650: gcc -o conftest conftest.c >&5
configure:2653: $? = 0
configure:2678: result:
configure:2684: checking for suffix of object files
configure:2705: gcc -c conftest.c >&5
configure:2708: $? = 0
configure:2730: result: o
configure:2734: checking whether we are using the GNU C compiler
configure:2758: gcc -c conftest.c >&5
configure:2764: $? = 0
configure:2767: test -z || test ! -s conftest.err
configure:2770: $? = 0
configure:2773: test -s conftest.o
configure:2776: $? = 0
configure:2789: result: yes
configure:2795: checking whether gcc accepts -g
configure:2816: gcc -c -g conftest.c >&5
configure:2822: $? = 0
configure:2825: test -z || test ! -s conftest.err
configure:2828: $? = 0
configure:2831: test -s conftest.o
configure:2834: $? = 0
configure:2845: result: yes
configure:2862: checking for gcc option to accept ANSI C
configure:2932: gcc -c -g -O2 conftest.c >&5
configure:2938: $? = 0
configure:2941: test -z || test ! -s conftest.err
configure:2944: $? = 0
configure:2947: test -s conftest.o
configure:2950: $? = 0
configure:2968: result: none needed
configure:2986: gcc -c -g -O2 conftest.c >&5
conftest.c:2: error: syntax error before 'me'
configure:2992: $? = 1
configure: failed program was:
| #ifndef __cplusplus
| choke me
| #endif
configure:3133: checking for style of include used by make
configure:3161: result: GNU
configure:3189: checking dependency style of gcc
configure:3279: result: gcc3
configure:3348: checking for g++
configure:3364: found /usr/bin/g++
configure:3374: result: g++
configure:3390: checking for C++ compiler version
configure:3393: g++ --version </dev/null >&5
g++ (GCC) 4.0.3 (Ubuntu 4.0.3-1ubuntu5)
Copyright (C) 2006 Free Software Foundation, Inc.
This is free software; see the source for copying conditions. There is NO
warranty; not even for MERCHANTABILITY or FITNESS FOR A PARTICULAR PURPOSE.
configure:3396: $? = 0
configure:3398: g++ -v </dev/null >&5
Using built-in specs.
Target: x86_64-linux-gnu
Configured with: ../src/configure -v --enable-languages=c,c++,java,f95,objc,ada,treelang --prefix=/usr --enable-shared --with-system-zlib --libexecdir=/usr/lib --without-included-gettext --enable-threads=posix --enable-nls --program-suffix=-4.0 --enable-__cxa_atexit --enable-clocale=gnu --enable-libstdcxx-debug --enable-java-awt=gtk-default --enable-gtk-cairo --with-java-home=/usr/lib/jvm/java-1.4.2-gcj-4.0-1.4.2.0/jre --enable-mpfr --disable-werror --enable-checking=release x86_64-linux-gnu
Thread model: posix
gcc version 4.0.3 (Ubuntu 4.0.3-1ubuntu5)
configure:3401: $? = 0
configure:3403: g++ -V </dev/null >&5
g++: '-V' option must have argument
configure:3406: $? = 1
configure:3409: checking whether we are using the GNU C++ compiler
configure:3433: g++ -c conftest.cc >&5
configure:3439: $? = 0
configure:3442: test -z || test ! -s conftest.err
configure:3445: $? = 0
configure:3448: test -s conftest.o
configure:3451: $? = 0
configure:3464: result: yes
configure:3470: checking whether g++ accepts -g
configure:3491: g++ -c -g conftest.cc >&5
configure:3497: $? = 0
configure:3500: test -z || test ! -s conftest.err
configure:3503: $? = 0
configure:3506: test -s conftest.o
configure:3509: $? = 0
configure:3520: result: yes
configure:3562: g++ -c -g -O2 conftest.cc >&5
configure:3568: $? = 0
configure:3571: test -z || test ! -s conftest.err
configure:3574: $? = 0
configure:3577: test -s conftest.o
configure:3580: $? = 0
configure:3606: g++ -c -g -O2 conftest.cc >&5
conftest.cc: In function 'int main()':
conftest.cc:18: error: 'exit' was not declared in this scope
configure:3612: $? = 1
configure: failed program was:
| /* confdefs.h. */
|
| #define PACKAGE_NAME ""
| #define PACKAGE_TARNAME ""
| #define PACKAGE_VERSION ""
| #define PACKAGE_STRING ""
| #define PACKAGE_BUGREPORT ""
| #define PACKAGE "bzflag"
| #define VERSION "2.0.8"
| #define BZ_BUILD_OS "linux-gnu"
| #define BZ_BUILD_USER "tyler"
| #define BUILD_REGEX 1
| /* end confdefs.h. */
|
| int
| main ()
| {
| exit (42);
| ;
| return 0;
| }
configure:3562: g++ -c -g -O2 conftest.cc >&5
configure:3568: $? = 0
configure:3571: test -z || test ! -s conftest.err
configure:3574: $? = 0
configure:3577: test -s conftest.o
configure:3580: $? = 0
configure:3606: g++ -c -g -O2 conftest.cc >&5
configure:3612: $? = 0
configure:3615: test -z || test ! -s conftest.err
configure:3618: $? = 0
configure:3621: test -s conftest.o
configure:3624: $? = 0
configure:3649: checking dependency style of g++
configure:3739: result: gcc3
configure:3759: checking for ccache
configure:3792: result: no
configure:3843: checking for windres
configure:3870: result: :
configure:3940: checking whether ln -s works
configure:3944: result: yes
configure:3992: checking for ranlib
configure:4008: found /usr/bin/ranlib
configure:4019: result: ranlib
configure:4132: checking for a sed that does not truncate output
configure:4186: result: /bin/sed
configure:4189: checking for egrep
configure:4199: result: grep -E
configure:4215: checking for ld used by gcc
configure:4282: result: /usr/bin/ld
configure:4291: checking if the linker (/usr/bin/ld) is GNU ld
configure:4306: result: yes
configure:4311: checking for /usr/bin/ld option to reload object files
configure:4318: result: -r
configure:4336: checking for BSD-compatible nm
configure:4385: result: /usr/bin/nm -B
configure:4389: checking how to recognise dependent libraries
configure:4565: result: pass_all
configure:4652: gcc -c -g -O2 conftest.c >&5
configure:4655: $? = 0
configure:4800: checking how to run the C preprocessor
configure:4835: gcc -E conftest.c
configure:4841: $? = 0
configure:4873: gcc -E conftest.c
conftest.c:17:28: error: ac_nonexistent.h: No such file or directory
configure:4879: $? = 1
configure: failed program was:
| /* confdefs.h. */
|
| #define PACKAGE_NAME ""
| #define PACKAGE_TARNAME ""
| #define PACKAGE_VERSION ""
| #define PACKAGE_STRING ""
| #define PACKAGE_BUGREPORT ""
| #define PACKAGE "bzflag"
| #define VERSION "2.0.8"
| #define BZ_BUILD_OS "linux-gnu"
| #define BZ_BUILD_USER "tyler"
| #define BUILD_REGEX 1
| #ifdef __cplusplus
| extern "C" void std::exit (int) throw (); using std::exit;
| #endif
| /* end confdefs.h. */
| #include <ac_nonexistent.h>
configure:4918: result: gcc -E
configure:4942: gcc -E conftest.c
configure:4948: $? = 0
configure:4980: gcc -E conftest.c
conftest.c:17:28: error: ac_nonexistent.h: No such file or directory
configure:4986: $? = 1
configure: failed program was:
| /* confdefs.h. */
|
| #define PACKAGE_NAME ""
| #define PACKAGE_TARNAME ""
| #define PACKAGE_VERSION ""
| #define PACKAGE_STRING ""
| #define PACKAGE_BUGREPORT ""
| #define PACKAGE "bzflag"
| #define VERSION "2.0.8"
| #define BZ_BUILD_OS "linux-gnu"
| #define BZ_BUILD_USER "tyler"
| #define BUILD_REGEX 1
| #ifdef __cplusplus
| extern "C" void std::exit (int) throw (); using std::exit;
| #endif
| /* end confdefs.h. */
| #include <ac_nonexistent.h>
configure:5030: checking for ANSI C header files
configure:5055: gcc -c -g -O2 conftest.c >&5
configure:5061: $? = 0
configure:5064: test -z || test ! -s conftest.err
configure:5067: $? = 0
configure:5070: test -s conftest.o
configure:5073: $? = 0
configure:5162: gcc -o conftest -g -O2 conftest.c >&5
conftest.c: In function 'main':
conftest.c:34: warning: incompatible implicit declaration of built-in function 'exit'
configure:5165: $? = 0
configure:5167: ./conftest
configure:5170: $? = 0
configure:5185: result: yes
configure:5209: checking for sys/types.h
configure:5225: gcc -c -g -O2 conftest.c >&5
configure:5231: $? = 0
configure:5234: test -z || test ! -s conftest.err
configure:5237: $? = 0
configure:5240: test -s conftest.o
configure:5243: $? = 0
configure:5254: result: yes
configure:5209: checking for sys/stat.h
configure:5225: gcc -c -g -O2 conftest.c >&5
configure:5231: $? = 0
configure:5234: test -z || test ! -s conftest.err
configure:5237: $? = 0
configure:5240: test -s conftest.o
configure:5243: $? = 0
configure:5254: result: yes
configure:5209: checking for stdlib.h
configure:5225: gcc -c -g -O2 conftest.c >&5
configure:5231: $? = 0
configure:5234: test -z || test ! -s conftest.err
configure:5237: $? = 0
configure:5240: test -s conftest.o
configure:5243: $? = 0
configure:5254: result: yes
configure:5209: checking for string.h
configure:5225: gcc -c -g -O2 conftest.c >&5
configure:5231: $? = 0
configure:5234: test -z || test ! -s conftest.err
configure:5237: $? = 0
configure:5240: test -s conftest.o
configure:5243: $? = 0
configure:5254: result: yes
configure:5209: checking for memory.h
configure:5225: gcc -c -g -O2 conftest.c >&5
configure:5231: $? = 0
configure:5234: test -z || test ! -s conftest.err
configure:5237: $? = 0
configure:5240: test -s conftest.o
configure:5243: $? = 0
configure:5254: result: yes
configure:5209: checking for strings.h
configure:5225: gcc -c -g -O2 conftest.c >&5
configure:5231: $? = 0
configure:5234: test -z || test ! -s conftest.err
configure:5237: $? = 0
configure:5240: test -s conftest.o
configure:5243: $? = 0
configure:5254: result: yes
configure:5209: checking for inttypes.h
configure:5225: gcc -c -g -O2 conftest.c >&5
configure:5231: $? = 0
configure:5234: test -z || test ! -s conftest.err
configure:5237: $? = 0
configure:5240: test -s conftest.o
configure:5243: $? = 0
configure:5254: result: yes
configure:5209: checking for stdint.h
configure:5225: gcc -c -g -O2 conftest.c >&5
configure:5231: $? = 0
configure:5234: test -z || test ! -s conftest.err
configure:5237: $? = 0
configure:5240: test -s conftest.o
configure:5243: $? = 0
configure:5254: result: yes
configure:5209: checking for unistd.h
configure:5225: gcc -c -g -O2 conftest.c >&5
configure:5231: $? = 0
configure:5234: test -z || test ! -s conftest.err
configure:5237: $? = 0
configure:5240: test -s conftest.o
configure:5243: $? = 0
configure:5254: result: yes
configure:5280: checking dlfcn.h usability
configure:5292: gcc -c -g -O2 conftest.c >&5
configure:5298: $? = 0
configure:5301: test -z || test ! -s conftest.err
configure:5304: $? = 0
configure:5307: test -s conftest.o
configure:5310: $? = 0
configure:5320: result: yes
configure:5324: checking dlfcn.h presence
configure:5334: gcc -E conftest.c
configure:5340: $? = 0
configure:5360: result: yes
configure:5395: checking for dlfcn.h
configure:5402: result: yes
configure:5425: checking how to run the C++ preprocessor
configure:5456: g++ -E conftest.cc
configure:5462: $? = 0
configure:5494: g++ -E conftest.cc
conftest.cc:28:28: error: ac_nonexistent.h: No such file or directory
configure:5500: $? = 1
configure: failed program was:
| /* confdefs.h. */
|
| #define PACKAGE_NAME ""
| #define PACKAGE_TARNAME ""
| #define PACKAGE_VERSION ""
| #define PACKAGE_STRING ""
| #define PACKAGE_BUGREPORT ""
| #define PACKAGE "bzflag"
| #define VERSION "2.0.8"
| #define BZ_BUILD_OS "linux-gnu"
| #define BZ_BUILD_USER "tyler"
| #define BUILD_REGEX 1
| #ifdef __cplusplus
| extern "C" void std::exit (int) throw (); using std::exit;
| #endif
| #define STDC_HEADERS 1
| #define HAVE_SYS_TYPES_H 1
| #define HAVE_SYS_STAT_H 1
| #define HAVE_STDLIB_H 1
| #define HAVE_STRING_H 1
| #define HAVE_MEMORY_H 1
| #define HAVE_STRINGS_H 1
| #define HAVE_INTTYPES_H 1
| #define HAVE_STDINT_H 1
| #define HAVE_UNISTD_H 1
| #define HAVE_DLFCN_H 1
| /* end confdefs.h. */
| #include <ac_nonexistent.h>
configure:5539: result: g++ -E
configure:5563: g++ -E conftest.cc
configure:5569: $? = 0
configure:5601: g++ -E conftest.cc
conftest.cc:28:28: error: ac_nonexistent.h: No such file or directory
configure:5607: $? = 1
configure: failed program was:
| /* confdefs.h. */
|
| #define PACKAGE_NAME ""
| #define PACKAGE_TARNAME ""
| #define PACKAGE_VERSION ""
| #define PACKAGE_STRING ""
| #define PACKAGE_BUGREPORT ""
| #define PACKAGE "bzflag"
| #define VERSION "2.0.8"
| #define BZ_BUILD_OS "linux-gnu"
| #define BZ_BUILD_USER "tyler"
| #define BUILD_REGEX 1
| #ifdef __cplusplus
| extern "C" void std::exit (int) throw (); using std::exit;
| #endif
| #define STDC_HEADERS 1
| #define HAVE_SYS_TYPES_H 1
| #define HAVE_SYS_STAT_H 1
| #define HAVE_STDLIB_H 1
| #define HAVE_STRING_H 1
| #define HAVE_MEMORY_H 1
| #define HAVE_STRINGS_H 1
| #define HAVE_INTTYPES_H 1
| #define HAVE_STDINT_H 1
| #define HAVE_UNISTD_H 1
| #define HAVE_DLFCN_H 1
| /* end confdefs.h. */
| #include <ac_nonexistent.h>
configure:5704: checking for g77
configure:5733: result: no
configure:5704: checking for f77
configure:5733: result: no
configure:5704: checking for xlf
configure:5733: result: no
configure:5704: checking for frt
configure:5733: result: no
configure:5704: checking for pgf77
configure:5733: result: no
configure:5704: checking for fort77
configure:5733: result: no
configure:5704: checking for fl32
configure:5733: result: no
configure:5704: checking for af77
configure:5733: result: no
configure:5704: checking for f90
configure:5733: result: no
configure:5704: checking for xlf90
configure:5733: result: no
configure:5704: checking for pgf90
configure:5733: result: no
configure:5704: checking for epcf90
configure:5733: result: no
configure:5704: checking for f95
configure:5733: result: no
configure:5704: checking for fort
configure:5733: result: no
configure:5704: checking for xlf95
configure:5733: result: no
configure:5704: checking for ifc
configure:5733: result: no
configure:5704: checking for efc
configure:5733: result: no
configure:5704: checking for pgf95
configure:5733: result: no
configure:5704: checking for lf95
configure:5733: result: no
configure:5704: checking for gfortran
configure:5733: result: no
configure:5745: checking for Fortran 77 compiler version
configure:5748: --version </dev/null >&5
./configure: line 5749: --version: command not found
configure:5751: $? = 127
configure:5753: -v </dev/null >&5
./configure: line 5754: -v: command not found
configure:5756: $? = 127
configure:5758: -V </dev/null >&5
./configure: line 5759: -V: command not found
configure:5761: $? = 127
configure:5769: checking whether we are using the GNU Fortran 77 compiler
configure:5783: -c conftest.F >&5
./configure: line 5784: -c: command not found
configure:5789: $? = 127
configure: failed program was:
| program main
| #ifndef __GNUC__
| choke me
| #endif
|
| end
configure:5814: result: no
configure:5820: checking whether accepts -g
configure:5832: -c -g conftest.f >&5
./configure: line 5833: -c: command not found
configure:5838: $? = 127
configure: failed program was:
| program main
|
| end
configure:5862: result: no
configure:5892: checking the maximum length of command line arguments
configure:6001: result: 32768
configure:6012: checking command to parse /usr/bin/nm -B output from gcc object
configure:6117: gcc -c -g -O2 conftest.c >&5
configure:6120: $? = 0
configure:6124: /usr/bin/nm -B conftest.o \| sed -n -e 's/^.*[ ]\([ABCDGIRSTW][ABCDGIRSTW]*\)[ ][ ]*\([_A-Za-z][_A-Za-z0-9]*\)$/\1 \2 \2/p' \> conftest.nm
configure:6127: $? = 0
configure:6179: gcc -o conftest -g -O2 conftest.c conftstm.o >&5
configure:6182: $? = 0
configure:6220: result: ok
configure:6224: checking for objdir
configure:6239: result: .libs
configure:6329: checking for ar
configure:6345: found /usr/bin/ar
configure:6356: result: ar
configure:6409: checking for ranlib
configure:6436: result: ranlib
configure:6489: checking for strip
configure:6505: found /usr/bin/strip
configure:6516: result: strip
configure:6788: checking if gcc supports -fno-rtti -fno-exceptions
configure:6806: gcc -c -g -O2 -fno-rtti -fno-exceptions conftest.c >&5
cc1: warning: command line option "-fno-rtti" is valid for C++/ObjC++ but not for C
configure:6810: $? = 0
configure:6823: result: no
configure:6838: checking for gcc option to produce PIC
configure:7048: result: -fPIC
configure:7056: checking if gcc PIC flag -fPIC works
configure:7074: gcc -c -g -O2 -fPIC -DPIC conftest.c >&5
configure:7078: $? = 0
configure:7091: result: yes
configure:7119: checking if gcc static flag -static works
configure:7147: result: yes
configure:7157: checking if gcc supports -c -o file.o
configure:7178: gcc -c -g -O2 -o out/conftest2.o conftest.c >&5
configure:7182: $? = 0
configure:7204: result: yes
configure:7230: checking whether the gcc linker (/usr/bin/ld -m elf_x86_64) supports shared libraries
configure:8196: result: yes
configure:8263: checking dynamic linker characteristics
configure:8863: result: GNU/Linux ld.so
configure:8872: checking how to hardcode library paths into programs
configure:8897: result: immediate
configure:8911: checking whether stripping libraries is possible
configure:8916: result: yes
configure:9041: checking for shl_load
configure:9098: gcc -o conftest -g -O2 conftest.c >&5
/tmp/ccM1Ni5n.o: In function `main':/home/tyler/bzflag-2.0.8/conftest.c:67: undefined reference to `shl_load'
/tmp/ccM1Ni5n.o:(.data+0x0): undefined reference to `shl_load'
collect2: ld returned 1 exit status
configure:9104: $? = 1
configure: failed program was:
| /* confdefs.h. */
|
| #define PACKAGE_NAME ""
| #define PACKAGE_TARNAME ""
| #define PACKAGE_VERSION ""
| #define PACKAGE_STRING ""
| #define PACKAGE_BUGREPORT ""
| #define PACKAGE "bzflag"
| #define VERSION "2.0.8"
| #define BZ_BUILD_OS "linux-gnu"
| #define BZ_BUILD_USER "tyler"
| #define BUILD_REGEX 1
| #ifdef __cplusplus
| extern "C" void std::exit (int) throw (); using std::exit;
| #endif
| #define STDC_HEADERS 1
| #define HAVE_SYS_TYPES_H 1
| #define HAVE_SYS_STAT_H 1
| #define HAVE_STDLIB_H 1
| #define HAVE_STRING_H 1
| #define HAVE_MEMORY_H 1
| #define HAVE_STRINGS_H 1
| #define HAVE_INTTYPES_H 1
| #define HAVE_STDINT_H 1
| #define HAVE_UNISTD_H 1
| #define HAVE_DLFCN_H 1
| /* end confdefs.h. */
| /* Define shl_load to an innocuous variant, in case <limits.h> declares shl_load.
| For example, HP-UX 11i <limits.h> declares gettimeofday. */
| #define shl_load innocuous_shl_load
|
| /* System header to define __stub macros and hopefully few prototypes,
| which can conflict with char shl_load (); below.
| Prefer <limits.h> to <assert.h> if __STDC__ is defined, since
| <limits.h> exists even on freestanding compilers. */
|
| #ifdef __STDC__
| # include <limits.h>
| #else
| # include <assert.h>
| #endif
|
| #undef shl_load
|
| /* Override any gcc2 internal prototype to avoid an error. */
| #ifdef __cplusplus
| extern "C"
| {
| #endif
| /* We use char because int might match the return type of a gcc2
| builtin and then its argument prototype would still apply. */
| char shl_load ();
| /* The GNU C library defines this for functions which it implements
| to always fail with ENOSYS. Some functions are actually named
| something starting with __ and the normal name is an alias. */
| #if defined (__stub_shl_load) || defined (__stub___shl_load)
| choke me
| #else
| char (*f) () = shl_load;
| #endif
| #ifdef __cplusplus
| }
| #endif
|
| int
| main ()
| {
| return f != shl_load;
| ;
| return 0;
| }
configure:9128: result: no
configure:9133: checking for shl_load in -ldld
configure:9163: gcc -o conftest -g -O2 conftest.c -ldld >&5
/usr/bin/ld: cannot find -ldld
collect2: ld returned 1 exit status
configure:9169: $? = 1
configure: failed program was:
| /* confdefs.h. */
|
| #define PACKAGE_NAME ""
| #define PACKAGE_TARNAME ""
| #define PACKAGE_VERSION ""
| #define PACKAGE_STRING ""
| #define PACKAGE_BUGREPORT ""
| #define PACKAGE "bzflag"
| #define VERSION "2.0.8"
| #define BZ_BUILD_OS "linux-gnu"
| #define BZ_BUILD_USER "tyler"
| #define BUILD_REGEX 1
| #ifdef __cplusplus
| extern "C" void std::exit (int) throw (); using std::exit;
| #endif
| #define STDC_HEADERS 1
| #define HAVE_SYS_TYPES_H 1
| #define HAVE_SYS_STAT_H 1
| #define HAVE_STDLIB_H 1
| #define HAVE_STRING_H 1
| #define HAVE_MEMORY_H 1
| #define HAVE_STRINGS_H 1
| #define HAVE_INTTYPES_H 1
| #define HAVE_STDINT_H 1
| #define HAVE_UNISTD_H 1
| #define HAVE_DLFCN_H 1
| /* end confdefs.h. */
|
| /* Override any gcc2 internal prototype to avoid an error. */
| #ifdef __cplusplus
| extern "C"
| #endif
| /* We use char because int might match the return type of a gcc2
| builtin and then its argument prototype would still apply. */
| char shl_load ();
| int
| main ()
| {
| shl_load ();
| ;
| return 0;
| }
configure:9194: result: no
configure:9199: checking for dlopen
configure:9256: gcc -o conftest -g -O2 conftest.c >&5
/tmp/ccGtfy5t.o: In function `main':/home/tyler/bzflag-2.0.8/conftest.c:67: undefined reference to `dlopen'
/tmp/ccGtfy5t.o:(.data+0x0): undefined reference to `dlopen'
collect2: ld returned 1 exit status
configure:9262: $? = 1
configure: failed program was:
| /* confdefs.h. */
|
| #define PACKAGE_NAME ""
| #define PACKAGE_TARNAME ""
| #define PACKAGE_VERSION ""
| #define PACKAGE_STRING ""
| #define PACKAGE_BUGREPORT ""
| #define PACKAGE "bzflag"
| #define VERSION "2.0.8"
| #define BZ_BUILD_OS "linux-gnu"
| #define BZ_BUILD_USER "tyler"
| #define BUILD_REGEX 1
| #ifdef __cplusplus
| extern "C" void std::exit (int) throw (); using std::exit;
| #endif
| #define STDC_HEADERS 1
| #define HAVE_SYS_TYPES_H 1
| #define HAVE_SYS_STAT_H 1
| #define HAVE_STDLIB_H 1
| #define HAVE_STRING_H 1
| #define HAVE_MEMORY_H 1
| #define HAVE_STRINGS_H 1
| #define HAVE_INTTYPES_H 1
| #define HAVE_STDINT_H 1
| #define HAVE_UNISTD_H 1
| #define HAVE_DLFCN_H 1
| /* end confdefs.h. */
| /* Define dlopen to an innocuous variant, in case <limits.h> declares dlopen.
| For example, HP-UX 11i <limits.h> declares gettimeofday. */
| #define dlopen innocuous_dlopen
|
| /* System header to define __stub macros and hopefully few prototypes,
| which can conflict with char dlopen (); below.
| Prefer <limits.h> to <assert.h> if __STDC__ is defined, since
| <limits.h> exists even on freestanding compilers. */
|
| #ifdef __STDC__
| # include <limits.h>
| #else
| # include <assert.h>
| #endif
|
| #undef dlopen
|
| /* Override any gcc2 internal prototype to avoid an error. */
| #ifdef __cplusplus
| extern "C"
| {
| #endif
| /* We use char because int might match the return type of a gcc2
| builtin and then its argument prototype would still apply. */
| char dlopen ();
| /* The GNU C library defines this for functions which it implements
| to always fail with ENOSYS. Some functions are actually named
| something starting with __ and the normal name is an alias. */
| #if defined (__stub_dlopen) || defined (__stub___dlopen)
| choke me
| #else
| char (*f) () = dlopen;
| #endif
| #ifdef __cplusplus
| }
| #endif
|
| int
| main ()
| {
| return f != dlopen;
| ;
| return 0;
| }
configure:9286: result: no
configure:9291: checking for dlopen in -ldl
configure:9321: gcc -o conftest -g -O2 conftest.c -ldl >&5
configure:9327: $? = 0
configure:9330: test -z || test ! -s conftest.err
configure:9333: $? = 0
configure:9336: test -s conftest
configure:9339: $? = 0
configure:9352: result: yes
configure:9525: checking whether a program can dlopen itself
configure:9599: gcc -o conftest -g -O2 -DHAVE_DLFCN_H -Wl,--export-dynamic conftest.c -ldl >&5
configure: In function 'main':
configure:9595: warning: incompatible implicit declaration of built-in function 'exit'
configure:9602: $? = 0
configure:9620: result: yes
configure:9625: checking whether a statically linked program can dlopen itself
configure:9699: gcc -o conftest -g -O2 -DHAVE_DLFCN_H -Wl,--export-dynamic -static conftest.c -ldl >&5
configure: In function 'main':
configure:9695: warning: incompatible implicit declaration of built-in function 'exit'
/tmp/ccM04Yt9.o: In function `main':/home/tyler/bzflag-2.0.8/configure:9683: warning: Using 'dlopen' in statically linked applications requires at runtime the shared libraries from the glibc version used for linking
configure:9702: $? = 0
/lib/: cannot read file data: Is a directory
configure:9720: result: no
configure:9743: checking if libtool supports shared libraries
configure:9745: result: yes
configure:9748: checking whether to build shared libraries
configure:9769: result: no
configure:9772: checking whether to build static libraries
configure:9776: result: yes
configure:9868: creating libtool
configure:10456: checking for ld used by g++
configure:10523: result: /usr/bin/ld -m elf_x86_64
configure:10532: checking if the linker (/usr/bin/ld -m elf_x86_64) is GNU ld
configure:10547: result: yes
configure:10598: checking whether the g++ linker (/usr/bin/ld -m elf_x86_64) supports shared libraries
configure:11534: result: yes
configure:11552: g++ -c -g -O2 conftest.cpp >&5
configure:11555: $? = 0
configure:11674: checking for g++ option to produce PIC
configure:11948: result: -fPIC
configure:11956: checking if g++ PIC flag -fPIC works
configure:11974: g++ -c -g -O2 -fPIC -DPIC conftest.cpp >&5
configure:11978: $? = 0
configure:11991: result: yes
configure:12019: checking if g++ static flag -static works
configure:12047: result: yes
configure:12057: checking if g++ supports -c -o file.o
configure:12078: g++ -c -g -O2 -o out/conftest2.o conftest.cpp >&5
configure:12082: $? = 0
configure:12104: result: yes
configure:12130: checking whether the g++ linker (/usr/bin/ld -m elf_x86_64) supports shared libraries
configure:12161: result: yes
configure:12228: checking dynamic linker characteristics
configure:12828: result: GNU/Linux ld.so
configure:12837: checking how to hardcode library paths into programs
configure:12862: result: immediate
configure:19057: checking for pod2man
configure:19073: found /usr/bin/pod2man
configure:19084: result: yes
configure:19108: checking for ar
configure:19134: result: ar
configure:19143: checking for compress in -lz
configure:19173: gcc -o conftest -g -O2 conftest.c -lz >&5
configure:19179: $? = 0
configure:19182: test -z || test ! -s conftest.err
configure:19185: $? = 0
configure:19188: test -s conftest
configure:19191: $? = 0
configure:19204: result: yes
configure:19233: checking for curl >= 7.10.0
configure:19243: result: 7.15.1
configure:19337: checking for artificial intelligence for bz's robots
configure:19339: result: not found
configure:19343: checking for ANSI C header files
configure:19498: result: yes
configure:19535: checking cstdlib usability
configure:19547: g++ -c -g -O2 conftest.cc >&5
configure:19553: $? = 0
configure:19556: test -z || test ! -s conftest.err
configure:19559: $? = 0
configure:19562: test -s conftest.o
configure:19565: $? = 0
configure:19575: result: yes
configure:19579: checking cstdlib presence
configure:19589: g++ -E conftest.cc
configure:19595: $? = 0
configure:19615: result: yes
configure:19650: checking for cstdlib
configure:19657: result: yes
configure:19535: checking cstdio usability
configure:19547: g++ -c -g -O2 conftest.cc >&5
configure:19553: $? = 0
configure:19556: test -z || test ! -s conftest.err
configure:19559: $? = 0
configure:19562: test -s conftest.o
configure:19565: $? = 0
configure:19575: result: yes
configure:19579: checking cstdio presence
configure:19589: g++ -E conftest.cc
configure:19595: $? = 0
configure:19615: result: yes
configure:19650: checking for cstdio
configure:19657: result: yes
configure:19535: checking cstring usability
configure:19547: g++ -c -g -O2 conftest.cc >&5
configure:19553: $? = 0
configure:19556: test -z || test ! -s conftest.err
configure:19559: $? = 0
configure:19562: test -s conftest.o
configure:19565: $? = 0
configure:19575: result: yes
configure:19579: checking cstring presence
configure:19589: g++ -E conftest.cc
configure:19595: $? = 0
configure:19615: result: yes
configure:19650: checking for cstring
configure:19657: result: yes
configure:19865: checking GL/glx.h usability
configure:19877: gcc -c -g -O2 conftest.c >&5
conftest.c:66:20: error: GL/glx.h: No such file or directory
configure:19883: $? = 1
configure: failed program was:
| /* confdefs.h. */
|
| #define PACKAGE_NAME ""
| #define PACKAGE_TARNAME ""
| #define PACKAGE_VERSION ""
| #define PACKAGE_STRING ""
| #define PACKAGE_BUGREPORT ""
| #define PACKAGE "bzflag"
| #define VERSION "2.0.8"
| #define BZ_BUILD_OS "linux-gnu"
| #define BZ_BUILD_USER "tyler"
| #define BUILD_REGEX 1
| #ifdef __cplusplus
| extern "C" void std::exit (int) throw (); using std::exit;
| #endif
| #define STDC_HEADERS 1
| #define HAVE_SYS_TYPES_H 1
| #define HAVE_SYS_STAT_H 1
| #define HAVE_STDLIB_H 1
| #define HAVE_STRING_H 1
| #define HAVE_MEMORY_H 1
| #define HAVE_STRINGS_H 1
| #define HAVE_INTTYPES_H 1
| #define HAVE_STDINT_H 1
| #define HAVE_UNISTD_H 1
| #define HAVE_DLFCN_H 1
| #define STDC_HEADERS 1
| #define HAVE_CSTDLIB 1
| #define HAVE_CSTDIO 1
| #define HAVE_CSTRING 1
| /* end confdefs.h. */
| #include <stdio.h>
| #if HAVE_SYS_TYPES_H
| # include <sys/types.h>
| #endif
| #if HAVE_SYS_STAT_H
| # include <sys/stat.h>
| #endif
| #if STDC_HEADERS
| # include <stdlib.h>
| # include <stddef.h>
| #else
| # if HAVE_STDLIB_H
| # include <stdlib.h>
| # endif
| #endif
| #if HAVE_STRING_H
| # if !STDC_HEADERS && HAVE_MEMORY_H
| # include <memory.h>
| # endif
| # include <string.h>
| #endif
| #if HAVE_STRINGS_H
| # include <strings.h>
| #endif
| #if HAVE_INTTYPES_H
| # include <inttypes.h>
| #else
| # if HAVE_STDINT_H
| # include <stdint.h>
| # endif
| #endif
| #if HAVE_UNISTD_H
| # include <unistd.h>
| #endif
| #include <GL/glx.h>
configure:19905: result: no
configure:19909: checking GL/glx.h presence
configure:19919: gcc -E conftest.c
conftest.c:32:20: error: GL/glx.h: No such file or directory
configure:19925: $? = 1
configure: failed program was:
| /* confdefs.h. */
|
| #define PACKAGE_NAME ""
| #define PACKAGE_TARNAME ""
| #define PACKAGE_VERSION ""
| #define PACKAGE_STRING ""
| #define PACKAGE_BUGREPORT ""
| #define PACKAGE "bzflag"
| #define VERSION "2.0.8"
| #define BZ_BUILD_OS "linux-gnu"
| #define BZ_BUILD_USER "tyler"
| #define BUILD_REGEX 1
| #ifdef __cplusplus
| extern "C" void std::exit (int) throw (); using std::exit;
| #endif
| #define STDC_HEADERS 1
| #define HAVE_SYS_TYPES_H 1
| #define HAVE_SYS_STAT_H 1
| #define HAVE_STDLIB_H 1
| #define HAVE_STRING_H 1
| #define HAVE_MEMORY_H 1
| #define HAVE_STRINGS_H 1
| #define HAVE_INTTYPES_H 1
| #define HAVE_STDINT_H 1
| #define HAVE_UNISTD_H 1
| #define HAVE_DLFCN_H 1
| #define STDC_HEADERS 1
| #define HAVE_CSTDLIB 1
| #define HAVE_CSTDIO 1
| #define HAVE_CSTRING 1
| /* end confdefs.h. */
| #include <GL/glx.h>
configure:19945: result: no
configure:19980: checking for GL/glx.h
configure:19987: result: no
configure:19865: checking SDL/SDL.h usability
configure:19877: gcc -c -g -O2 conftest.c >&5
conftest.c:66:21: error: SDL/SDL.h: No such file or directory
configure:19883: $? = 1
configure: failed program was:
| /* confdefs.h. */
|
| #define PACKAGE_NAME ""
| #define PACKAGE_TARNAME ""
| #define PACKAGE_VERSION ""
| #define PACKAGE_STRING ""
| #define PACKAGE_BUGREPORT ""
| #define PACKAGE "bzflag"
| #define VERSION "2.0.8"
| #define BZ_BUILD_OS "linux-gnu"
| #define BZ_BUILD_USER "tyler"
| #define BUILD_REGEX 1
| #ifdef __cplusplus
| extern "C" void std::exit (int) throw (); using std::exit;
| #endif
| #define STDC_HEADERS 1
| #define HAVE_SYS_TYPES_H 1
| #define HAVE_SYS_STAT_H 1
| #define HAVE_STDLIB_H 1
| #define HAVE_STRING_H 1
| #define HAVE_MEMORY_H 1
| #define HAVE_STRINGS_H 1
| #define HAVE_INTTYPES_H 1
| #define HAVE_STDINT_H 1
| #define HAVE_UNISTD_H 1
| #define HAVE_DLFCN_H 1
| #define STDC_HEADERS 1
| #define HAVE_CSTDLIB 1
| #define HAVE_CSTDIO 1
| #define HAVE_CSTRING 1
| /* end confdefs.h. */
| #include <stdio.h>
| #if HAVE_SYS_TYPES_H
| # include <sys/types.h>
| #endif
| #if HAVE_SYS_STAT_H
| # include <sys/stat.h>
| #endif
| #if STDC_HEADERS
| # include <stdlib.h>
| # include <stddef.h>
| #else
| # if HAVE_STDLIB_H
| # include <stdlib.h>
| # endif
| #endif
| #if HAVE_STRING_H
| # if !STDC_HEADERS && HAVE_MEMORY_H
| # include <memory.h>
| # endif
| # include <string.h>
| #endif
| #if HAVE_STRINGS_H
| # include <strings.h>
| #endif
| #if HAVE_INTTYPES_H
| # include <inttypes.h>
| #else
| # if HAVE_STDINT_H
| # include <stdint.h>
| # endif
| #endif
| #if HAVE_UNISTD_H
| # include <unistd.h>
| #endif
| #include <SDL/SDL.h>
configure:19905: result: no
configure:19909: checking SDL/SDL.h presence
configure:19919: gcc -E conftest.c
conftest.c:32:21: error: SDL/SDL.h: No such file or directory
configure:19925: $? = 1
configure: failed program was:
| /* confdefs.h. */
|
| #define PACKAGE_NAME ""
| #define PACKAGE_TARNAME ""
| #define PACKAGE_VERSION ""
| #define PACKAGE_STRING ""
| #define PACKAGE_BUGREPORT ""
| #define PACKAGE "bzflag"
| #define VERSION "2.0.8"
| #define BZ_BUILD_OS "linux-gnu"
| #define BZ_BUILD_USER "tyler"
| #define BUILD_REGEX 1
| #ifdef __cplusplus
| extern "C" void std::exit (int) throw (); using std::exit;
| #endif
| #define STDC_HEADERS 1
| #define HAVE_SYS_TYPES_H 1
| #define HAVE_SYS_STAT_H 1
| #define HAVE_STDLIB_H 1
| #define HAVE_STRING_H 1
| #define HAVE_MEMORY_H 1
| #define HAVE_STRINGS_H 1
| #define HAVE_INTTYPES_H 1
| #define HAVE_STDINT_H 1
| #define HAVE_UNISTD_H 1
| #define HAVE_DLFCN_H 1
| #define STDC_HEADERS 1
| #define HAVE_CSTDLIB 1
| #define HAVE_CSTDIO 1
| #define HAVE_CSTRING 1
| /* end confdefs.h. */
| #include <SDL/SDL.h>
configure:19945: result: no
configure:19980: checking for SDL/SDL.h
configure:19987: result: no
configure:19865: checking X11/Xlib.h usability
configure:19877: gcc -c -g -O2 conftest.c >&5
configure:19883: $? = 0
configure:19886: test -z || test ! -s conftest.err
configure:19889: $? = 0
configure:19892: test -s conftest.o
configure:19895: $? = 0
configure:19905: result: yes
configure:19909: checking X11/Xlib.h presence
configure:19919: gcc -E conftest.c
configure:19925: $? = 0
configure:19945: result: yes
configure:19980: checking for X11/Xlib.h
configure:19987: result: yes
configure:19865: checking bstring.h usability
configure:19877: gcc -c -g -O2 conftest.c >&5
conftest.c:67:21: error: bstring.h: No such file or directory
configure:19883: $? = 1
configure: failed program was:
| /* confdefs.h. */
|
| #define PACKAGE_NAME ""
| #define PACKAGE_TARNAME ""
| #define PACKAGE_VERSION ""
| #define PACKAGE_STRING ""
| #define PACKAGE_BUGREPORT ""
| #define PACKAGE "bzflag"
| #define VERSION "2.0.8"
| #define BZ_BUILD_OS "linux-gnu"
| #define BZ_BUILD_USER "tyler"
| #define BUILD_REGEX 1
| #ifdef __cplusplus
| extern "C" void std::exit (int) throw (); using std::exit;
| #endif
| #define STDC_HEADERS 1
| #define HAVE_SYS_TYPES_H 1
| #define HAVE_SYS_STAT_H 1
| #define HAVE_STDLIB_H 1
| #define HAVE_STRING_H 1
| #define HAVE_MEMORY_H 1
| #define HAVE_STRINGS_H 1
| #define HAVE_INTTYPES_H 1
| #define HAVE_STDINT_H 1
| #define HAVE_UNISTD_H 1
| #define HAVE_DLFCN_H 1
| #define STDC_HEADERS 1
| #define HAVE_CSTDLIB 1
| #define HAVE_CSTDIO 1
| #define HAVE_CSTRING 1
| #define HAVE_X11_XLIB_H 1
| /* end confdefs.h. */
| #include <stdio.h>
| #if HAVE_SYS_TYPES_H
| # include <sys/types.h>
| #endif
| #if HAVE_SYS_STAT_H
| # include <sys/stat.h>
| #endif
| #if STDC_HEADERS
| # include <stdlib.h>
| # include <stddef.h>
| #else
| # if HAVE_STDLIB_H
| # include <stdlib.h>
| # endif
| #endif
| #if HAVE_STRING_H
| # if !STDC_HEADERS && HAVE_MEMORY_H
| # include <memory.h>
| # endif
| # include <string.h>
| #endif
| #if HAVE_STRINGS_H
| # include <strings.h>
| #endif
| #if HAVE_INTTYPES_H
| # include <inttypes.h>
| #else
| # if HAVE_STDINT_H
| # include <stdint.h>
| # endif
| #endif
| #if HAVE_UNISTD_H
| # include <unistd.h>
| #endif
| #include <bstring.h>
configure:19905: result: no
configure:19909: checking bstring.h presence
configure:19919: gcc -E conftest.c
conftest.c:33:21: error: bstring.h: No such file or directory
configure:19925: $? = 1
configure: failed program was:
| /* confdefs.h. */
|
| #define PACKAGE_NAME ""
| #define PACKAGE_TARNAME ""
| #define PACKAGE_VERSION ""
| #define PACKAGE_STRING ""
| #define PACKAGE_BUGREPORT ""
| #define PACKAGE "bzflag"
| #define VERSION "2.0.8"
| #define BZ_BUILD_OS "linux-gnu"
| #define BZ_BUILD_USER "tyler"
| #define BUILD_REGEX 1
| #ifdef __cplusplus
| extern "C" void std::exit (int) throw (); using std::exit;
| #endif
| #define STDC_HEADERS 1
| #define HAVE_SYS_TYPES_H 1
| #define HAVE_SYS_STAT_H 1
| #define HAVE_STDLIB_H 1
| #define HAVE_STRING_H 1
| #define HAVE_MEMORY_H 1
| #define HAVE_STRINGS_H 1
| #define HAVE_INTTYPES_H 1
| #define HAVE_STDINT_H 1
| #define HAVE_UNISTD_H 1
| #define HAVE_DLFCN_H 1
| #define STDC_HEADERS 1
| #define HAVE_CSTDLIB 1
| #define HAVE_CSTDIO 1
| #define HAVE_CSTRING 1
| #define HAVE_X11_XLIB_H 1
| /* end confdefs.h. */
| #include <bstring.h>
configure:19945: result: no
configure:19980: checking for bstring.h
configure:19987: result: no
configure:19865: checking linux/input.h usability
configure:19877: gcc -c -g -O2 conftest.c >&5
configure:19883: $? = 0
configure:19886: test -z || test ! -s conftest.err
configure:19889: $? = 0
configure:19892: test -s conftest.o
configure:19895: $? = 0
configure:19905: result: yes
configure:19909: checking linux/input.h presence
configure:19919: gcc -E conftest.c
configure:19925: $? = 0
configure:19945: result: yes
configure:19980: checking for linux/input.h
configure:19987: result: yes
configure:19856: checking for stdint.h
configure:19861: result: yes
configure:19865: checking sys/param.h usability
configure:19877: gcc -c -g -O2 conftest.c >&5
configure:19883: $? = 0
configure:19886: test -z || test ! -s conftest.err
configure:19889: $? = 0
configure:19892: test -s conftest.o
configure:19895: $? = 0
configure:19905: result: yes
configure:19909: checking sys/param.h presence
configure:19919: gcc -E conftest.c
configure:19925: $? = 0
configure:19945: result: yes
configure:19980: checking for sys/param.h
configure:19987: result: yes
configure:19856: checking for unistd.h
configure:19861: result: yes
configure:19865: checking values.h usability
configure:19877: gcc -c -g -O2 conftest.c >&5
configure:19883: $? = 0
configure:19886: test -z || test ! -s conftest.err
configure:19889: $? = 0
configure:19892: test -s conftest.o
configure:19895: $? = 0
configure:19905: result: yes
configure:19909: checking values.h presence
configure:19919: gcc -E conftest.c
configure:19925: $? = 0
configure:19945: result: yes
configure:19980: checking for values.h
configure:19987: result: yes
configure:19865: checking dsound.h usability
configure:19877: gcc -c -g -O2 conftest.c >&5
conftest.c:72:20: error: dsound.h: No such file or directory
configure:19883: $? = 1
configure: failed program was:
| /* confdefs.h. */
|
| #define PACKAGE_NAME ""
| #define PACKAGE_TARNAME ""
| #define PACKAGE_VERSION ""
| #define PACKAGE_STRING ""
| #define PACKAGE_BUGREPORT ""
| #define PACKAGE "bzflag"
| #define VERSION "2.0.8"
| #define BZ_BUILD_OS "linux-gnu"
| #define BZ_BUILD_USER "tyler"
| #define BUILD_REGEX 1
| #ifdef __cplusplus
| extern "C" void std::exit (int) throw (); using std::exit;
| #endif
| #define STDC_HEADERS 1
| #define HAVE_SYS_TYPES_H 1
| #define HAVE_SYS_STAT_H 1
| #define HAVE_STDLIB_H 1
| #define HAVE_STRING_H 1
| #define HAVE_MEMORY_H 1
| #define HAVE_STRINGS_H 1
| #define HAVE_INTTYPES_H 1
| #define HAVE_STDINT_H 1
| #define HAVE_UNISTD_H 1
| #define HAVE_DLFCN_H 1
| #define STDC_HEADERS 1
| #define HAVE_CSTDLIB 1
| #define HAVE_CSTDIO 1
| #define HAVE_CSTRING 1
| #define HAVE_X11_XLIB_H 1
| #define HAVE_LINUX_INPUT_H 1
| #define HAVE_STDINT_H 1
| #define HAVE_SYS_PARAM_H 1
| #define HAVE_UNISTD_H 1
| #define HAVE_VALUES_H 1
| /* end confdefs.h. */
| #include <stdio.h>
| #if HAVE_SYS_TYPES_H
| # include <sys/types.h>
| #endif
| #if HAVE_SYS_STAT_H
| # include <sys/stat.h>
| #endif
| #if STDC_HEADERS
| # include <stdlib.h>
| # include <stddef.h>
| #else
| # if HAVE_STDLIB_H
| # include <stdlib.h>
| # endif
| #endif
| #if HAVE_STRING_H
| # if !STDC_HEADERS && HAVE_MEMORY_H
| # include <memory.h>
| # endif
| # include <string.h>
| #endif
| #if HAVE_STRINGS_H
| # include <strings.h>
| #endif
| #if HAVE_INTTYPES_H
| # include <inttypes.h>
| #else
| # if HAVE_STDINT_H
| # include <stdint.h>
| # endif
| #endif
| #if HAVE_UNISTD_H
| # include <unistd.h>
| #endif
| #include <dsound.h>
configure:19905: result: no
configure:19909: checking dsound.h presence
configure:19919: gcc -E conftest.c
conftest.c:38:20: error: dsound.h: No such file or directory
configure:19925: $? = 1
configure: failed program was:
| /* confdefs.h. */
|
| #define PACKAGE_NAME ""
| #define PACKAGE_TARNAME ""
| #define PACKAGE_VERSION ""
| #define PACKAGE_STRING ""
| #define PACKAGE_BUGREPORT ""
| #define PACKAGE "bzflag"
| #define VERSION "2.0.8"
| #define BZ_BUILD_OS "linux-gnu"
| #define BZ_BUILD_USER "tyler"
| #define BUILD_REGEX 1
| #ifdef __cplusplus
| extern "C" void std::exit (int) throw (); using std::exit;
| #endif
| #define STDC_HEADERS 1
| #define HAVE_SYS_TYPES_H 1
| #define HAVE_SYS_STAT_H 1
| #define HAVE_STDLIB_H 1
| #define HAVE_STRING_H 1
| #define HAVE_MEMORY_H 1
| #define HAVE_STRINGS_H 1
| #define HAVE_INTTYPES_H 1
| #define HAVE_STDINT_H 1
| #define HAVE_UNISTD_H 1
| #define HAVE_DLFCN_H 1
| #define STDC_HEADERS 1
| #define HAVE_CSTDLIB 1
| #define HAVE_CSTDIO 1
| #define HAVE_CSTRING 1
| #define HAVE_X11_XLIB_H 1
| #define HAVE_LINUX_INPUT_H 1
| #define HAVE_STDINT_H 1
| #define HAVE_SYS_PARAM_H 1
| #define HAVE_UNISTD_H 1
| #define HAVE_VALUES_H 1
| /* end confdefs.h. */
| #include <dsound.h>
configure:19945: result: no
configure:19980: checking for dsound.h
configure:19987: result: no
configure:20004: checking whether byte ordering is bigendian
configure:20031: gcc -c -g -O2 conftest.c >&5
configure:20037: $? = 0
configure:20040: test -z || test ! -s conftest.err
configure:20043: $? = 0
configure:20046: test -s conftest.o
configure:20049: $? = 0
configure:20073: gcc -c -g -O2 conftest.c >&5
conftest.c: In function 'main':
conftest.c:45: error: 'not' undeclared (first use in this function)
conftest.c:45: error: (Each undeclared identifier is reported only once
conftest.c:45: error: for each function it appears in.)
conftest.c:45: error: syntax error before 'big'
configure:20079: $? = 1
configure: failed program was:
| /* confdefs.h. */
|
| #define PACKAGE_NAME ""
| #define PACKAGE_TARNAME ""
| #define PACKAGE_VERSION ""
| #define PACKAGE_STRING ""
| #define PACKAGE_BUGREPORT ""
| #define PACKAGE "bzflag"
| #define VERSION "2.0.8"
| #define BZ_BUILD_OS "linux-gnu"
| #define BZ_BUILD_USER "tyler"
| #define BUILD_REGEX 1
| #ifdef __cplusplus
| extern "C" void std::exit (int) throw (); using std::exit;
| #endif
| #define STDC_HEADERS 1
| #define HAVE_SYS_TYPES_H 1
| #define HAVE_SYS_STAT_H 1
| #define HAVE_STDLIB_H 1
| #define HAVE_STRING_H 1
| #define HAVE_MEMORY_H 1
| #define HAVE_STRINGS_H 1
| #define HAVE_INTTYPES_H 1
| #define HAVE_STDINT_H 1
| #define HAVE_UNISTD_H 1
| #define HAVE_DLFCN_H 1
| #define STDC_HEADERS 1
| #define HAVE_CSTDLIB 1
| #define HAVE_CSTDIO 1
| #define HAVE_CSTRING 1
| #define HAVE_X11_XLIB_H 1
| #define HAVE_LINUX_INPUT_H 1
| #define HAVE_STDINT_H 1
| #define HAVE_SYS_PARAM_H 1
| #define HAVE_UNISTD_H 1
| #define HAVE_VALUES_H 1
| /* end confdefs.h. */
| #include <sys/types.h>
| #include <sys/param.h>
|
| int
| main ()
| {
| #if BYTE_ORDER != BIG_ENDIAN
| not big endian
| #endif
|
| ;
| return 0;
| }
configure:20212: result: no
configure:20231: checking for an ANSI C-conforming const
configure:20298: gcc -c -g -O2 conftest.c >&5
configure:20304: $? = 0
configure:20307: test -z || test ! -s conftest.err
configure:20310: $? = 0
configure:20313: test -s conftest.o
configure:20316: $? = 0
configure:20327: result: yes
configure:20338: checking for socklen_t type
configure:20357: gcc -c -g -O2 conftest.c >&5
configure:20363: $? = 0
configure:20366: test -z || test ! -s conftest.err
configure:20369: $? = 0
configure:20372: test -s conftest.o
configure:20375: $? = 0
configure:20398: result: yes
configure:20402: checking for linux rumble joystick support
configure:20420: gcc -c -g -O2 conftest.c >&5
configure:20426: $? = 0
configure:20429: test -z || test ! -s conftest.err
configure:20432: $? = 0
configure:20435: test -s conftest.o
configure:20438: $? = 0
configure:20455: result: yes
configure:20459: checking for linux force feedback joystick support
configure:20477: gcc -c -g -O2 conftest.c >&5
configure:20483: $? = 0
configure:20486: test -z || test ! -s conftest.err
configure:20489: $? = 0
configure:20492: test -s conftest.o
configure:20495: $? = 0
configure:20512: result: yes
configure:20645: checking for X
configure:20751: gcc -E conftest.c
configure:20757: $? = 0
configure:20879: result: libraries /usr/X11R6/lib, headers in standard search path
configure:21050: gcc -o conftest -g -O2 conftest.c -L/usr/lib -lcurl -L/usr/lib -lgssapi_krb5 -lkrb5 -lk5crypto -lkrb5support -lcom_err -lresolv -L/usr/lib -lgnutls -lidn -ldl -lz -L/usr/X11R6/lib -lX11 >&5
configure:21056: $? = 0
configure:21059: test -z || test ! -s conftest.err
configure:21062: $? = 0
configure:21065: test -s conftest
configure:21068: $? = 0
configure:21224: checking for gethostbyname
configure:21281: gcc -o conftest -g -O2 conftest.c -L/usr/lib -lcurl -L/usr/lib -lgssapi_krb5 -lkrb5 -lk5crypto -lkrb5support -lcom_err -lresolv -L/usr/lib -lgnutls -lidn -ldl -lz >&5
configure:21287: $? = 0
configure:21290: test -z || test ! -s conftest.err
configure:21293: $? = 0
configure:21296: test -s conftest
configure:21299: $? = 0
configure:21311: result: yes
configure:21460: checking for connect
configure:21517: gcc -o conftest -g -O2 conftest.c -L/usr/lib -lcurl -L/usr/lib -lgssapi_krb5 -lkrb5 -lk5crypto -lkrb5support -lcom_err -lresolv -L/usr/lib -lgnutls -lidn -ldl -lz >&5
configure:21523: $? = 0
configure:21526: test -z || test ! -s conftest.err
configure:21529: $? = 0
configure:21532: test -s conftest
configure:21535: $? = 0
configure:21547: result: yes
configure:21621: checking for remove
configure:21678: gcc -o conftest -g -O2 conftest.c -L/usr/lib -lcurl -L/usr/lib -lgssapi_krb5 -lkrb5 -lk5crypto -lkrb5support -lcom_err -lresolv -L/usr/lib -lgnutls -lidn -ldl -lz >&5
configure:21684: $? = 0
configure:21687: test -z || test ! -s conftest.err
configure:21690: $? = 0
configure:21693: test -s conftest
configure:21696: $? = 0
configure:21708: result: yes
configure:21782: checking for shmat
configure:21839: gcc -o conftest -g -O2 conftest.c -L/usr/lib -lcurl -L/usr/lib -lgssapi_krb5 -lkrb5 -lk5crypto -lkrb5support -lcom_err -lresolv -L/usr/lib -lgnutls -lidn -ldl -lz >&5
configure:21845: $? = 0
configure:21848: test -z || test ! -s conftest.err
configure:21851: $? = 0
configure:21854: test -s conftest
configure:21857: $? = 0
configure:21869: result: yes
configure:21952: checking for IceConnectionNumber in -lICE
configure:21982: gcc -o conftest -g -O2 -L/usr/X11R6/lib conftest.c -lICE -L/usr/lib -lcurl -L/usr/lib -lgssapi_krb5 -lkrb5 -lk5crypto -lkrb5support -lcom_err -lresolv -L/usr/lib -lgnutls -lidn -ldl -lz >&5
/usr/bin/ld: cannot find -lICE
collect2: ld returned 1 exit status
configure:21988: $? = 1
configure: failed program was:
| /* confdefs.h. */
|
| #define PACKAGE_NAME ""
| #define PACKAGE_TARNAME ""
| #define PACKAGE_VERSION ""
| #define PACKAGE_STRING ""
| #define PACKAGE_BUGREPORT ""
| #define PACKAGE "bzflag"
| #define VERSION "2.0.8"
| #define BZ_BUILD_OS "linux-gnu"
| #define BZ_BUILD_USER "tyler"
| #define BUILD_REGEX 1
| #ifdef __cplusplus
| extern "C" void std::exit (int) throw (); using std::exit;
| #endif
| #define STDC_HEADERS 1
| #define HAVE_SYS_TYPES_H 1
| #define HAVE_SYS_STAT_H 1
| #define HAVE_STDLIB_H 1
| #define HAVE_STRING_H 1
| #define HAVE_MEMORY_H 1
| #define HAVE_STRINGS_H 1
| #define HAVE_INTTYPES_H 1
| #define HAVE_STDINT_H 1
| #define HAVE_UNISTD_H 1
| #define HAVE_DLFCN_H 1
| #define STDC_HEADERS 1
| #define HAVE_CSTDLIB 1
| #define HAVE_CSTDIO 1
| #define HAVE_CSTRING 1
| #define HAVE_X11_XLIB_H 1
| #define HAVE_LINUX_INPUT_H 1
| #define HAVE_STDINT_H 1
| #define HAVE_SYS_PARAM_H 1
| #define HAVE_UNISTD_H 1
| #define HAVE_VALUES_H 1
| #define HAVE_SOCKLEN_T 1
| #define HAVE_FF_EFFECT_RUMBLE 1
| #define HAVE_FF_EFFECT_DIRECTIONAL 1
| /* end confdefs.h. */
|
| /* Override any gcc2 internal prototype to avoid an error. */
| #ifdef __cplusplus
| extern "C"
| #endif
| /* We use char because int might match the return type of a gcc2
| builtin and then its argument prototype would still apply. */
| char IceConnectionNumber ();
| int
| main ()
| {
| IceConnectionNumber ();
| ;
| return 0;
| }
configure:22013: result: no
configure:22047: checking for sqrtf in -lm
configure:22077: gcc -o conftest -g -O2 -L/usr/X11R6/lib conftest.c -lm -L/usr/lib -lcurl -L/usr/lib -lgssapi_krb5 -lkrb5 -lk5crypto -lkrb5support -lcom_err -lresolv -L/usr/lib -lgnutls -lidn -ldl -lz >&5
conftest.c:48: warning: conflicting types for built-in function 'sqrtf'
configure:22083: $? = 0
configure:22086: test -z || test ! -s conftest.err
configure:22089: $? = 0
configure:22092: test -s conftest
configure:22095: $? = 0
configure:22108: result: yes
configure:22122: checking for socket in -lsocket
configure:22152: gcc -o conftest -g -O2 -L/usr/X11R6/lib conftest.c -lsocket -lm -L/usr/lib -lcurl -L/usr/lib -lgssapi_krb5 -lkrb5 -lk5crypto -lkrb5support -lcom_err -lresolv -L/usr/lib -lgnutls -lidn -ldl -lz >&5
/usr/bin/ld: cannot find -lsocket
collect2: ld returned 1 exit status
configure:22158: $? = 1
configure: failed program was:
| /* confdefs.h. */
|
| #define PACKAGE_NAME ""
| #define PACKAGE_TARNAME ""
| #define PACKAGE_VERSION ""
| #define PACKAGE_STRING ""
| #define PACKAGE_BUGREPORT ""
| #define PACKAGE "bzflag"
| #define VERSION "2.0.8"
| #define BZ_BUILD_OS "linux-gnu"
| #define BZ_BUILD_USER "tyler"
| #define BUILD_REGEX 1
| #ifdef __cplusplus
| extern "C" void std::exit (int) throw (); using std::exit;
| #endif
| #define STDC_HEADERS 1
| #define HAVE_SYS_TYPES_H 1
| #define HAVE_SYS_STAT_H 1
| #define HAVE_STDLIB_H 1
| #define HAVE_STRING_H 1
| #define HAVE_MEMORY_H 1
| #define HAVE_STRINGS_H 1
| #define HAVE_INTTYPES_H 1
| #define HAVE_STDINT_H 1
| #define HAVE_UNISTD_H 1
| #define HAVE_DLFCN_H 1
| #define STDC_HEADERS 1
| #define HAVE_CSTDLIB 1
| #define HAVE_CSTDIO 1
| #define HAVE_CSTRING 1
| #define HAVE_X11_XLIB_H 1
| #define HAVE_LINUX_INPUT_H 1
| #define HAVE_STDINT_H 1
| #define HAVE_SYS_PARAM_H 1
| #define HAVE_UNISTD_H 1
| #define HAVE_VALUES_H 1
| #define HAVE_SOCKLEN_T 1
| #define HAVE_FF_EFFECT_RUMBLE 1
| #define HAVE_FF_EFFECT_DIRECTIONAL 1
| #define HAVE_LIBM 1
| /* end confdefs.h. */
|
| /* Override any gcc2 internal prototype to avoid an error. */
| #ifdef __cplusplus
| extern "C"
| #endif
| /* We use char because int might match the return type of a gcc2
| builtin and then its argument prototype would still apply. */
| char socket ();
| int
| main ()
| {
| socket ();
| ;
| return 0;
| }
configure:22183: result: no
configure:22195: checking for gethostent in -lsocket
configure:22225: gcc -o conftest -g -O2 -L/usr/X11R6/lib conftest.c -lsocket -lm -L/usr/lib -lcurl -L/usr/lib -lgssapi_krb5 -lkrb5 -lk5crypto -lkrb5support -lcom_err -lresolv -L/usr/lib -lgnutls -lidn -ldl -lz >&5
/usr/bin/ld: cannot find -lsocket
collect2: ld returned 1 exit status
configure:22231: $? = 1
configure: failed program was:
| /* confdefs.h. */
|
| #define PACKAGE_NAME ""
| #define PACKAGE_TARNAME ""
| #define PACKAGE_VERSION ""
| #define PACKAGE_STRING ""
| #define PACKAGE_BUGREPORT ""
| #define PACKAGE "bzflag"
| #define VERSION "2.0.8"
| #define BZ_BUILD_OS "linux-gnu"
| #define BZ_BUILD_USER "tyler"
| #define BUILD_REGEX 1
| #ifdef __cplusplus
| extern "C" void std::exit (int) throw (); using std::exit;
| #endif
| #define STDC_HEADERS 1
| #define HAVE_SYS_TYPES_H 1
| #define HAVE_SYS_STAT_H 1
| #define HAVE_STDLIB_H 1
| #define HAVE_STRING_H 1
| #define HAVE_MEMORY_H 1
| #define HAVE_STRINGS_H 1
| #define HAVE_INTTYPES_H 1
| #define HAVE_STDINT_H 1
| #define HAVE_UNISTD_H 1
| #define HAVE_DLFCN_H 1
| #define STDC_HEADERS 1
| #define HAVE_CSTDLIB 1
| #define HAVE_CSTDIO 1
| #define HAVE_CSTRING 1
| #define HAVE_X11_XLIB_H 1
| #define HAVE_LINUX_INPUT_H 1
| #define HAVE_STDINT_H 1
| #define HAVE_SYS_PARAM_H 1
| #define HAVE_UNISTD_H 1
| #define HAVE_VALUES_H 1
| #define HAVE_SOCKLEN_T 1
| #define HAVE_FF_EFFECT_RUMBLE 1
| #define HAVE_FF_EFFECT_DIRECTIONAL 1
| #define HAVE_LIBM 1
| /* end confdefs.h. */
|
| /* Override any gcc2 internal prototype to avoid an error. */
| #ifdef __cplusplus
| extern "C"
| #endif
| /* We use char because int might match the return type of a gcc2
| builtin and then its argument prototype would still apply. */
| char gethostent ();
| int
| main ()
| {
| gethostent ();
| ;
| return 0;
| }
configure:22256: result: no
configure:22267: checking for gethostent in -lbind
configure:22297: gcc -o conftest -g -O2 -L/usr/X11R6/lib conftest.c -lbind -lm -L/usr/lib -lcurl -L/usr/lib -lgssapi_krb5 -lkrb5 -lk5crypto -lkrb5support -lcom_err -lresolv -L/usr/lib -lgnutls -lidn -ldl -lz >&5
/usr/bin/ld: cannot find -lbind
collect2: ld returned 1 exit status
configure:22303: $? = 1
configure: failed program was:
| /* confdefs.h. */
|
| #define PACKAGE_NAME ""
| #define PACKAGE_TARNAME ""
| #define PACKAGE_VERSION ""
| #define PACKAGE_STRING ""
| #define PACKAGE_BUGREPORT ""
| #define PACKAGE "bzflag"
| #define VERSION "2.0.8"
| #define BZ_BUILD_OS "linux-gnu"
| #define BZ_BUILD_USER "tyler"
| #define BUILD_REGEX 1
| #ifdef __cplusplus
| extern "C" void std::exit (int) throw (); using std::exit;
| #endif
| #define STDC_HEADERS 1
| #define HAVE_SYS_TYPES_H 1
| #define HAVE_SYS_STAT_H 1
| #define HAVE_STDLIB_H 1
| #define HAVE_STRING_H 1
| #define HAVE_MEMORY_H 1
| #define HAVE_STRINGS_H 1
| #define HAVE_INTTYPES_H 1
| #define HAVE_STDINT_H 1
| #define HAVE_UNISTD_H 1
| #define HAVE_DLFCN_H 1
| #define STDC_HEADERS 1
| #define HAVE_CSTDLIB 1
| #define HAVE_CSTDIO 1
| #define HAVE_CSTRING 1
| #define HAVE_X11_XLIB_H 1
| #define HAVE_LINUX_INPUT_H 1
| #define HAVE_STDINT_H 1
| #define HAVE_SYS_PARAM_H 1
| #define HAVE_UNISTD_H 1
| #define HAVE_VALUES_H 1
| #define HAVE_SOCKLEN_T 1
| #define HAVE_FF_EFFECT_RUMBLE 1
| #define HAVE_FF_EFFECT_DIRECTIONAL 1
| #define HAVE_LIBM 1
| /* end confdefs.h. */
|
| /* Override any gcc2 internal prototype to avoid an error. */
| #ifdef __cplusplus
| extern "C"
| #endif
| /* We use char because int might match the return type of a gcc2
| builtin and then its argument prototype would still apply. */
| char gethostent ();
| int
| main ()
| {
| gethostent ();
| ;
| return 0;
| }
configure:22328: result: no
configure:22343: checking for acosf in -lm
configure:22373: gcc -o conftest -g -O2 -L/usr/X11R6/lib conftest.c -lm -lm -L/usr/lib -lcurl -L/usr/lib -lgssapi_krb5 -lkrb5 -lk5crypto -lkrb5support -lcom_err -lresolv -L/usr/lib -lgnutls -lidn -ldl -lz >&5
conftest.c:49: warning: conflicting types for built-in function 'acosf'
configure:22379: $? = 0
configure:22382: test -z || test ! -s conftest.err
configure:22385: $? = 0
configure:22388: test -s conftest
configure:22391: $? = 0
configure:22404: result: yes
configure:22414: checking for asinf in -lm
configure:22444: gcc -o conftest -g -O2 -L/usr/X11R6/lib conftest.c -lm -lm -L/usr/lib -lcurl -L/usr/lib -lgssapi_krb5 -lkrb5 -lk5crypto -lkrb5support -lcom_err -lresolv -L/usr/lib -lgnutls -lidn -ldl -lz >&5
conftest.c:50: warning: conflicting types for built-in function 'asinf'
configure:22450: $? = 0
configure:22453: test -z || test ! -s conftest.err
configure:22456: $? = 0
configure:22459: test -s conftest
configure:22462: $? = 0
configure:22475: result: yes
configure:22485: checking for atan2f in -lm
configure:22515: gcc -o conftest -g -O2 -L/usr/X11R6/lib conftest.c -lm -lm -L/usr/lib -lcurl -L/usr/lib -lgssapi_krb5 -lkrb5 -lk5crypto -lkrb5support -lcom_err -lresolv -L/usr/lib -lgnutls -lidn -ldl -lz >&5
conftest.c:51: warning: conflicting types for built-in function 'atan2f'
configure:22521: $? = 0
configure:22524: test -z || test ! -s conftest.err
configure:22527: $? = 0
configure:22530: test -s conftest
configure:22533: $? = 0
configure:22546: result: yes
configure:22556: checking for atanf in -lm
configure:22586: gcc -o conftest -g -O2 -L/usr/X11R6/lib conftest.c -lm -lm -L/usr/lib -lcurl -L/usr/lib -lgssapi_krb5 -lkrb5 -lk5crypto -lkrb5support -lcom_err -lresolv -L/usr/lib -lgnutls -lidn -ldl -lz >&5
conftest.c:52: warning: conflicting types for built-in function 'atanf'
configure:22592: $? = 0
configure:22595: test -z || test ! -s conftest.err
configure:22598: $? = 0
configure:22601: test -s conftest
configure:22604: $? = 0
configure:22617: result: yes
configure:22627: checking for cosf in -lm
configure:22657: gcc -o conftest -g -O2 -L/usr/X11R6/lib conftest.c -lm -lm -L/usr/lib -lcurl -L/usr/lib -lgssapi_krb5 -lkrb5 -lk5crypto -lkrb5support -lcom_err -lresolv -L/usr/lib -lgnutls -lidn -ldl -lz >&5
conftest.c:53: warning: conflicting types for built-in function 'cosf'
configure:22663: $? = 0
configure:22666: test -z || test ! -s conftest.err
configure:22669: $? = 0
configure:22672: test -s conftest
configure:22675: $? = 0
configure:22688: result: yes
configure:22698: checking for expf in -lm
configure:22728: gcc -o conftest -g -O2 -L/usr/X11R6/lib conftest.c -lm -lm -L/usr/lib -lcurl -L/usr/lib -lgssapi_krb5 -lkrb5 -lk5crypto -lkrb5support -lcom_err -lresolv -L/usr/lib -lgnutls -lidn -ldl -lz >&5
conftest.c:54: warning: conflicting types for built-in function 'expf'
configure:22734: $? = 0
configure:22737: test -z || test ! -s conftest.err
configure:22740: $? = 0
configure:22743: test -s conftest
configure:22746: $? = 0
configure:22759: result: yes
configure:22769: checking for fabsf in -lm
configure:22799: gcc -o conftest -g -O2 -L/usr/X11R6/lib conftest.c -lm -lm -L/usr/lib -lcurl -L/usr/lib -lgssapi_krb5 -lkrb5 -lk5crypto -lkrb5support -lcom_err -lresolv -L/usr/lib -lgnutls -lidn -ldl -lz >&5
conftest.c:55: warning: conflicting types for built-in function 'fabsf'
configure:22805: $? = 0
configure:22808: test -z || test ! -s conftest.err
configure:22811: $? = 0
configure:22814: test -s conftest
configure:22817: $? = 0
configure:22830: result: yes
configure:22840: checking for floorf in -lm
configure:22870: gcc -o conftest -g -O2 -L/usr/X11R6/lib conftest.c -lm -lm -L/usr/lib -lcurl -L/usr/lib -lgssapi_krb5 -lkrb5 -lk5crypto -lkrb5support -lcom_err -lresolv -L/usr/lib -lgnutls -lidn -ldl -lz >&5
conftest.c:56: warning: conflicting types for built-in function 'floorf'
configure:22876: $? = 0
configure:22879: test -z || test ! -s conftest.err
configure:22882: $? = 0
configure:22885: test -s conftest
configure:22888: $? = 0
configure:22901: result: yes
configure:22911: checking for fmodf in -lm
configure:22941: gcc -o conftest -g -O2 -L/usr/X11R6/lib conftest.c -lm -lm -L/usr/lib -lcurl -L/usr/lib -lgssapi_krb5 -lkrb5 -lk5crypto -lkrb5support -lcom_err -lresolv -L/usr/lib -lgnutls -lidn -ldl -lz >&5
conftest.c:57: warning: conflicting types for built-in function 'fmodf'
configure:22947: $? = 0
configure:22950: test -z || test ! -s conftest.err
configure:22953: $? = 0
configure:22956: test -s conftest
configure:22959: $? = 0
configure:22972: result: yes
configure:22982: checking for hypotf in -lm
configure:23012: gcc -o conftest -g -O2 -L/usr/X11R6/lib conftest.c -lm -lm -L/usr/lib -lcurl -L/usr/lib -lgssapi_krb5 -lkrb5 -lk5crypto -lkrb5support -lcom_err -lresolv -L/usr/lib -lgnutls -lidn -ldl -lz >&5
conftest.c:58: warning: conflicting types for built-in function 'hypotf'
configure:23018: $? = 0
configure:23021: test -z || test ! -s conftest.err
configure:23024: $? = 0
configure:23027: test -s conftest
configure:23030: $? = 0
configure:23043: result: yes
configure:23053: checking for logf in -lm
configure:23083: gcc -o conftest -g -O2 -L/usr/X11R6/lib conftest.c -lm -lm -L/usr/lib -lcurl -L/usr/lib -lgssapi_krb5 -lkrb5 -lk5crypto -lkrb5support -lcom_err -lresolv -L/usr/lib -lgnutls -lidn -ldl -lz >&5
conftest.c:59: warning: conflicting types for built-in function 'logf'
configure:23089: $? = 0
configure:23092: test -z || test ! -s conftest.err
configure:23095: $? = 0
configure:23098: test -s conftest
configure:23101: $? = 0
configure:23114: result: yes
configure:23124: checking for log10f in -lm
configure:23154: gcc -o conftest -g -O2 -L/usr/X11R6/lib conftest.c -lm -lm -L/usr/lib -lcurl -L/usr/lib -lgssapi_krb5 -lkrb5 -lk5crypto -lkrb5support -lcom_err -lresolv -L/usr/lib -lgnutls -lidn -ldl -lz >&5
conftest.c:60: warning: conflicting types for built-in function 'log10f'
configure:23160: $? = 0
configure:23163: test -z || test ! -s conftest.err
configure:23166: $? = 0
configure:23169: test -s conftest
configure:23172: $? = 0
configure:23185: result: yes
configure:23195: checking for powf in -lm
configure:23225: gcc -o conftest -g -O2 -L/usr/X11R6/lib conftest.c -lm -lm -L/usr/lib -lcurl -L/usr/lib -lgssapi_krb5 -lkrb5 -lk5crypto -lkrb5support -lcom_err -lresolv -L/usr/lib -lgnutls -lidn -ldl -lz >&5
conftest.c:61: warning: conflicting types for built-in function 'powf'
configure:23231: $? = 0
configure:23234: test -z || test ! -s conftest.err
configure:23237: $? = 0
configure:23240: test -s conftest
configure:23243: $? = 0
configure:23256: result: yes
configure:23266: checking for sinf in -lm
configure:23296: gcc -o conftest -g -O2 -L/usr/X11R6/lib conftest.c -lm -lm -L/usr/lib -lcurl -L/usr/lib -lgssapi_krb5 -lkrb5 -lk5crypto -lkrb5support -lcom_err -lresolv -L/usr/lib -lgnutls -lidn -ldl -lz >&5
conftest.c:62: warning: conflicting types for built-in function 'sinf'
configure:23302: $? = 0
configure:23305: test -z || test ! -s conftest.err
configure:23308: $? = 0
configure:23311: test -s conftest
configure:23314: $? = 0
configure:23327: result: yes
configure:23337: checking for sqrtf in -lm
configure:23398: result: yes
configure:23408: checking for tanf in -lm
configure:23438: gcc -o conftest -g -O2 -L/usr/X11R6/lib conftest.c -lm -lm -L/usr/lib -lcurl -L/usr/lib -lgssapi_krb5 -lkrb5 -lk5crypto -lkrb5support -lcom_err -lresolv -L/usr/lib -lgnutls -lidn -ldl -lz >&5
conftest.c:64: warning: conflicting types for built-in function 'tanf'
configure:23444: $? = 0
configure:23447: test -z || test ! -s conftest.err
configure:23450: $? = 0
configure:23453: test -s conftest
configure:23456: $? = 0
configure:23469: result: yes
configure:23491: checking for XextAddDisplay in -lXext
configure:23521: gcc -o conftest -g -O2 -L/usr/X11R6/lib conftest.c -lXext -lX11 -lm -L/usr/lib -lcurl -L/usr/lib -lgssapi_krb5 -lkrb5 -lk5crypto -lkrb5support -lcom_err -lresolv -L/usr/lib -lgnutls -lidn -ldl -lz >&5
configure:23527: $? = 0
configure:23530: test -z || test ! -s conftest.err
configure:23533: $? = 0
configure:23536: test -s conftest
configure:23539: $? = 0
configure:23552: result: yes
configure:23560: checking for XF86VidModeGetAllModeLines in -lXxf86vm
configure:23590: gcc -o conftest -g -O2 -L/usr/X11R6/lib conftest.c -lXxf86vm -lXext -lX11 -lm -L/usr/lib -lcurl -L/usr/lib -lgssapi_krb5 -lkrb5 -lk5crypto -lkrb5support -lcom_err -lresolv -L/usr/lib -lgnutls -lidn -ldl -lz >&5
configure:23596: $? = 0
configure:23599: test -z || test ! -s conftest.err
configure:23602: $? = 0
configure:23605: test -s conftest
configure:23608: $? = 0
configure:23621: result: yes
configure:23627: checking for XListInputDevices in -lXi
configure:23657: gcc -o conftest -g -O2 -L/usr/X11R6/lib conftest.c -lXi -lXxf86vm -lXext -lX11 -lm -L/usr/lib -lcurl -L/usr/lib -lgssapi_krb5 -lkrb5 -lk5crypto -lkrb5support -lcom_err -lresolv -L/usr/lib -lgnutls -lidn -ldl -lz >&5
configure:23663: $? = 0
configure:23666: test -z || test ! -s conftest.err
configure:23669: $? = 0
configure:23672: test -s conftest
configure:23675: $? = 0
configure:23688: result: yes
configure:23727: g++ -o conftest -g -O2 -L/usr/X11R6/lib conftest.cc -lm -L/usr/lib -lcurl -L/usr/lib -lgssapi_krb5 -lkrb5 -lk5crypto -lkrb5support -lcom_err -lresolv -L/usr/lib -lgnutls -lidn -ldl -lz >&5
configure:23733: $? = 0
configure:23736: test -z || test ! -s conftest.err
configure:23739: $? = 0
configure:23742: test -s conftest
configure:23745: $? = 0
configure:23781: g++ -o conftest -g -O2 -L/usr/X11R6/lib conftest.cc -framework OpenGL -lXi -lXxf86vm -lXext -lX11 -lm -L/usr/lib -lcurl -L/usr/lib -lgssapi_krb5 -lkrb5 -lk5crypto -lkrb5support -lcom_err -lresolv -L/usr/lib -lgnutls -lidn -ldl -lz >&5
g++: OpenGL: No such file or directory
cc1plus: error: unrecognized command line option "-framework"
configure:23787: $? = 1
configure: failed program was:
| /* confdefs.h. */
|
| #define PACKAGE_NAME ""
| #define PACKAGE_TARNAME ""
| #define PACKAGE_VERSION ""
| #define PACKAGE_STRING ""
| #define PACKAGE_BUGREPORT ""
| #define PACKAGE "bzflag"
| #define VERSION "2.0.8"
| #define BZ_BUILD_OS "linux-gnu"
| #define BZ_BUILD_USER "tyler"
| #define BUILD_REGEX 1
| #ifdef __cplusplus
| extern "C" void std::exit (int) throw (); using std::exit;
| #endif
| #define STDC_HEADERS 1
| #define HAVE_SYS_TYPES_H 1
| #define HAVE_SYS_STAT_H 1
| #define HAVE_STDLIB_H 1
| #define HAVE_STRING_H 1
| #define HAVE_MEMORY_H 1
| #define HAVE_STRINGS_H 1
| #define HAVE_INTTYPES_H 1
| #define HAVE_STDINT_H 1
| #define HAVE_UNISTD_H 1
| #define HAVE_DLFCN_H 1
| #define STDC_HEADERS 1
| #define HAVE_CSTDLIB 1
| #define HAVE_CSTDIO 1
| #define HAVE_CSTRING 1
| #define HAVE_X11_XLIB_H 1
| #define HAVE_LINUX_INPUT_H 1
| #define HAVE_STDINT_H 1
| #define HAVE_SYS_PARAM_H 1
| #define HAVE_UNISTD_H 1
| #define HAVE_VALUES_H 1
| #define HAVE_SOCKLEN_T 1
| #define HAVE_FF_EFFECT_RUMBLE 1
| #define HAVE_FF_EFFECT_DIRECTIONAL 1
| #define HAVE_LIBM 1
| #define HAVE_ACOSF 1
| #define HAVE_ASINF 1
| #define HAVE_ATAN2F 1
| #define HAVE_ATANF 1
| #define HAVE_COSF 1
| #define HAVE_EXPF 1
| #define HAVE_FABSF 1
| #define HAVE_FLOORF 1
| #define HAVE_FMODF 1
| #define HAVE_HYPOTF 1
| #define HAVE_LOGF 1
| #define HAVE_LOG10F 1
| #define HAVE_POWF 1
| #define HAVE_SINF 1
| #define HAVE_SQRTF 1
| #define HAVE_TANF 1
| #define HAVE_REGEX_H 1
| /* end confdefs.h. */
| #include <OpenGL/gl.h>
| int
| main ()
| {
| glBegin(GL_POINTS)
| ;
| return 0;
| }
configure:23827: g++ -o conftest -g -O2 -L/usr/X11R6/lib conftest.cc -lopengl32 -lXi -lXxf86vm -lXext -lX11 -lm -L/usr/lib -lcurl -L/usr/lib -lgssapi_krb5 -lkrb5 -lk5crypto -lkrb5support -lcom_err -lresolv -L/usr/lib -lgnutls -lidn -ldl -lz >&5
/usr/bin/ld: cannot find -lopengl32
collect2: ld returned 1 exit status
configure:23833: $? = 1
configure: failed program was:
| /* confdefs.h. */
|
| #define PACKAGE_NAME ""
| #define PACKAGE_TARNAME ""
| #define PACKAGE_VERSION ""
| #define PACKAGE_STRING ""
| #define PACKAGE_BUGREPORT ""
| #define PACKAGE "bzflag"
| #define VERSION "2.0.8"
| #define BZ_BUILD_OS "linux-gnu"
| #define BZ_BUILD_USER "tyler"
| #define BUILD_REGEX 1
| #ifdef __cplusplus
| extern "C" void std::exit (int) throw (); using std::exit;
| #endif
| #define STDC_HEADERS 1
| #define HAVE_SYS_TYPES_H 1
| #define HAVE_SYS_STAT_H 1
| #define HAVE_STDLIB_H 1
| #define HAVE_STRING_H 1
| #define HAVE_MEMORY_H 1
| #define HAVE_STRINGS_H 1
| #define HAVE_INTTYPES_H 1
| #define HAVE_STDINT_H 1
| #define HAVE_UNISTD_H 1
| #define HAVE_DLFCN_H 1
| #define STDC_HEADERS 1
| #define HAVE_CSTDLIB 1
| #define HAVE_CSTDIO 1
| #define HAVE_CSTRING 1
| #define HAVE_X11_XLIB_H 1
| #define HAVE_LINUX_INPUT_H 1
| #define HAVE_STDINT_H 1
| #define HAVE_SYS_PARAM_H 1
| #define HAVE_UNISTD_H 1
| #define HAVE_VALUES_H 1
| #define HAVE_SOCKLEN_T 1
| #define HAVE_FF_EFFECT_RUMBLE 1
| #define HAVE_FF_EFFECT_DIRECTIONAL 1
| #define HAVE_LIBM 1
| #define HAVE_ACOSF 1
| #define HAVE_ASINF 1
| #define HAVE_ATAN2F 1
| #define HAVE_ATANF 1
| #define HAVE_COSF 1
| #define HAVE_EXPF 1
| #define HAVE_FABSF 1
| #define HAVE_FLOORF 1
| #define HAVE_FMODF 1
| #define HAVE_HYPOTF 1
| #define HAVE_LOGF 1
| #define HAVE_LOG10F 1
| #define HAVE_POWF 1
| #define HAVE_SINF 1
| #define HAVE_SQRTF 1
| #define HAVE_TANF 1
| #define HAVE_REGEX_H 1
| /* end confdefs.h. */
| #include <GL/gl.h>
| int
| main ()
| {
| glBegin(GL_POINTS)
| ;
| return 0;
| }
configure:23827: g++ -o conftest -g -O2 -L/usr/X11R6/lib conftest.cc -lGL -lXi -lXxf86vm -lXext -lX11 -lm -L/usr/lib -lcurl -L/usr/lib -lgssapi_krb5 -lkrb5 -lk5crypto -lkrb5support -lcom_err -lresolv -L/usr/lib -lgnutls -lidn -ldl -lz >&5
/usr/bin/ld: cannot find -lGL
collect2: ld returned 1 exit status
configure:23833: $? = 1
configure: failed program was:
| /* confdefs.h. */
|
| #define PACKAGE_NAME ""
| #define PACKAGE_TARNAME ""
| #define PACKAGE_VERSION ""
| #define PACKAGE_STRING ""
| #define PACKAGE_BUGREPORT ""
| #define PACKAGE "bzflag"
| #define VERSION "2.0.8"
| #define BZ_BUILD_OS "linux-gnu"
| #define BZ_BUILD_USER "tyler"
| #define BUILD_REGEX 1
| #ifdef __cplusplus
| extern "C" void std::exit (int) throw (); using std::exit;
| #endif
| #define STDC_HEADERS 1
| #define HAVE_SYS_TYPES_H 1
| #define HAVE_SYS_STAT_H 1
| #define HAVE_STDLIB_H 1
| #define HAVE_STRING_H 1
| #define HAVE_MEMORY_H 1
| #define HAVE_STRINGS_H 1
| #define HAVE_INTTYPES_H 1
| #define HAVE_STDINT_H 1
| #define HAVE_UNISTD_H 1
| #define HAVE_DLFCN_H 1
| #define STDC_HEADERS 1
| #define HAVE_CSTDLIB 1
| #define HAVE_CSTDIO 1
| #define HAVE_CSTRING 1
| #define HAVE_X11_XLIB_H 1
| #define HAVE_LINUX_INPUT_H 1
| #define HAVE_STDINT_H 1
| #define HAVE_SYS_PARAM_H 1
| #define HAVE_UNISTD_H 1
| #define HAVE_VALUES_H 1
| #define HAVE_SOCKLEN_T 1
| #define HAVE_FF_EFFECT_RUMBLE 1
| #define HAVE_FF_EFFECT_DIRECTIONAL 1
| #define HAVE_LIBM 1
| #define HAVE_ACOSF 1
| #define HAVE_ASINF 1
| #define HAVE_ATAN2F 1
| #define HAVE_ATANF 1
| #define HAVE_COSF 1
| #define HAVE_EXPF 1
| #define HAVE_FABSF 1
| #define HAVE_FLOORF 1
| #define HAVE_FMODF 1
| #define HAVE_HYPOTF 1
| #define HAVE_LOGF 1
| #define HAVE_LOG10F 1
| #define HAVE_POWF 1
| #define HAVE_SINF 1
| #define HAVE_SQRTF 1
| #define HAVE_TANF 1
| #define HAVE_REGEX_H 1
| /* end confdefs.h. */
| #include <GL/gl.h>
| int
| main ()
| {
| glBegin(GL_POINTS)
| ;
| return 0;
| }
configure:23827: g++ -o conftest -g -O2 -L/usr/X11R6/lib conftest.cc -lGL2 -lXi -lXxf86vm -lXext -lX11 -lm -L/usr/lib -lcurl -L/usr/lib -lgssapi_krb5 -lkrb5 -lk5crypto -lkrb5support -lcom_err -lresolv -L/usr/lib -lgnutls -lidn -ldl -lz >&5
/usr/bin/ld: cannot find -lGL2
collect2: ld returned 1 exit status
configure:23833: $? = 1
configure: failed program was:
| /* confdefs.h. */
|
| #define PACKAGE_NAME ""
| #define PACKAGE_TARNAME ""
| #define PACKAGE_VERSION ""
| #define PACKAGE_STRING ""
| #define PACKAGE_BUGREPORT ""
| #define PACKAGE "bzflag"
| #define VERSION "2.0.8"
| #define BZ_BUILD_OS "linux-gnu"
| #define BZ_BUILD_USER "tyler"
| #define BUILD_REGEX 1
| #ifdef __cplusplus
| extern "C" void std::exit (int) throw (); using std::exit;
| #endif
| #define STDC_HEADERS 1
| #define HAVE_SYS_TYPES_H 1
| #define HAVE_SYS_STAT_H 1
| #define HAVE_STDLIB_H 1
| #define HAVE_STRING_H 1
| #define HAVE_MEMORY_H 1
| #define HAVE_STRINGS_H 1
| #define HAVE_INTTYPES_H 1
| #define HAVE_STDINT_H 1
| #define HAVE_UNISTD_H 1
| #define HAVE_DLFCN_H 1
| #define STDC_HEADERS 1
| #define HAVE_CSTDLIB 1
| #define HAVE_CSTDIO 1
| #define HAVE_CSTRING 1
| #define HAVE_X11_XLIB_H 1
| #define HAVE_LINUX_INPUT_H 1
| #define HAVE_STDINT_H 1
| #define HAVE_SYS_PARAM_H 1
| #define HAVE_UNISTD_H 1
| #define HAVE_VALUES_H 1
| #define HAVE_SOCKLEN_T 1
| #define HAVE_FF_EFFECT_RUMBLE 1
| #define HAVE_FF_EFFECT_DIRECTIONAL 1
| #define HAVE_LIBM 1
| #define HAVE_ACOSF 1
| #define HAVE_ASINF 1
| #define HAVE_ATAN2F 1
| #define HAVE_ATANF 1
| #define HAVE_COSF 1
| #define HAVE_EXPF 1
| #define HAVE_FABSF 1
| #define HAVE_FLOORF 1
| #define HAVE_FMODF 1
| #define HAVE_HYPOTF 1
| #define HAVE_LOGF 1
| #define HAVE_LOG10F 1
| #define HAVE_POWF 1
| #define HAVE_SINF 1
| #define HAVE_SQRTF 1
| #define HAVE_TANF 1
| #define HAVE_REGEX_H 1
| /* end confdefs.h. */
| #include <GL/gl.h>
| int
| main ()
| {
| glBegin(GL_POINTS)
| ;
| return 0;
| }
configure:23969: checking for GLEW library
configure:23990: g++ -o conftest -g -O2 -L/usr/X11R6/lib conftest.cc -lGLEW >&5
conftest.cc:59:21: error: GL/glew.h: No such file or directory
conftest.cc: In function 'int main()':
conftest.cc:63: error: 'glewInit' was not declared in this scope
configure:23996: $? = 1
configure: failed program was:
| /* confdefs.h. */
|
| #define PACKAGE_NAME ""
| #define PACKAGE_TARNAME ""
| #define PACKAGE_VERSION ""
| #define PACKAGE_STRING ""
| #define PACKAGE_BUGREPORT ""
| #define PACKAGE "bzflag"
| #define VERSION "2.0.8"
| #define BZ_BUILD_OS "linux-gnu"
| #define BZ_BUILD_USER "tyler"
| #define BUILD_REGEX 1
| #ifdef __cplusplus
| extern "C" void std::exit (int) throw (); using std::exit;
| #endif
| #define STDC_HEADERS 1
| #define HAVE_SYS_TYPES_H 1
| #define HAVE_SYS_STAT_H 1
| #define HAVE_STDLIB_H 1
| #define HAVE_STRING_H 1
| #define HAVE_MEMORY_H 1
| #define HAVE_STRINGS_H 1
| #define HAVE_INTTYPES_H 1
| #define HAVE_STDINT_H 1
| #define HAVE_UNISTD_H 1
| #define HAVE_DLFCN_H 1
| #define STDC_HEADERS 1
| #define HAVE_CSTDLIB 1
| #define HAVE_CSTDIO 1
| #define HAVE_CSTRING 1
| #define HAVE_X11_XLIB_H 1
| #define HAVE_LINUX_INPUT_H 1
| #define HAVE_STDINT_H 1
| #define HAVE_SYS_PARAM_H 1
| #define HAVE_UNISTD_H 1
| #define HAVE_VALUES_H 1
| #define HAVE_SOCKLEN_T 1
| #define HAVE_FF_EFFECT_RUMBLE 1
| #define HAVE_FF_EFFECT_DIRECTIONAL 1
| #define HAVE_LIBM 1
| #define HAVE_ACOSF 1
| #define HAVE_ASINF 1
| #define HAVE_ATAN2F 1
| #define HAVE_ATANF 1
| #define HAVE_COSF 1
| #define HAVE_EXPF 1
| #define HAVE_FABSF 1
| #define HAVE_FLOORF 1
| #define HAVE_FMODF 1
| #define HAVE_HYPOTF 1
| #define HAVE_LOGF 1
| #define HAVE_LOG10F 1
| #define HAVE_POWF 1
| #define HAVE_SINF 1
| #define HAVE_SQRTF 1
| #define HAVE_TANF 1
| #define HAVE_REGEX_H 1
| /* end confdefs.h. */
| #include <GL/glew.h>
| int
| main ()
| {
| glewInit()
| ;
| return 0;
| }
configure:24028: result: no
configure:24292: checking for ares_init in -lcares
configure:24322: g++ -o conftest -g -O2 -L/usr/X11R6/lib conftest.cc -lcares -lm -L/usr/lib -lcurl -L/usr/lib -lgssapi_krb5 -lkrb5 -lk5crypto -lkrb5support -lcom_err -lresolv -L/usr/lib -lgnutls -lidn -ldl -lz >&5
/usr/bin/ld: cannot find -lcares
collect2: ld returned 1 exit status
configure:24328: $? = 1
configure: failed program was:
| /* confdefs.h. */
|
| #define PACKAGE_NAME ""
| #define PACKAGE_TARNAME ""
| #define PACKAGE_VERSION ""
| #define PACKAGE_STRING ""
| #define PACKAGE_BUGREPORT ""
| #define PACKAGE "bzflag"
| #define VERSION "2.0.8"
| #define BZ_BUILD_OS "linux-gnu"
| #define BZ_BUILD_USER "tyler"
| #define BUILD_REGEX 1
| #ifdef __cplusplus
| extern "C" void std::exit (int) throw (); using std::exit;
| #endif
| #define STDC_HEADERS 1
| #define HAVE_SYS_TYPES_H 1
| #define HAVE_SYS_STAT_H 1
| #define HAVE_STDLIB_H 1
| #define HAVE_STRING_H 1
| #define HAVE_MEMORY_H 1
| #define HAVE_STRINGS_H 1
| #define HAVE_INTTYPES_H 1
| #define HAVE_STDINT_H 1
| #define HAVE_UNISTD_H 1
| #define HAVE_DLFCN_H 1
| #define STDC_HEADERS 1
| #define HAVE_CSTDLIB 1
| #define HAVE_CSTDIO 1
| #define HAVE_CSTRING 1
| #define HAVE_X11_XLIB_H 1
| #define HAVE_LINUX_INPUT_H 1
| #define HAVE_STDINT_H 1
| #define HAVE_SYS_PARAM_H 1
| #define HAVE_UNISTD_H 1
| #define HAVE_VALUES_H 1
| #define HAVE_SOCKLEN_T 1
| #define HAVE_FF_EFFECT_RUMBLE 1
| #define HAVE_FF_EFFECT_DIRECTIONAL 1
| #define HAVE_LIBM 1
| #define HAVE_ACOSF 1
| #define HAVE_ASINF 1
| #define HAVE_ATAN2F 1
| #define HAVE_ATANF 1
| #define HAVE_COSF 1
| #define HAVE_EXPF 1
| #define HAVE_FABSF 1
| #define HAVE_FLOORF 1
| #define HAVE_FMODF 1
| #define HAVE_HYPOTF 1
| #define HAVE_LOGF 1
| #define HAVE_LOG10F 1
| #define HAVE_POWF 1
| #define HAVE_SINF 1
| #define HAVE_SQRTF 1
| #define HAVE_TANF 1
| #define HAVE_REGEX_H 1
| /* end confdefs.h. */
|
| /* Override any gcc2 internal prototype to avoid an error. */
| #ifdef __cplusplus
| extern "C"
| #endif
| /* We use char because int might match the return type of a gcc2
| builtin and then its argument prototype would still apply. */
| char ares_init ();
| int
| main ()
| {
| ares_init ();
| ;
| return 0;
| }
configure:24353: result: no
configure:24372: WARNING: using an internal c-ares lib.
configure:24374: WARNING: Consider installing an updated library at system level
configure:24376: WARNING: link is http://daniel.haxx.se/projects/c-ares/
configure:24397: checking for working ncurses
configure:24422: g++ -o conftest -g -O2 -L/usr/X11R6/lib conftest.cc -lm -L/usr/lib -lcurl -L/usr/lib -lgssapi_krb5 -lkrb5 -lk5crypto -lkrb5support -lcom_err -lresolv -L/usr/lib -lgnutls -lidn -ldl -lz -lncurses >&5
configure:24428: $? = 0
configure:24431: test -z || test ! -s conftest.err
configure:24434: $? = 0
configure:24437: test -s conftest
configure:24440: $? = 0
configure:24452: result: yes
configure:24743: checking for SDL framework
configure:24764: gcc -o conftest -g -O2 -L/usr/X11R6/lib -framework SDL conftest.c -lXi -lXxf86vm -lXext -lX11 -lm -L/usr/lib -lcurl -L/usr/lib -lgssapi_krb5 -lkrb5 -lk5crypto -lkrb5support -lcom_err -lresolv -L/usr/lib -lgnutls -lidn -ldl -lz >&5
gcc: SDL: No such file or directory
cc1: error: unrecognized command line option "-framework"
configure:24770: $? = 1
configure: failed program was:
| /* confdefs.h. */
|
| #define PACKAGE_NAME ""
| #define PACKAGE_TARNAME ""
| #define PACKAGE_VERSION ""
| #define PACKAGE_STRING ""
| #define PACKAGE_BUGREPORT ""
| #define PACKAGE "bzflag"
| #define VERSION "2.0.8"
| #define BZ_BUILD_OS "linux-gnu"
| #define BZ_BUILD_USER "tyler"
| #define BUILD_REGEX 1
| #ifdef __cplusplus
| extern "C" void std::exit (int) throw (); using std::exit;
| #endif
| #define STDC_HEADERS 1
| #define HAVE_SYS_TYPES_H 1
| #define HAVE_SYS_STAT_H 1
| #define HAVE_STDLIB_H 1
| #define HAVE_STRING_H 1
| #define HAVE_MEMORY_H 1
| #define HAVE_STRINGS_H 1
| #define HAVE_INTTYPES_H 1
| #define HAVE_STDINT_H 1
| #define HAVE_UNISTD_H 1
| #define HAVE_DLFCN_H 1
| #define STDC_HEADERS 1
| #define HAVE_CSTDLIB 1
| #define HAVE_CSTDIO 1
| #define HAVE_CSTRING 1
| #define HAVE_X11_XLIB_H 1
| #define HAVE_LINUX_INPUT_H 1
| #define HAVE_STDINT_H 1
| #define HAVE_SYS_PARAM_H 1
| #define HAVE_UNISTD_H 1
| #define HAVE_VALUES_H 1
| #define HAVE_SOCKLEN_T 1
| #define HAVE_FF_EFFECT_RUMBLE 1
| #define HAVE_FF_EFFECT_DIRECTIONAL 1
| #define HAVE_LIBM 1
| #define HAVE_ACOSF 1
| #define HAVE_ASINF 1
| #define HAVE_ATAN2F 1
| #define HAVE_ATANF 1
| #define HAVE_COSF 1
| #define HAVE_EXPF 1
| #define HAVE_FABSF 1
| #define HAVE_FLOORF 1
| #define HAVE_FMODF 1
| #define HAVE_HYPOTF 1
| #define HAVE_LOGF 1
| #define HAVE_LOG10F 1
| #define HAVE_POWF 1
| #define HAVE_SINF 1
| #define HAVE_SQRTF 1
| #define HAVE_TANF 1
| #define HAVE_REGEX_H 1
| #define HAVE_NCURSES_H
| /* end confdefs.h. */
| #include <SDL/SDL_version.h>
| int
| main ()
| {
|
| ;
| return 0;
| }
configure:24793: result: no
configure:24842: checking for sdl-config
configure:24873: result: no
configure:24881: checking for SDL - version >= 1.2.5
configure:25004: result: no
configure:25099: WARNING: could not find an appropriate SDL version. BZflag will build without SDL
configure:25130: checking for SDL_image library
configure:25151: g++ -o conftest -g -O2 -L/usr/X11R6/lib conftest.cc -lSDL_image >&5
conftest.cc:60:27: error: SDL/SDL_image.h: No such file or directory
conftest.cc: In function 'int main()':
conftest.cc:64: error: 'NULL' was not declared in this scope
conftest.cc:64: error: 'IMG_Load' was not declared in this scope
configure:25157: $? = 1
configure: failed program was:
| /* confdefs.h. */
|
| #define PACKAGE_NAME ""
| #define PACKAGE_TARNAME ""
| #define PACKAGE_VERSION ""
| #define PACKAGE_STRING ""
| #define PACKAGE_BUGREPORT ""
| #define PACKAGE "bzflag"
| #define VERSION "2.0.8"
| #define BZ_BUILD_OS "linux-gnu"
| #define BZ_BUILD_USER "tyler"
| #define BUILD_REGEX 1
| #ifdef __cplusplus
| extern "C" void std::exit (int) throw (); using std::exit;
| #endif
| #define STDC_HEADERS 1
| #define HAVE_SYS_TYPES_H 1
| #define HAVE_SYS_STAT_H 1
| #define HAVE_STDLIB_H 1
| #define HAVE_STRING_H 1
| #define HAVE_MEMORY_H 1
| #define HAVE_STRINGS_H 1
| #define HAVE_INTTYPES_H 1
| #define HAVE_STDINT_H 1
| #define HAVE_UNISTD_H 1
| #define HAVE_DLFCN_H 1
| #define STDC_HEADERS 1
| #define HAVE_CSTDLIB 1
| #define HAVE_CSTDIO 1
| #define HAVE_CSTRING 1
| #define HAVE_X11_XLIB_H 1
| #define HAVE_LINUX_INPUT_H 1
| #define HAVE_STDINT_H 1
| #define HAVE_SYS_PARAM_H 1
| #define HAVE_UNISTD_H 1
| #define HAVE_VALUES_H 1
| #define HAVE_SOCKLEN_T 1
| #define HAVE_FF_EFFECT_RUMBLE 1
| #define HAVE_FF_EFFECT_DIRECTIONAL 1
| #define HAVE_LIBM 1
| #define HAVE_ACOSF 1
| #define HAVE_ASINF 1
| #define HAVE_ATAN2F 1
| #define HAVE_ATANF 1
| #define HAVE_COSF 1
| #define HAVE_EXPF 1
| #define HAVE_FABSF 1
| #define HAVE_FLOORF 1
| #define HAVE_FMODF 1
| #define HAVE_HYPOTF 1
| #define HAVE_LOGF 1
| #define HAVE_LOG10F 1
| #define HAVE_POWF 1
| #define HAVE_SINF 1
| #define HAVE_SQRTF 1
| #define HAVE_TANF 1
| #define HAVE_REGEX_H 1
| #define HAVE_NCURSES_H
| /* end confdefs.h. */
| #include <SDL/SDL_image.h>
| int
| main ()
| {
| IMG_Load(NULL)
| ;
| return 0;
| }
configure:25189: result: no
configure:25230: WARNING: Client build has been requested, but GL is not fully available (missing gl.h)
... disabling client generation
configure:25467: checking if the compiler understands -Wl,-search_paths_first -mdynamic-no-pic
configure:25488: g++ -o conftest -g -O2 -ffast-math -fno-exceptions -fsigned-char -Wall -W -Wshadow -L/usr/X11R6/lib -Wl,-search_paths_first -mdynamic-no-pic conftest.cc -lm -L/usr/lib -lcurl -L/usr/lib -lgssapi_krb5 -lkrb5 -lk5crypto -lkrb5support -lcom_err -lresolv -L/usr/lib -lgnutls -lidn -ldl -lz >&5
cc1plus: error: invalid option 'dynamic-no-pic'
configure:25494: $? = 1
configure: failed program was:
| /* confdefs.h. */
|
| #define PACKAGE_NAME ""
| #define PACKAGE_TARNAME ""
| #define PACKAGE_VERSION ""
| #define PACKAGE_STRING ""
| #define PACKAGE_BUGREPORT ""
| #define PACKAGE "bzflag"
| #define VERSION "2.0.8"
| #define BZ_BUILD_OS "linux-gnu"
| #define BZ_BUILD_USER "tyler"
| #define BUILD_REGEX 1
| #ifdef __cplusplus
| extern "C" void std::exit (int) throw (); using std::exit;
| #endif
| #define STDC_HEADERS 1
| #define HAVE_SYS_TYPES_H 1
| #define HAVE_SYS_STAT_H 1
| #define HAVE_STDLIB_H 1
| #define HAVE_STRING_H 1
| #define HAVE_MEMORY_H 1
| #define HAVE_STRINGS_H 1
| #define HAVE_INTTYPES_H 1
| #define HAVE_STDINT_H 1
| #define HAVE_UNISTD_H 1
| #define HAVE_DLFCN_H 1
| #define STDC_HEADERS 1
| #define HAVE_CSTDLIB 1
| #define HAVE_CSTDIO 1
| #define HAVE_CSTRING 1
| #define HAVE_X11_XLIB_H 1
| #define HAVE_LINUX_INPUT_H 1
| #define HAVE_STDINT_H 1
| #define HAVE_SYS_PARAM_H 1
| #define HAVE_UNISTD_H 1
| #define HAVE_VALUES_H 1
| #define HAVE_SOCKLEN_T 1
| #define HAVE_FF_EFFECT_RUMBLE 1
| #define HAVE_FF_EFFECT_DIRECTIONAL 1
| #define HAVE_LIBM 1
| #define HAVE_ACOSF 1
| #define HAVE_ASINF 1
| #define HAVE_ATAN2F 1
| #define HAVE_ATANF 1
| #define HAVE_COSF 1
| #define HAVE_EXPF 1
| #define HAVE_FABSF 1
| #define HAVE_FLOORF 1
| #define HAVE_FMODF 1
| #define HAVE_HYPOTF 1
| #define HAVE_LOGF 1
| #define HAVE_LOG10F 1
| #define HAVE_POWF 1
| #define HAVE_SINF 1
| #define HAVE_SQRTF 1
| #define HAVE_TANF 1
| #define HAVE_REGEX_H 1
| #define HAVE_NCURSES_H
| #define ROBOT 1
| #define SNAPPING 1
| #define INSTALL_DATA_DIR "/usr/local/share/bzflag"
| #define HALF_RATE_AUDIO 1
| #define XF86VIDMODE_EXT 1
| #define NDEBUG 1
| /* end confdefs.h. */
|
| int
| main ()
| {
|
| ;
| return 0;
| }
configure:25517: result: no
configure:25557: checking for CGLGetCurrentContext
configure:25614: g++ -o conftest -g -O2 -ffast-math -fno-exceptions -fsigned-char -Wall -W -Wshadow -L/usr/X11R6/lib conftest.cc -lm -L/usr/lib -lcurl -L/usr/lib -lgssapi_krb5 -lkrb5 -lk5crypto -lkrb5support -lcom_err -lresolv -L/usr/lib -lgnutls -lidn -ldl -lz >&5
/tmp/ccSaLK2U.o: In function `main':/home/tyler/bzflag-2.0.8/conftest.cc:104: undefined reference to `CGLGetCurrentContext'
/tmp/ccSaLK2U.o:(.data+0x0): undefined reference to `CGLGetCurrentContext'
collect2: ld returned 1 exit status
configure:25620: $? = 1
configure: failed program was:
| /* confdefs.h. */
|
| #define PACKAGE_NAME ""
| #define PACKAGE_TARNAME ""
| #define PACKAGE_VERSION ""
| #define PACKAGE_STRING ""
| #define PACKAGE_BUGREPORT ""
| #define PACKAGE "bzflag"
| #define VERSION "2.0.8"
| #define BZ_BUILD_OS "linux-gnu"
| #define BZ_BUILD_USER "tyler"
| #define BUILD_REGEX 1
| #ifdef __cplusplus
| extern "C" void std::exit (int) throw (); using std::exit;
| #endif
| #define STDC_HEADERS 1
| #define HAVE_SYS_TYPES_H 1
| #define HAVE_SYS_STAT_H 1
| #define HAVE_STDLIB_H 1
| #define HAVE_STRING_H 1
| #define HAVE_MEMORY_H 1
| #define HAVE_STRINGS_H 1
| #define HAVE_INTTYPES_H 1
| #define HAVE_STDINT_H 1
| #define HAVE_UNISTD_H 1
| #define HAVE_DLFCN_H 1
| #define STDC_HEADERS 1
| #define HAVE_CSTDLIB 1
| #define HAVE_CSTDIO 1
| #define HAVE_CSTRING 1
| #define HAVE_X11_XLIB_H 1
| #define HAVE_LINUX_INPUT_H 1
| #define HAVE_STDINT_H 1
| #define HAVE_SYS_PARAM_H 1
| #define HAVE_UNISTD_H 1
| #define HAVE_VALUES_H 1
| #define HAVE_SOCKLEN_T 1
| #define HAVE_FF_EFFECT_RUMBLE 1
| #define HAVE_FF_EFFECT_DIRECTIONAL 1
| #define HAVE_LIBM 1
| #define HAVE_ACOSF 1
| #define HAVE_ASINF 1
| #define HAVE_ATAN2F 1
| #define HAVE_ATANF 1
| #define HAVE_COSF 1
| #define HAVE_EXPF 1
| #define HAVE_FABSF 1
| #define HAVE_FLOORF 1
| #define HAVE_FMODF 1
| #define HAVE_HYPOTF 1
| #define HAVE_LOGF 1
| #define HAVE_LOG10F 1
| #define HAVE_POWF 1
| #define HAVE_SINF 1
| #define HAVE_SQRTF 1
| #define HAVE_TANF 1
| #define HAVE_REGEX_H 1
| #define HAVE_NCURSES_H
| #define ROBOT 1
| #define SNAPPING 1
| #define INSTALL_DATA_DIR "/usr/local/share/bzflag"
| #define HALF_RATE_AUDIO 1
| #define XF86VIDMODE_EXT 1
| #define NDEBUG 1
| /* end confdefs.h. */
| /* Define CGLGetCurrentContext to an innocuous variant, in case <limits.h> declares CGLGetCurrentContext.
| For example, HP-UX 11i <limits.h> declares gettimeofday. */
| #define CGLGetCurrentContext innocuous_CGLGetCurrentContext
|
| /* System header to define __stub macros and hopefully few prototypes,
| which can conflict with char CGLGetCurrentContext (); below.
| Prefer <limits.h> to <assert.h> if __STDC__ is defined, since
| <limits.h> exists even on freestanding compilers. */
|
| #ifdef __STDC__
| # include <limits.h>
| #else
| # include <assert.h>
| #endif
|
| #undef CGLGetCurrentContext
|
| /* Override any gcc2 internal prototype to avoid an error. */
| #ifdef __cplusplus
| extern "C"
| {
| #endif
| /* We use char because int might match the return type of a gcc2
| builtin and then its argument prototype would still apply. */
| char CGLGetCurrentContext ();
| /* The GNU C library defines this for functions which it implements
| to always fail with ENOSYS. Some functions are actually named
| something starting with __ and the normal name is an alias. */
| #if defined (__stub_CGLGetCurrentContext) || defined (__stub___CGLGetCurrentContext)
| choke me
| #else
| char (*f) () = CGLGetCurrentContext;
| #endif
| #ifdef __cplusplus
| }
| #endif
|
| int
| main ()
| {
| return f != CGLGetCurrentContext;
| ;
| return 0;
| }
configure:25644: result: no
configure:25557: checking for Sleep
configure:25614: g++ -o conftest -g -O2 -ffast-math -fno-exceptions -fsigned-char -Wall -W -Wshadow -L/usr/X11R6/lib conftest.cc -lm -L/usr/lib -lcurl -L/usr/lib -lgssapi_krb5 -lkrb5 -lk5crypto -lkrb5support -lcom_err -lresolv -L/usr/lib -lgnutls -lidn -ldl -lz >&5
/tmp/cc2jr1Bk.o: In function `main':/home/tyler/bzflag-2.0.8/conftest.cc:104: undefined reference to `Sleep'
/tmp/cc2jr1Bk.o:(.data+0x0): undefined reference to `Sleep'
collect2: ld returned 1 exit status
configure:25620: $? = 1
configure: failed program was:
| /* confdefs.h. */
|
| #define PACKAGE_NAME ""
| #define PACKAGE_TARNAME ""
| #define PACKAGE_VERSION ""
| #define PACKAGE_STRING ""
| #define PACKAGE_BUGREPORT ""
| #define PACKAGE "bzflag"
| #define VERSION "2.0.8"
| #define BZ_BUILD_OS "linux-gnu"
| #define BZ_BUILD_USER "tyler"
| #define BUILD_REGEX 1
| #ifdef __cplusplus
| extern "C" void std::exit (int) throw (); using std::exit;
| #endif
| #define STDC_HEADERS 1
| #define HAVE_SYS_TYPES_H 1
| #define HAVE_SYS_STAT_H 1
| #define HAVE_STDLIB_H 1
| #define HAVE_STRING_H 1
| #define HAVE_MEMORY_H 1
| #define HAVE_STRINGS_H 1
| #define HAVE_INTTYPES_H 1
| #define HAVE_STDINT_H 1
| #define HAVE_UNISTD_H 1
| #define HAVE_DLFCN_H 1
| #define STDC_HEADERS 1
| #define HAVE_CSTDLIB 1
| #define HAVE_CSTDIO 1
| #define HAVE_CSTRING 1
| #define HAVE_X11_XLIB_H 1
| #define HAVE_LINUX_INPUT_H 1
| #define HAVE_STDINT_H 1
| #define HAVE_SYS_PARAM_H 1
| #define HAVE_UNISTD_H 1
| #define HAVE_VALUES_H 1
| #define HAVE_SOCKLEN_T 1
| #define HAVE_FF_EFFECT_RUMBLE 1
| #define HAVE_FF_EFFECT_DIRECTIONAL 1
| #define HAVE_LIBM 1
| #define HAVE_ACOSF 1
| #define HAVE_ASINF 1
| #define HAVE_ATAN2F 1
| #define HAVE_ATANF 1
| #define HAVE_COSF 1
| #define HAVE_EXPF 1
| #define HAVE_FABSF 1
| #define HAVE_FLOORF 1
| #define HAVE_FMODF 1
| #define HAVE_HYPOTF 1
| #define HAVE_LOGF 1
| #define HAVE_LOG10F 1
| #define HAVE_POWF 1
| #define HAVE_SINF 1
| #define HAVE_SQRTF 1
| #define HAVE_TANF 1
| #define HAVE_REGEX_H 1
| #define HAVE_NCURSES_H
| #define ROBOT 1
| #define SNAPPING 1
| #define INSTALL_DATA_DIR "/usr/local/share/bzflag"
| #define HALF_RATE_AUDIO 1
| #define XF86VIDMODE_EXT 1
| #define NDEBUG 1
| /* end confdefs.h. */
| /* Define Sleep to an innocuous variant, in case <limits.h> declares Sleep.
| For example, HP-UX 11i <limits.h> declares gettimeofday. */
| #define Sleep innocuous_Sleep
|
| /* System header to define __stub macros and hopefully few prototypes,
| which can conflict with char Sleep (); below.
| Prefer <limits.h> to <assert.h> if __STDC__ is defined, since
| <limits.h> exists even on freestanding compilers. */
|
| #ifdef __STDC__
| # include <limits.h>
| #else
| # include <assert.h>
| #endif
|
| #undef Sleep
|
| /* Override any gcc2 internal prototype to avoid an error. */
| #ifdef __cplusplus
| extern "C"
| {
| #endif
| /* We use char because int might match the return type of a gcc2
| builtin and then its argument prototype would still apply. */
| char Sleep ();
| /* The GNU C library defines this for functions which it implements
| to always fail with ENOSYS. Some functions are actually named
| something starting with __ and the normal name is an alias. */
| #if defined (__stub_Sleep) || defined (__stub___Sleep)
| choke me
| #else
| char (*f) () = Sleep;
| #endif
| #ifdef __cplusplus
| }
| #endif
|
| int
| main ()
| {
| return f != Sleep;
| ;
| return 0;
| }
configure:25644: result: no
configure:25557: checking for WaitForSingleObject
configure:25614: g++ -o conftest -g -O2 -ffast-math -fno-exceptions -fsigned-char -Wall -W -Wshadow -L/usr/X11R6/lib conftest.cc -lm -L/usr/lib -lcurl -L/usr/lib -lgssapi_krb5 -lkrb5 -lk5crypto -lkrb5support -lcom_err -lresolv -L/usr/lib -lgnutls -lidn -ldl -lz >&5
/tmp/ccwhCNEI.o: In function `main':/home/tyler/bzflag-2.0.8/conftest.cc:104: undefined reference to `WaitForSingleObject'
/tmp/ccwhCNEI.o:(.data+0x0): undefined reference to `WaitForSingleObject'
collect2: ld returned 1 exit status
configure:25620: $? = 1
configure: failed program was:
| /* confdefs.h. */
|
| #define PACKAGE_NAME ""
| #define PACKAGE_TARNAME ""
| #define PACKAGE_VERSION ""
| #define PACKAGE_STRING ""
| #define PACKAGE_BUGREPORT ""
| #define PACKAGE "bzflag"
| #define VERSION "2.0.8"
| #define BZ_BUILD_OS "linux-gnu"
| #define BZ_BUILD_USER "tyler"
| #define BUILD_REGEX 1
| #ifdef __cplusplus
| extern "C" void std::exit (int) throw (); using std::exit;
| #endif
| #define STDC_HEADERS 1
| #define HAVE_SYS_TYPES_H 1
| #define HAVE_SYS_STAT_H 1
| #define HAVE_STDLIB_H 1
| #define HAVE_STRING_H 1
| #define HAVE_MEMORY_H 1
| #define HAVE_STRINGS_H 1
| #define HAVE_INTTYPES_H 1
| #define HAVE_STDINT_H 1
| #define HAVE_UNISTD_H 1
| #define HAVE_DLFCN_H 1
| #define STDC_HEADERS 1
| #define HAVE_CSTDLIB 1
| #define HAVE_CSTDIO 1
| #define HAVE_CSTRING 1
| #define HAVE_X11_XLIB_H 1
| #define HAVE_LINUX_INPUT_H 1
| #define HAVE_STDINT_H 1
| #define HAVE_SYS_PARAM_H 1
| #define HAVE_UNISTD_H 1
| #define HAVE_VALUES_H 1
| #define HAVE_SOCKLEN_T 1
| #define HAVE_FF_EFFECT_RUMBLE 1
| #define HAVE_FF_EFFECT_DIRECTIONAL 1
| #define HAVE_LIBM 1
| #define HAVE_ACOSF 1
| #define HAVE_ASINF 1
| #define HAVE_ATAN2F 1
| #define HAVE_ATANF 1
| #define HAVE_COSF 1
| #define HAVE_EXPF 1
| #define HAVE_FABSF 1
| #define HAVE_FLOORF 1
| #define HAVE_FMODF 1
| #define HAVE_HYPOTF 1
| #define HAVE_LOGF 1
| #define HAVE_LOG10F 1
| #define HAVE_POWF 1
| #define HAVE_SINF 1
| #define HAVE_SQRTF 1
| #define HAVE_TANF 1
| #define HAVE_REGEX_H 1
| #define HAVE_NCURSES_H
| #define ROBOT 1
| #define SNAPPING 1
| #define INSTALL_DATA_DIR "/usr/local/share/bzflag"
| #define HALF_RATE_AUDIO 1
| #define XF86VIDMODE_EXT 1
| #define NDEBUG 1
| /* end confdefs.h. */
| /* Define WaitForSingleObject to an innocuous variant, in case <limits.h> declares WaitForSingleObject.
| For example, HP-UX 11i <limits.h> declares gettimeofday. */
| #define WaitForSingleObject innocuous_WaitForSingleObject
|
| /* System header to define __stub macros and hopefully few prototypes,
| which can conflict with char WaitForSingleObject (); below.
| Prefer <limits.h> to <assert.h> if __STDC__ is defined, since
| <limits.h> exists even on freestanding compilers. */
|
| #ifdef __STDC__
| # include <limits.h>
| #else
| # include <assert.h>
| #endif
|
| #undef WaitForSingleObject
|
| /* Override any gcc2 internal prototype to avoid an error. */
| #ifdef __cplusplus
| extern "C"
| {
| #endif
| /* We use char because int might match the return type of a gcc2
| builtin and then its argument prototype would still apply. */
| char WaitForSingleObject ();
| /* The GNU C library defines this for functions which it implements
| to always fail with ENOSYS. Some functions are actually named
| something starting with __ and the normal name is an alias. */
| #if defined (__stub_WaitForSingleObject) || defined (__stub___WaitForSingleObject)
| choke me
| #else
| char (*f) () = WaitForSingleObject;
| #endif
| #ifdef __cplusplus
| }
| #endif
|
| int
| main ()
| {
| return f != WaitForSingleObject;
| ;
| return 0;
| }
configure:25644: result: no
configure:25557: checking for _stricmp
configure:25614: g++ -o conftest -g -O2 -ffast-math -fno-exceptions -fsigned-char -Wall -W -Wshadow -L/usr/X11R6/lib conftest.cc -lm -L/usr/lib -lcurl -L/usr/lib -lgssapi_krb5 -lkrb5 -lk5crypto -lkrb5support -lcom_err -lresolv -L/usr/lib -lgnutls -lidn -ldl -lz >&5
/tmp/cc08XKD9.o: In function `main':/home/tyler/bzflag-2.0.8/conftest.cc:104: undefined reference to `_stricmp'
/tmp/cc08XKD9.o:(.data+0x0): undefined reference to `_stricmp'
collect2: ld returned 1 exit status
configure:25620: $? = 1
configure: failed program was:
| /* confdefs.h. */
|
| #define PACKAGE_NAME ""
| #define PACKAGE_TARNAME ""
| #define PACKAGE_VERSION ""
| #define PACKAGE_STRING ""
| #define PACKAGE_BUGREPORT ""
| #define PACKAGE "bzflag"
| #define VERSION "2.0.8"
| #define BZ_BUILD_OS "linux-gnu"
| #define BZ_BUILD_USER "tyler"
| #define BUILD_REGEX 1
| #ifdef __cplusplus
| extern "C" void std::exit (int) throw (); using std::exit;
| #endif
| #define STDC_HEADERS 1
| #define HAVE_SYS_TYPES_H 1
| #define HAVE_SYS_STAT_H 1
| #define HAVE_STDLIB_H 1
| #define HAVE_STRING_H 1
| #define HAVE_MEMORY_H 1
| #define HAVE_STRINGS_H 1
| #define HAVE_INTTYPES_H 1
| #define HAVE_STDINT_H 1
| #define HAVE_UNISTD_H 1
| #define HAVE_DLFCN_H 1
| #define STDC_HEADERS 1
| #define HAVE_CSTDLIB 1
| #define HAVE_CSTDIO 1
| #define HAVE_CSTRING 1
| #define HAVE_X11_XLIB_H 1
| #define HAVE_LINUX_INPUT_H 1
| #define HAVE_STDINT_H 1
| #define HAVE_SYS_PARAM_H 1
| #define HAVE_UNISTD_H 1
| #define HAVE_VALUES_H 1
| #define HAVE_SOCKLEN_T 1
| #define HAVE_FF_EFFECT_RUMBLE 1
| #define HAVE_FF_EFFECT_DIRECTIONAL 1
| #define HAVE_LIBM 1
| #define HAVE_ACOSF 1
| #define HAVE_ASINF 1
| #define HAVE_ATAN2F 1
| #define HAVE_ATANF 1
| #define HAVE_COSF 1
| #define HAVE_EXPF 1
| #define HAVE_FABSF 1
| #define HAVE_FLOORF 1
| #define HAVE_FMODF 1
| #define HAVE_HYPOTF 1
| #define HAVE_LOGF 1
| #define HAVE_LOG10F 1
| #define HAVE_POWF 1
| #define HAVE_SINF 1
| #define HAVE_SQRTF 1
| #define HAVE_TANF 1
| #define HAVE_REGEX_H 1
| #define HAVE_NCURSES_H
| #define ROBOT 1
| #define SNAPPING 1
| #define INSTALL_DATA_DIR "/usr/local/share/bzflag"
| #define HALF_RATE_AUDIO 1
| #define XF86VIDMODE_EXT 1
| #define NDEBUG 1
| /* end confdefs.h. */
| /* Define _stricmp to an innocuous variant, in case <limits.h> declares _stricmp.
| For example, HP-UX 11i <limits.h> declares gettimeofday. */
| #define _stricmp innocuous__stricmp
|
| /* System header to define __stub macros and hopefully few prototypes,
| which can conflict with char _stricmp (); below.
| Prefer <limits.h> to <assert.h> if __STDC__ is defined, since
| <limits.h> exists even on freestanding compilers. */
|
| #ifdef __STDC__
| # include <limits.h>
| #else
| # include <assert.h>
| #endif
|
| #undef _stricmp
|
| /* Override any gcc2 internal prototype to avoid an error. */
| #ifdef __cplusplus
| extern "C"
| {
| #endif
| /* We use char because int might match the return type of a gcc2
| builtin and then its argument prototype would still apply. */
| char _stricmp ();
| /* The GNU C library defines this for functions which it implements
| to always fail with ENOSYS. Some functions are actually named
| something starting with __ and the normal name is an alias. */
| #if defined (__stub__stricmp) || defined (__stub____stricmp)
| choke me
| #else
| char (*f) () = _stricmp;
| #endif
| #ifdef __cplusplus
| }
| #endif
|
| int
| main ()
| {
| return f != _stricmp;
| ;
| return 0;
| }
configure:25644: result: no
configure:25557: checking for _strnicmp
configure:25614: g++ -o conftest -g -O2 -ffast-math -fno-exceptions -fsigned-char -Wall -W -Wshadow -L/usr/X11R6/lib conftest.cc -lm -L/usr/lib -lcurl -L/usr/lib -lgssapi_krb5 -lkrb5 -lk5crypto -lkrb5support -lcom_err -lresolv -L/usr/lib -lgnutls -lidn -ldl -lz >&5
/tmp/ccgg0Nzf.o: In function `main':/home/tyler/bzflag-2.0.8/conftest.cc:104: undefined reference to `_strnicmp'
/tmp/ccgg0Nzf.o:(.data+0x0): undefined reference to `_strnicmp'
collect2: ld returned 1 exit status
configure:25620: $? = 1
configure: failed program was:
| /* confdefs.h. */
|
| #define PACKAGE_NAME ""
| #define PACKAGE_TARNAME ""
| #define PACKAGE_VERSION ""
| #define PACKAGE_STRING ""
| #define PACKAGE_BUGREPORT ""
| #define PACKAGE "bzflag"
| #define VERSION "2.0.8"
| #define BZ_BUILD_OS "linux-gnu"
| #define BZ_BUILD_USER "tyler"
| #define BUILD_REGEX 1
| #ifdef __cplusplus
| extern "C" void std::exit (int) throw (); using std::exit;
| #endif
| #define STDC_HEADERS 1
| #define HAVE_SYS_TYPES_H 1
| #define HAVE_SYS_STAT_H 1
| #define HAVE_STDLIB_H 1
| #define HAVE_STRING_H 1
| #define HAVE_MEMORY_H 1
| #define HAVE_STRINGS_H 1
| #define HAVE_INTTYPES_H 1
| #define HAVE_STDINT_H 1
| #define HAVE_UNISTD_H 1
| #define HAVE_DLFCN_H 1
| #define STDC_HEADERS 1
| #define HAVE_CSTDLIB 1
| #define HAVE_CSTDIO 1
| #define HAVE_CSTRING 1
| #define HAVE_X11_XLIB_H 1
| #define HAVE_LINUX_INPUT_H 1
| #define HAVE_STDINT_H 1
| #define HAVE_SYS_PARAM_H 1
| #define HAVE_UNISTD_H 1
| #define HAVE_VALUES_H 1
| #define HAVE_SOCKLEN_T 1
| #define HAVE_FF_EFFECT_RUMBLE 1
| #define HAVE_FF_EFFECT_DIRECTIONAL 1
| #define HAVE_LIBM 1
| #define HAVE_ACOSF 1
| #define HAVE_ASINF 1
| #define HAVE_ATAN2F 1
| #define HAVE_ATANF 1
| #define HAVE_COSF 1
| #define HAVE_EXPF 1
| #define HAVE_FABSF 1
| #define HAVE_FLOORF 1
| #define HAVE_FMODF 1
| #define HAVE_HYPOTF 1
| #define HAVE_LOGF 1
| #define HAVE_LOG10F 1
| #define HAVE_POWF 1
| #define HAVE_SINF 1
| #define HAVE_SQRTF 1
| #define HAVE_TANF 1
| #define HAVE_REGEX_H 1
| #define HAVE_NCURSES_H
| #define ROBOT 1
| #define SNAPPING 1
| #define INSTALL_DATA_DIR "/usr/local/share/bzflag"
| #define HALF_RATE_AUDIO 1
| #define XF86VIDMODE_EXT 1
| #define NDEBUG 1
| /* end confdefs.h. */
| /* Define _strnicmp to an innocuous variant, in case <limits.h> declares _strnicmp.
| For example, HP-UX 11i <limits.h> declares gettimeofday. */
| #define _strnicmp innocuous__strnicmp
|
| /* System header to define __stub macros and hopefully few prototypes,
| which can conflict with char _strnicmp (); below.
| Prefer <limits.h> to <assert.h> if __STDC__ is defined, since
| <limits.h> exists even on freestanding compilers. */
|
| #ifdef __STDC__
| # include <limits.h>
| #else
| # include <assert.h>
| #endif
|
| #undef _strnicmp
|
| /* Override any gcc2 internal prototype to avoid an error. */
| #ifdef __cplusplus
| extern "C"
| {
| #endif
| /* We use char because int might match the return type of a gcc2
| builtin and then its argument prototype would still apply. */
| char _strnicmp ();
| /* The GNU C library defines this for functions which it implements
| to always fail with ENOSYS. Some functions are actually named
| something starting with __ and the normal name is an alias. */
| #if defined (__stub__strnicmp) || defined (__stub____strnicmp)
| choke me
| #else
| char (*f) () = _strnicmp;
| #endif
| #ifdef __cplusplus
| }
| #endif
|
| int
| main ()
| {
| return f != _strnicmp;
| ;
| return 0;
| }
configure:25644: result: no
configure:25557: checking for _vsnprintf
configure:25614: g++ -o conftest -g -O2 -ffast-math -fno-exceptions -fsigned-char -Wall -W -Wshadow -L/usr/X11R6/lib conftest.cc -lm -L/usr/lib -lcurl -L/usr/lib -lgssapi_krb5 -lkrb5 -lk5crypto -lkrb5support -lcom_err -lresolv -L/usr/lib -lgnutls -lidn -ldl -lz >&5
/tmp/ccsExYFD.o: In function `main':/home/tyler/bzflag-2.0.8/conftest.cc:104: undefined reference to `_vsnprintf'
/tmp/ccsExYFD.o:(.data+0x0): undefined reference to `_vsnprintf'
collect2: ld returned 1 exit status
configure:25620: $? = 1
configure: failed program was:
| /* confdefs.h. */
|
| #define PACKAGE_NAME ""
| #define PACKAGE_TARNAME ""
| #define PACKAGE_VERSION ""
| #define PACKAGE_STRING ""
| #define PACKAGE_BUGREPORT ""
| #define PACKAGE "bzflag"
| #define VERSION "2.0.8"
| #define BZ_BUILD_OS "linux-gnu"
| #define BZ_BUILD_USER "tyler"
| #define BUILD_REGEX 1
| #ifdef __cplusplus
| extern "C" void std::exit (int) throw (); using std::exit;
| #endif
| #define STDC_HEADERS 1
| #define HAVE_SYS_TYPES_H 1
| #define HAVE_SYS_STAT_H 1
| #define HAVE_STDLIB_H 1
| #define HAVE_STRING_H 1
| #define HAVE_MEMORY_H 1
| #define HAVE_STRINGS_H 1
| #define HAVE_INTTYPES_H 1
| #define HAVE_STDINT_H 1
| #define HAVE_UNISTD_H 1
| #define HAVE_DLFCN_H 1
| #define STDC_HEADERS 1
| #define HAVE_CSTDLIB 1
| #define HAVE_CSTDIO 1
| #define HAVE_CSTRING 1
| #define HAVE_X11_XLIB_H 1
| #define HAVE_LINUX_INPUT_H 1
| #define HAVE_STDINT_H 1
| #define HAVE_SYS_PARAM_H 1
| #define HAVE_UNISTD_H 1
| #define HAVE_VALUES_H 1
| #define HAVE_SOCKLEN_T 1
| #define HAVE_FF_EFFECT_RUMBLE 1
| #define HAVE_FF_EFFECT_DIRECTIONAL 1
| #define HAVE_LIBM 1
| #define HAVE_ACOSF 1
| #define HAVE_ASINF 1
| #define HAVE_ATAN2F 1
| #define HAVE_ATANF 1
| #define HAVE_COSF 1
| #define HAVE_EXPF 1
| #define HAVE_FABSF 1
| #define HAVE_FLOORF 1
| #define HAVE_FMODF 1
| #define HAVE_HYPOTF 1
| #define HAVE_LOGF 1
| #define HAVE_LOG10F 1
| #define HAVE_POWF 1
| #define HAVE_SINF 1
| #define HAVE_SQRTF 1
| #define HAVE_TANF 1
| #define HAVE_REGEX_H 1
| #define HAVE_NCURSES_H
| #define ROBOT 1
| #define SNAPPING 1
| #define INSTALL_DATA_DIR "/usr/local/share/bzflag"
| #define HALF_RATE_AUDIO 1
| #define XF86VIDMODE_EXT 1
| #define NDEBUG 1
| /* end confdefs.h. */
| /* Define _vsnprintf to an innocuous variant, in case <limits.h> declares _vsnprintf.
| For example, HP-UX 11i <limits.h> declares gettimeofday. */
| #define _vsnprintf innocuous__vsnprintf
|
| /* System header to define __stub macros and hopefully few prototypes,
| which can conflict with char _vsnprintf (); below.
| Prefer <limits.h> to <assert.h> if __STDC__ is defined, since
| <limits.h> exists even on freestanding compilers. */
|
| #ifdef __STDC__
| # include <limits.h>
| #else
| # include <assert.h>
| #endif
|
| #undef _vsnprintf
|
| /* Override any gcc2 internal prototype to avoid an error. */
| #ifdef __cplusplus
| extern "C"
| {
| #endif
| /* We use char because int might match the return type of a gcc2
| builtin and then its argument prototype would still apply. */
| char _vsnprintf ();
| /* The GNU C library defines this for functions which it implements
| to always fail with ENOSYS. Some functions are actually named
| something starting with __ and the normal name is an alias. */
| #if defined (__stub__vsnprintf) || defined (__stub____vsnprintf)
| choke me
| #else
| char (*f) () = _vsnprintf;
| #endif
| #ifdef __cplusplus
| }
| #endif
|
| int
| main ()
| {
| return f != _vsnprintf;
| ;
| return 0;
| }
configure:25644: result: no
configure:25557: checking for atexit
configure:25614: g++ -o conftest -g -O2 -ffast-math -fno-exceptions -fsigned-char -Wall -W -Wshadow -L/usr/X11R6/lib conftest.cc -lm -L/usr/lib -lcurl -L/usr/lib -lgssapi_krb5 -lkrb5 -lk5crypto -lkrb5support -lcom_err -lresolv -L/usr/lib -lgnutls -lidn -ldl -lz >&5
configure:25620: $? = 0
configure:25623: test -z || test ! -s conftest.err
configure:25626: $? = 0
configure:25629: test -s conftest
configure:25632: $? = 0
configure:25644: result: yes
configure:25557: checking for getrlimit
configure:25614: g++ -o conftest -g -O2 -ffast-math -fno-exceptions -fsigned-char -Wall -W -Wshadow -L/usr/X11R6/lib conftest.cc -lm -L/usr/lib -lcurl -L/usr/lib -lgssapi_krb5 -lkrb5 -lk5crypto -lkrb5support -lcom_err -lresolv -L/usr/lib -lgnutls -lidn -ldl -lz >&5
configure:25620: $? = 0
configure:25623: test -z || test ! -s conftest.err
configure:25626: $? = 0
configure:25629: test -s conftest
configure:25632: $? = 0
configure:25644: result: yes
configure:25557: checking for glXGetCurrentContext
configure:25614: g++ -o conftest -g -O2 -ffast-math -fno-exceptions -fsigned-char -Wall -W -Wshadow -L/usr/X11R6/lib conftest.cc -lm -L/usr/lib -lcurl -L/usr/lib -lgssapi_krb5 -lkrb5 -lk5crypto -lkrb5support -lcom_err -lresolv -L/usr/lib -lgnutls -lidn -ldl -lz >&5
/tmp/cceIz6o2.o: In function `main':/home/tyler/bzflag-2.0.8/conftest.cc:106: undefined reference to `glXGetCurrentContext'
/tmp/cceIz6o2.o:(.data+0x0): undefined reference to `glXGetCurrentContext'
collect2: ld returned 1 exit status
configure:25620: $? = 1
configure: failed program was:
| /* confdefs.h. */
|
| #define PACKAGE_NAME ""
| #define PACKAGE_TARNAME ""
| #define PACKAGE_VERSION ""
| #define PACKAGE_STRING ""
| #define PACKAGE_BUGREPORT ""
| #define PACKAGE "bzflag"
| #define VERSION "2.0.8"
| #define BZ_BUILD_OS "linux-gnu"
| #define BZ_BUILD_USER "tyler"
| #define BUILD_REGEX 1
| #ifdef __cplusplus
| extern "C" void std::exit (int) throw (); using std::exit;
| #endif
| #define STDC_HEADERS 1
| #define HAVE_SYS_TYPES_H 1
| #define HAVE_SYS_STAT_H 1
| #define HAVE_STDLIB_H 1
| #define HAVE_STRING_H 1
| #define HAVE_MEMORY_H 1
| #define HAVE_STRINGS_H 1
| #define HAVE_INTTYPES_H 1
| #define HAVE_STDINT_H 1
| #define HAVE_UNISTD_H 1
| #define HAVE_DLFCN_H 1
| #define STDC_HEADERS 1
| #define HAVE_CSTDLIB 1
| #define HAVE_CSTDIO 1
| #define HAVE_CSTRING 1
| #define HAVE_X11_XLIB_H 1
| #define HAVE_LINUX_INPUT_H 1
| #define HAVE_STDINT_H 1
| #define HAVE_SYS_PARAM_H 1
| #define HAVE_UNISTD_H 1
| #define HAVE_VALUES_H 1
| #define HAVE_SOCKLEN_T 1
| #define HAVE_FF_EFFECT_RUMBLE 1
| #define HAVE_FF_EFFECT_DIRECTIONAL 1
| #define HAVE_LIBM 1
| #define HAVE_ACOSF 1
| #define HAVE_ASINF 1
| #define HAVE_ATAN2F 1
| #define HAVE_ATANF 1
| #define HAVE_COSF 1
| #define HAVE_EXPF 1
| #define HAVE_FABSF 1
| #define HAVE_FLOORF 1
| #define HAVE_FMODF 1
| #define HAVE_HYPOTF 1
| #define HAVE_LOGF 1
| #define HAVE_LOG10F 1
| #define HAVE_POWF 1
| #define HAVE_SINF 1
| #define HAVE_SQRTF 1
| #define HAVE_TANF 1
| #define HAVE_REGEX_H 1
| #define HAVE_NCURSES_H
| #define ROBOT 1
| #define SNAPPING 1
| #define INSTALL_DATA_DIR "/usr/local/share/bzflag"
| #define HALF_RATE_AUDIO 1
| #define XF86VIDMODE_EXT 1
| #define NDEBUG 1
| #define HAVE_ATEXIT 1
| #define HAVE_GETRLIMIT 1
| /* end confdefs.h. */
| /* Define glXGetCurrentContext to an innocuous variant, in case <limits.h> declares glXGetCurrentContext.
| For example, HP-UX 11i <limits.h> declares gettimeofday. */
| #define glXGetCurrentContext innocuous_glXGetCurrentContext
|
| /* System header to define __stub macros and hopefully few prototypes,
| which can conflict with char glXGetCurrentContext (); below.
| Prefer <limits.h> to <assert.h> if __STDC__ is defined, since
| <limits.h> exists even on freestanding compilers. */
|
| #ifdef __STDC__
| # include <limits.h>
| #else
| # include <assert.h>
| #endif
|
| #undef glXGetCurrentContext
|
| /* Override any gcc2 internal prototype to avoid an error. */
| #ifdef __cplusplus
| extern "C"
| {
| #endif
| /* We use char because int might match the return type of a gcc2
| builtin and then its argument prototype would still apply. */
| char glXGetCurrentContext ();
| /* The GNU C library defines this for functions which it implements
| to always fail with ENOSYS. Some functions are actually named
| something starting with __ and the normal name is an alias. */
| #if defined (__stub_glXGetCurrentContext) || defined (__stub___glXGetCurrentContext)
| choke me
| #else
| char (*f) () = glXGetCurrentContext;
| #endif
| #ifdef __cplusplus
| }
| #endif
|
| int
| main ()
| {
| return f != glXGetCurrentContext;
| ;
| return 0;
| }
configure:25644: result: no
configure:25557: checking for select
configure:25614: g++ -o conftest -g -O2 -ffast-math -fno-exceptions -fsigned-char -Wall -W -Wshadow -L/usr/X11R6/lib conftest.cc -lm -L/usr/lib -lcurl -L/usr/lib -lgssapi_krb5 -lkrb5 -lk5crypto -lkrb5support -lcom_err -lresolv -L/usr/lib -lgnutls -lidn -ldl -lz >&5
configure:25620: $? = 0
configure:25623: test -z || test ! -s conftest.err
configure:25626: $? = 0
configure:25629: test -s conftest
configure:25632: $? = 0
configure:25644: result: yes
configure:25557: checking for snooze
configure:25614: g++ -o conftest -g -O2 -ffast-math -fno-exceptions -fsigned-char -Wall -W -Wshadow -L/usr/X11R6/lib conftest.cc -lm -L/usr/lib -lcurl -L/usr/lib -lgssapi_krb5 -lkrb5 -lk5crypto -lkrb5support -lcom_err -lresolv -L/usr/lib -lgnutls -lidn -ldl -lz >&5
/tmp/cco2vpeC.o: In function `main':/home/tyler/bzflag-2.0.8/conftest.cc:107: undefined reference to `snooze'
/tmp/cco2vpeC.o:(.data+0x0): undefined reference to `snooze'
collect2: ld returned 1 exit status
configure:25620: $? = 1
configure: failed program was:
| /* confdefs.h. */
|
| #define PACKAGE_NAME ""
| #define PACKAGE_TARNAME ""
| #define PACKAGE_VERSION ""
| #define PACKAGE_STRING ""
| #define PACKAGE_BUGREPORT ""
| #define PACKAGE "bzflag"
| #define VERSION "2.0.8"
| #define BZ_BUILD_OS "linux-gnu"
| #define BZ_BUILD_USER "tyler"
| #define BUILD_REGEX 1
| #ifdef __cplusplus
| extern "C" void std::exit (int) throw (); using std::exit;
| #endif
| #define STDC_HEADERS 1
| #define HAVE_SYS_TYPES_H 1
| #define HAVE_SYS_STAT_H 1
| #define HAVE_STDLIB_H 1
| #define HAVE_STRING_H 1
| #define HAVE_MEMORY_H 1
| #define HAVE_STRINGS_H 1
| #define HAVE_INTTYPES_H 1
| #define HAVE_STDINT_H 1
| #define HAVE_UNISTD_H 1
| #define HAVE_DLFCN_H 1
| #define STDC_HEADERS 1
| #define HAVE_CSTDLIB 1
| #define HAVE_CSTDIO 1
| #define HAVE_CSTRING 1
| #define HAVE_X11_XLIB_H 1
| #define HAVE_LINUX_INPUT_H 1
| #define HAVE_STDINT_H 1
| #define HAVE_SYS_PARAM_H 1
| #define HAVE_UNISTD_H 1
| #define HAVE_VALUES_H 1
| #define HAVE_SOCKLEN_T 1
| #define HAVE_FF_EFFECT_RUMBLE 1
| #define HAVE_FF_EFFECT_DIRECTIONAL 1
| #define HAVE_LIBM 1
| #define HAVE_ACOSF 1
| #define HAVE_ASINF 1
| #define HAVE_ATAN2F 1
| #define HAVE_ATANF 1
| #define HAVE_COSF 1
| #define HAVE_EXPF 1
| #define HAVE_FABSF 1
| #define HAVE_FLOORF 1
| #define HAVE_FMODF 1
| #define HAVE_HYPOTF 1
| #define HAVE_LOGF 1
| #define HAVE_LOG10F 1
| #define HAVE_POWF 1
| #define HAVE_SINF 1
| #define HAVE_SQRTF 1
| #define HAVE_TANF 1
| #define HAVE_REGEX_H 1
| #define HAVE_NCURSES_H
| #define ROBOT 1
| #define SNAPPING 1
| #define INSTALL_DATA_DIR "/usr/local/share/bzflag"
| #define HALF_RATE_AUDIO 1
| #define XF86VIDMODE_EXT 1
| #define NDEBUG 1
| #define HAVE_ATEXIT 1
| #define HAVE_GETRLIMIT 1
| #define HAVE_SELECT 1
| /* end confdefs.h. */
| /* Define snooze to an innocuous variant, in case <limits.h> declares snooze.
| For example, HP-UX 11i <limits.h> declares gettimeofday. */
| #define snooze innocuous_snooze
|
| /* System header to define __stub macros and hopefully few prototypes,
| which can conflict with char snooze (); below.
| Prefer <limits.h> to <assert.h> if __STDC__ is defined, since
| <limits.h> exists even on freestanding compilers. */
|
| #ifdef __STDC__
| # include <limits.h>
| #else
| # include <assert.h>
| #endif
|
| #undef snooze
|
| /* Override any gcc2 internal prototype to avoid an error. */
| #ifdef __cplusplus
| extern "C"
| {
| #endif
| /* We use char because int might match the return type of a gcc2
| builtin and then its argument prototype would still apply. */
| char snooze ();
| /* The GNU C library defines this for functions which it implements
| to always fail with ENOSYS. Some functions are actually named
| something starting with __ and the normal name is an alias. */
| #if defined (__stub_snooze) || defined (__stub___snooze)
| choke me
| #else
| char (*f) () = snooze;
| #endif
| #ifdef __cplusplus
| }
| #endif
|
| int
| main ()
| {
| return f != snooze;
| ;
| return 0;
| }
configure:25644: result: no
configure:25557: checking for usleep
configure:25614: g++ -o conftest -g -O2 -ffast-math -fno-exceptions -fsigned-char -Wall -W -Wshadow -L/usr/X11R6/lib conftest.cc -lm -L/usr/lib -lcurl -L/usr/lib -lgssapi_krb5 -lkrb5 -lk5crypto -lkrb5support -lcom_err -lresolv -L/usr/lib -lgnutls -lidn -ldl -lz >&5
configure:25620: $? = 0
configure:25623: test -z || test ! -s conftest.err
configure:25626: $? = 0
configure:25629: test -s conftest
configure:25632: $? = 0
configure:25644: result: yes
configure:25557: checking for vsnprintf
configure:25614: g++ -o conftest -g -O2 -ffast-math -fno-exceptions -fsigned-char -Wall -W -Wshadow -L/usr/X11R6/lib conftest.cc -lm -L/usr/lib -lcurl -L/usr/lib -lgssapi_krb5 -lkrb5 -lk5crypto -lkrb5support -lcom_err -lresolv -L/usr/lib -lgnutls -lidn -ldl -lz >&5
configure:25620: $? = 0
configure:25623: test -z || test ! -s conftest.err
configure:25626: $? = 0
configure:25629: test -s conftest
configure:25632: $? = 0
configure:25644: result: yes
configure:25557: checking for wglGetCurrentContext
configure:25614: g++ -o conftest -g -O2 -ffast-math -fno-exceptions -fsigned-char -Wall -W -Wshadow -L/usr/X11R6/lib conftest.cc -lm -L/usr/lib -lcurl -L/usr/lib -lgssapi_krb5 -lkrb5 -lk5crypto -lkrb5support -lcom_err -lresolv -L/usr/lib -lgnutls -lidn -ldl -lz >&5
/tmp/ccIw2tqg.o: In function `main':/home/tyler/bzflag-2.0.8/conftest.cc:109: undefined reference to `wglGetCurrentContext'
/tmp/ccIw2tqg.o:(.data+0x0): undefined reference to `wglGetCurrentContext'
collect2: ld returned 1 exit status
configure:25620: $? = 1
configure: failed program was:
| /* confdefs.h. */
|
| #define PACKAGE_NAME ""
| #define PACKAGE_TARNAME ""
| #define PACKAGE_VERSION ""
| #define PACKAGE_STRING ""
| #define PACKAGE_BUGREPORT ""
| #define PACKAGE "bzflag"
| #define VERSION "2.0.8"
| #define BZ_BUILD_OS "linux-gnu"
| #define BZ_BUILD_USER "tyler"
| #define BUILD_REGEX 1
| #ifdef __cplusplus
| extern "C" void std::exit (int) throw (); using std::exit;
| #endif
| #define STDC_HEADERS 1
| #define HAVE_SYS_TYPES_H 1
| #define HAVE_SYS_STAT_H 1
| #define HAVE_STDLIB_H 1
| #define HAVE_STRING_H 1
| #define HAVE_MEMORY_H 1
| #define HAVE_STRINGS_H 1
| #define HAVE_INTTYPES_H 1
| #define HAVE_STDINT_H 1
| #define HAVE_UNISTD_H 1
| #define HAVE_DLFCN_H 1
| #define STDC_HEADERS 1
| #define HAVE_CSTDLIB 1
| #define HAVE_CSTDIO 1
| #define HAVE_CSTRING 1
| #define HAVE_X11_XLIB_H 1
| #define HAVE_LINUX_INPUT_H 1
| #define HAVE_STDINT_H 1
| #define HAVE_SYS_PARAM_H 1
| #define HAVE_UNISTD_H 1
| #define HAVE_VALUES_H 1
| #define HAVE_SOCKLEN_T 1
| #define HAVE_FF_EFFECT_RUMBLE 1
| #define HAVE_FF_EFFECT_DIRECTIONAL 1
| #define HAVE_LIBM 1
| #define HAVE_ACOSF 1
| #define HAVE_ASINF 1
| #define HAVE_ATAN2F 1
| #define HAVE_ATANF 1
| #define HAVE_COSF 1
| #define HAVE_EXPF 1
| #define HAVE_FABSF 1
| #define HAVE_FLOORF 1
| #define HAVE_FMODF 1
| #define HAVE_HYPOTF 1
| #define HAVE_LOGF 1
| #define HAVE_LOG10F 1
| #define HAVE_POWF 1
| #define HAVE_SINF 1
| #define HAVE_SQRTF 1
| #define HAVE_TANF 1
| #define HAVE_REGEX_H 1
| #define HAVE_NCURSES_H
| #define ROBOT 1
| #define SNAPPING 1
| #define INSTALL_DATA_DIR "/usr/local/share/bzflag"
| #define HALF_RATE_AUDIO 1
| #define XF86VIDMODE_EXT 1
| #define NDEBUG 1
| #define HAVE_ATEXIT 1
| #define HAVE_GETRLIMIT 1
| #define HAVE_SELECT 1
| #define HAVE_USLEEP 1
| #define HAVE_VSNPRINTF 1
| /* end confdefs.h. */
| /* Define wglGetCurrentContext to an innocuous variant, in case <limits.h> declares wglGetCurrentContext.
| For example, HP-UX 11i <limits.h> declares gettimeofday. */
| #define wglGetCurrentContext innocuous_wglGetCurrentContext
|
| /* System header to define __stub macros and hopefully few prototypes,
| which can conflict with char wglGetCurrentContext (); below.
| Prefer <limits.h> to <assert.h> if __STDC__ is defined, since
| <limits.h> exists even on freestanding compilers. */
|
| #ifdef __STDC__
| # include <limits.h>
| #else
| # include <assert.h>
| #endif
|
| #undef wglGetCurrentContext
|
| /* Override any gcc2 internal prototype to avoid an error. */
| #ifdef __cplusplus
| extern "C"
| {
| #endif
| /* We use char because int might match the return type of a gcc2
| builtin and then its argument prototype would still apply. */
| char wglGetCurrentContext ();
| /* The GNU C library defines this for functions which it implements
| to always fail with ENOSYS. Some functions are actually named
| something starting with __ and the normal name is an alias. */
| #if defined (__stub_wglGetCurrentContext) || defined (__stub___wglGetCurrentContext)
| choke me
| #else
| char (*f) () = wglGetCurrentContext;
| #endif
| #ifdef __cplusplus
| }
| #endif
|
| int
| main ()
| {
| return f != wglGetCurrentContext;
| ;
| return 0;
| }
configure:25644: result: no
configure:25663: checking for isnan
configure:25690: g++ -c -g -O2 -ffast-math -fno-exceptions -fsigned-char -Wall -W -Wshadow conftest.cc >&5
conftest.cc: In function 'int main()':
conftest.cc:81: error: 'isnan' is not a member of 'std'
configure:25696: $? = 1
configure: failed program was:
| /* confdefs.h. */
|
| #define PACKAGE_NAME ""
| #define PACKAGE_TARNAME ""
| #define PACKAGE_VERSION ""
| #define PACKAGE_STRING ""
| #define PACKAGE_BUGREPORT ""
| #define PACKAGE "bzflag"
| #define VERSION "2.0.8"
| #define BZ_BUILD_OS "linux-gnu"
| #define BZ_BUILD_USER "tyler"
| #define BUILD_REGEX 1
| #ifdef __cplusplus
| extern "C" void std::exit (int) throw (); using std::exit;
| #endif
| #define STDC_HEADERS 1
| #define HAVE_SYS_TYPES_H 1
| #define HAVE_SYS_STAT_H 1
| #define HAVE_STDLIB_H 1
| #define HAVE_STRING_H 1
| #define HAVE_MEMORY_H 1
| #define HAVE_STRINGS_H 1
| #define HAVE_INTTYPES_H 1
| #define HAVE_STDINT_H 1
| #define HAVE_UNISTD_H 1
| #define HAVE_DLFCN_H 1
| #define STDC_HEADERS 1
| #define HAVE_CSTDLIB 1
| #define HAVE_CSTDIO 1
| #define HAVE_CSTRING 1
| #define HAVE_X11_XLIB_H 1
| #define HAVE_LINUX_INPUT_H 1
| #define HAVE_STDINT_H 1
| #define HAVE_SYS_PARAM_H 1
| #define HAVE_UNISTD_H 1
| #define HAVE_VALUES_H 1
| #define HAVE_SOCKLEN_T 1
| #define HAVE_FF_EFFECT_RUMBLE 1
| #define HAVE_FF_EFFECT_DIRECTIONAL 1
| #define HAVE_LIBM 1
| #define HAVE_ACOSF 1
| #define HAVE_ASINF 1
| #define HAVE_ATAN2F 1
| #define HAVE_ATANF 1
| #define HAVE_COSF 1
| #define HAVE_EXPF 1
| #define HAVE_FABSF 1
| #define HAVE_FLOORF 1
| #define HAVE_FMODF 1
| #define HAVE_HYPOTF 1
| #define HAVE_LOGF 1
| #define HAVE_LOG10F 1
| #define HAVE_POWF 1
| #define HAVE_SINF 1
| #define HAVE_SQRTF 1
| #define HAVE_TANF 1
| #define HAVE_REGEX_H 1
| #define HAVE_NCURSES_H
| #define ROBOT 1
| #define SNAPPING 1
| #define INSTALL_DATA_DIR "/usr/local/share/bzflag"
| #define HALF_RATE_AUDIO 1
| #define XF86VIDMODE_EXT 1
| #define NDEBUG 1
| #define HAVE_ATEXIT 1
| #define HAVE_GETRLIMIT 1
| #define HAVE_SELECT 1
| #define HAVE_USLEEP 1
| #define HAVE_VSNPRINTF 1
| /* end confdefs.h. */
|
| #ifdef HAVE_CMATH
| # include <cmath>
| #endif
|
| int
| main ()
| {
|
| float f = 0.0f;
| std::isnan(f);
|
| ;
| return 0;
| }
configure:25747: g++ -c -g -O2 -ffast-math -fno-exceptions -fsigned-char -Wall -W -Wshadow conftest.cc >&5
configure:25753: $? = 0
configure:25756: test -z || test ! -s conftest.err
configure:25759: $? = 0
configure:25762: test -s conftest.o
configure:25765: $? = 0
configure:25783: result: yes
configure:25814: g++ -c -g -O2 -ffast-math -fno-exceptions -fsigned-char -Wall -W -Wshadow conftest.cc >&5
configure:25820: $? = 0
configure:25823: test -z || test ! -s conftest.err
configure:25826: $? = 0
configure:25829: test -s conftest.o
configure:25832: $? = 0
configure:25866: g++ -c -g -O2 -ffast-math -fno-exceptions -fsigned-char -Wall -W -Wshadow conftest.cc >&5
configure:25872: $? = 0
configure:25875: test -z || test ! -s conftest.err
configure:25878: $? = 0
configure:25881: test -s conftest.o
configure:25884: $? = 0
configure:25919: g++ -c -g -O2 -ffast-math -fno-exceptions -fsigned-char -Wall -W -Wshadow conftest.cc >&5
configure:25925: $? = 0
configure:25928: test -z || test ! -s conftest.err
configure:25931: $? = 0
configure:25934: test -s conftest.o
configure:25937: $? = 0
configure:26273: creating ./config.status
## ---------------------- ##
## Running config.status. ##
## ---------------------- ##
This file was extended by config.status, which was
generated by GNU Autoconf 2.59. Invocation command line was
CONFIG_FILES =
CONFIG_HEADERS =
CONFIG_LINKS =
CONFIG_COMMANDS =
$ ./config.status
on ubuntu-tyler
config.status:909: creating bzflag.info
config.status:909: creating BZFlag.xcode/Makefile
config.status:909: creating Dev-C++/Makefile
config.status:909: creating Makefile
config.status:909: creating bzflag.lsm
config.status:909: creating bzflag.spec
config.status:909: creating data/Makefile
config.status:909: creating data/fonts/Makefile
config.status:909: creating data/l10n/Makefile
config.status:909: creating debian/Makefile
config.status:909: creating doc/Makefile
config.status:909: creating doc/faq/Makefile
config.status:909: creating doc/guide/Commands/Makefile
config.status:909: creating doc/guide/Flags/Makefile
config.status:909: creating doc/guide/Geometry/Makefile
config.status:909: creating doc/guide/Installation/Makefile
config.status:909: creating doc/guide/Makefile
config.status:909: creating doc/guide/Tactics/Makefile
config.status:909: creating doc/howto/Makefile
config.status:909: creating doc/man/Makefile
config.status:909: creating include/Makefile
config.status:909: creating m4/Makefile
config.status:909: creating man/Makefile
config.status:909: creating man/bzadmin.6
config.status:909: creating man/bzflag.6
config.status:909: creating man/bzfs.6
config.status:909: creating man/bzw.5
config.status:909: creating misc/Makefile
config.status:909: creating package/Makefile
config.status:909: creating package/irix/Makefile
config.status:909: creating package/linux/Makefile
config.status:909: creating package/rpm/Makefile
config.status:909: creating package/win32/Makefile
config.status:909: creating package/win32/nsis/Makefile
config.status:909: creating plugins/Makefile
config.status:909: creating plugins/RogueGenocide/Makefile
config.status:909: creating plugins/SAMPLE_PLUGIN/Makefile
config.status:909: creating plugins/airspawn/Makefile
config.status:909: creating plugins/chathistory/Makefile
config.status:909: creating plugins/hiddenAdmin/Makefile
config.status:909: creating plugins/killall/Makefile
config.status:909: creating plugins/logDetail/Makefile
config.status:909: creating plugins/playHistoryTracker/Makefile
config.status:909: creating plugins/python/Makefile
config.status:909: creating plugins/recordmatch/Makefile
config.status:909: creating plugins/shockwaveDeath/Makefile
config.status:909: creating plugins/vocaliser/Makefile
config.status:909: creating plugins/HoldTheFlag/Makefile
config.status:909: creating plugins/nagware/Makefile
config.status:909: creating plugins/doc/Makefile
config.status:909: creating plugins/vc71/Makefile
config.status:909: creating src/3D/Makefile
config.status:909: creating src/Makefile
config.status:909: creating src/bzadmin/Makefile
config.status:909: creating src/bzflag/Makefile
config.status:909: creating src/bzfs/Makefile
config.status:909: creating src/c-ares/Makefile
config.status:909: creating src/common/Makefile
config.status:909: creating src/date/Makefile
config.status:909: creating src/game/Makefile
config.status:909: creating src/geometry/Makefile
config.status:909: creating src/geometry/models/Makefile
config.status:909: creating src/geometry/models/tank/Makefile
config.status:909: creating src/mediafile/Makefile
config.status:909: creating src/net/Makefile
config.status:909: creating src/obstacle/Makefile
config.status:909: creating src/ogl/Makefile
config.status:909: creating src/platform/MacOSX/BZFlag-Info.plist
config.status:909: creating src/platform/MacOSX/Makefile
config.status:909: creating src/platform/Makefile
config.status:909: creating src/regex/Makefile
config.status:909: creating src/scene/Makefile
config.status:909: creating src/zlib/Makefile
config.status:909: creating tools/Makefile
config.status:909: creating tools/TextTool-W32/Makefile
config.status:909: creating tools/TextTool-W32/res/Makefile
config.status:909: creating tools/bzwtransform/Makefile
config.status:909: creating tools/modeltool/Makefile
config.status:909: creating tools/modeltool/vc71/Makefile
config.status:909: creating win32/Makefile
config.status:909: creating win32/VC71/Makefile
config.status:909: creating win32/VC8/Makefile
config.status:975: creating include/config.h
config.status:1381: executing depfiles commands
configure:27748: result:
configure:27750: result: BZFlag-2.0.8.20060528 with the following:
configure:27756: result: curses: -lncurses
configure:27760: result: no SDL!
configure:27770: result: bzadmin
configure:27774: result: no bzflag client binary!
## ---------------- ##
## Cache variables. ##
## ---------------- ##
ac_cv_build=x86_64-unknown-linux-gnu
ac_cv_build_alias=x86_64-unknown-linux-gnu
ac_cv_c_bigendian=no
ac_cv_c_compiler_gnu=yes
ac_cv_c_const=yes
ac_cv_cxx_compiler_gnu=yes
ac_cv_env_CC_set=
ac_cv_env_CC_value=
ac_cv_env_CFLAGS_set=
ac_cv_env_CFLAGS_value=
ac_cv_env_CPPFLAGS_set=
ac_cv_env_CPPFLAGS_value=
ac_cv_env_CPP_set=
ac_cv_env_CPP_value=
ac_cv_env_CXXCPP_set=
ac_cv_env_CXXCPP_value=
ac_cv_env_CXXFLAGS_set=
ac_cv_env_CXXFLAGS_value=
ac_cv_env_CXX_set=
ac_cv_env_CXX_value=
ac_cv_env_F77_set=
ac_cv_env_F77_value=
ac_cv_env_FFLAGS_set=
ac_cv_env_FFLAGS_value=
ac_cv_env_LDFLAGS_set=
ac_cv_env_LDFLAGS_value=
ac_cv_env_build_alias_set=
ac_cv_env_build_alias_value=
ac_cv_env_host_alias_set=
ac_cv_env_host_alias_value=
ac_cv_env_target_alias_set=
ac_cv_env_target_alias_value=
ac_cv_exeext=
ac_cv_f77_compiler_gnu=no
ac_cv_func_CGLGetCurrentContext=no
ac_cv_func_Sleep=no
ac_cv_func_WaitForSingleObject=no
ac_cv_func__stricmp=no
ac_cv_func__strnicmp=no
ac_cv_func__vsnprintf=no
ac_cv_func_atexit=yes
ac_cv_func_connect=yes
ac_cv_func_dlopen=no
ac_cv_func_gethostbyname=yes
ac_cv_func_getrlimit=yes
ac_cv_func_glXGetCurrentContext=no
ac_cv_func_remove=yes
ac_cv_func_select=yes
ac_cv_func_shl_load=no
ac_cv_func_shmat=yes
ac_cv_func_snooze=no
ac_cv_func_usleep=yes
ac_cv_func_vsnprintf=yes
ac_cv_func_wglGetCurrentContext=no
ac_cv_have_x='have_x=yes ac_x_includes= ac_x_libraries=/usr/X11R6/lib'
ac_cv_header_GL_glx_h=no
ac_cv_header_SDL_SDL_h=no
ac_cv_header_X11_Xlib_h=yes
ac_cv_header_bstring_h=no
ac_cv_header_cstdio=yes
ac_cv_header_cstdlib=yes
ac_cv_header_cstring=yes
ac_cv_header_dlfcn_h=yes
ac_cv_header_dsound_h=no
ac_cv_header_inttypes_h=yes
ac_cv_header_linux_input_h=yes
ac_cv_header_memory_h=yes
ac_cv_header_stdc=yes
ac_cv_header_stdint_h=yes
ac_cv_header_stdlib_h=yes
ac_cv_header_string_h=yes
ac_cv_header_strings_h=yes
ac_cv_header_sys_param_h=yes
ac_cv_header_sys_stat_h=yes
ac_cv_header_sys_types_h=yes
ac_cv_header_unistd_h=yes
ac_cv_header_values_h=yes
ac_cv_host=x86_64-unknown-linux-gnu
ac_cv_host_alias=x86_64-unknown-linux-gnu
ac_cv_lib_ICE_IceConnectionNumber=no
ac_cv_lib_Xext_XextAddDisplay=yes
ac_cv_lib_Xi_XListInputDevices=yes
ac_cv_lib_Xxf86vm_XF86VidModeGetAllModeLines=yes
ac_cv_lib_bind_gethostent=no
ac_cv_lib_cares_ares_init=no
ac_cv_lib_dl_dlopen=yes
ac_cv_lib_dld_shl_load=no
ac_cv_lib_m_acosf=yes
ac_cv_lib_m_asinf=yes
ac_cv_lib_m_atan2f=yes
ac_cv_lib_m_atanf=yes
ac_cv_lib_m_cosf=yes
ac_cv_lib_m_expf=yes
ac_cv_lib_m_fabsf=yes
ac_cv_lib_m_floorf=yes
ac_cv_lib_m_fmodf=yes
ac_cv_lib_m_hypotf=yes
ac_cv_lib_m_log10f=yes
ac_cv_lib_m_logf=yes
ac_cv_lib_m_powf=yes
ac_cv_lib_m_sinf=yes
ac_cv_lib_m_sqrtf=yes
ac_cv_lib_m_tanf=yes
ac_cv_lib_socket_gethostent=no
ac_cv_lib_socket_socket=no
ac_cv_lib_z_compress=yes
ac_cv_objext=o
ac_cv_path_SDL_CONFIG=no
ac_cv_path_install='/usr/bin/install -c'
ac_cv_prog_AR=ar
ac_cv_prog_AWK=mawk
ac_cv_prog_CPP='gcc -E'
ac_cv_prog_CXXCPP='g++ -E'
ac_cv_prog_HASPOD2MAN=yes
ac_cv_prog_HASWHOAMI=yes
ac_cv_prog_ac_ct_AR=ar
ac_cv_prog_ac_ct_CC=gcc
ac_cv_prog_ac_ct_CXX=g++
ac_cv_prog_ac_ct_RANLIB=ranlib
ac_cv_prog_ac_ct_STRIP=strip
ac_cv_prog_ac_ct_WINDRES=:
ac_cv_prog_cc_g=yes
ac_cv_prog_cc_stdc=
ac_cv_prog_cxx_g=yes
ac_cv_prog_egrep='grep -E'
ac_cv_prog_f77_g=no
ac_cv_prog_make_make_set=yes
ac_cv_search_glBegin=no
ac_cv_search_gluScaleImage=no
ac_cv_target=x86_64-unknown-linux-gnu
ac_cv_target_alias=x86_64-unknown-linux-gnu
ac_cv_type_socklen_t=yes
am_cv_CC_dependencies_compiler_type=gcc3
am_cv_CXX_dependencies_compiler_type=gcc3
lt_cv_deplibs_check_method=pass_all
lt_cv_dlopen=dlopen
lt_cv_dlopen_libs=-ldl
lt_cv_dlopen_self=yes
lt_cv_dlopen_self_static=no
lt_cv_file_magic_cmd='$MAGIC_CMD'
lt_cv_file_magic_test_file=
lt_cv_ld_reload_flag=-r
lt_cv_objdir=.libs
lt_cv_path_LD=/usr/bin/ld
lt_cv_path_LDCXX='/usr/bin/ld -m elf_x86_64'
lt_cv_path_NM='/usr/bin/nm -B'
lt_cv_path_SED=/bin/sed
lt_cv_prog_compiler_c_o=yes
lt_cv_prog_compiler_c_o_CXX=yes
lt_cv_prog_compiler_rtti_exceptions=no
lt_cv_prog_gnu_ld=yes
lt_cv_prog_gnu_ldcxx=yes
lt_cv_sys_global_symbol_pipe='sed -n -e '\''s/^.*[ ]\([ABCDGIRSTW][ABCDGIRSTW]*\)[ ][ ]*\([_A-Za-z][_A-Za-z0-9]*\)$/\1 \2 \2/p'\'''
lt_cv_sys_global_symbol_to_c_name_address='sed -n -e '\''s/^: \([^ ]*\) $/ {\"\1\", (lt_ptr) 0},/p'\'' -e '\''s/^[BCDEGRST] \([^ ]*\) \([^ ]*\)$/ {"\2", (lt_ptr) \&\2},/p'\'''
lt_cv_sys_global_symbol_to_cdecl='sed -n -e '\''s/^. .* \(.*\)$/extern int \1;/p'\'''
lt_cv_sys_max_cmd_len=32768
lt_lt_cv_prog_compiler_c_o='"yes"'
lt_lt_cv_prog_compiler_c_o_CXX='"yes"'
lt_lt_cv_sys_global_symbol_pipe='"sed -n -e '\''s/^.*[ ]\\([ABCDGIRSTW][ABCDGIRSTW]*\\)[ ][ ]*\\([_A-Za-z][_A-Za-z0-9]*\\)\$/\\1 \\2 \\2/p'\''"'
lt_lt_cv_sys_global_symbol_to_c_name_address='"sed -n -e '\''s/^: \\([^ ]*\\) \$/ {\\\"\\1\\\", (lt_ptr) 0},/p'\'' -e '\''s/^[BCDEGRST] \\([^ ]*\\) \\([^ ]*\\)\$/ {\"\\2\", (lt_ptr) \\&\\2},/p'\''"'
lt_lt_cv_sys_global_symbol_to_cdecl='"sed -n -e '\''s/^. .* \\(.*\\)\$/extern int \\1;/p'\''"'
mp_cv_ncurses=yes
my_cv_curl_vers=7.15.1
## ----------------- ##
## Output variables. ##
## ----------------- ##
ACLOCAL='${SHELL} /home/tyler/bzflag-2.0.8/misc/missing --run aclocal-1.9'
AMDEPBACKSLASH='\'
AMDEP_FALSE='#'
AMDEP_TRUE=''
AMTAR='${SHELL} /home/tyler/bzflag-2.0.8/misc/missing --run tar'
AR='ar'
AR_FLAGS='cru'
AUTOCONF='${SHELL} /home/tyler/bzflag-2.0.8/misc/missing --run autoconf'
AUTOHEADER='${SHELL} /home/tyler/bzflag-2.0.8/misc/missing --run autoheader'
AUTOMAKE='${SHELL} /home/tyler/bzflag-2.0.8/misc/missing --run automake-1.9'
AWK='mawk'
BEOS_FALSE=''
BEOS_TRUE='#'
BUGGY_MIPSPRO_FALSE=''
BUGGY_MIPSPRO_TRUE='#'
BUILDCARES_FALSE='#'
BUILDCARES_TRUE=''
BUILDZLIB_FALSE=''
BUILDZLIB_TRUE='#'
BUILD_PLUGINS_FALSE=''
BUILD_PLUGINS_TRUE='#'
BUILD_REGEX_FALSE='#'
BUILD_REGEX_TRUE=''
BZADMIN_INCLUDED_FALSE='#'
BZADMIN_INCLUDED_TRUE=''
BZFLAG_DATE='2006-05-28'
BZFLAG_VERSION='2.0.8'
CC='gcc'
CCACHE=''
CCDEPMODE='depmode=gcc3'
CFLAGS='-g -O2'
CLIENT_INCLUDED_FALSE=''
CLIENT_INCLUDED_TRUE='#'
CONFIG=''
CPP='gcc -E'
CPPFLAGS=' -Wall -W -Wshadow'
CURL_CFLAGS=''
CURSES_LIB='-lncurses'
CXX='g++'
CXXCPP='g++ -E'
CXXDEPMODE='depmode=gcc3'
CXXFLAGS='-g -O2 -ffast-math -fno-exceptions -fsigned-char'
CYGPATH_W='echo'
DEBUG_FALSE=''
DEBUG_TRUE='#'
DEFS='-DHAVE_CONFIG_H'
DEPDIR='.deps'
ECHO='echo'
ECHO_C=''
ECHO_N='-n'
ECHO_T=''
EGREP='grep -E'
EXEEXT=''
F77=''
FFLAGS=''
GLEW_LIBS=''
GLIBS='-lXi -lXxf86vm -lXext -lX11 '
HASPOD2MAN='yes'
HASPOD2MAN_FALSE='#'
HASPOD2MAN_TRUE=''
HASWHOAMI='yes'
HAVE_CURSES_FALSE='#'
HAVE_CURSES_TRUE=''
HAVE_KRB5_FALSE=''
HAVE_KRB5_TRUE='#'
HAVE_SDL_FALSE=''
HAVE_SDL_TRUE='#'
INSTALL_DATA='${INSTALL} -m 644'
INSTALL_DATA_DIR='/usr/local/share/bzflag'
INSTALL_PROGRAM='${INSTALL}'
INSTALL_SCRIPT='${INSTALL}'
INSTALL_STRIP_PROGRAM='${SHELL} $(install_sh) -c -s'
IRIX_FALSE=''
IRIX_TRUE='#'
KRB5_CFLAGS=''
KRB5_CONFIG='no'
KRB5_LIBS=''
LDFLAGS=' -L/usr/X11R6/lib'
LIBDIR='$(top_srcdir)/lib'
LIBOBJS=''
LIBS='-lm -L/usr/lib -lcurl -L/usr/lib -lgssapi_krb5 -lkrb5 -lk5crypto -lkrb5support -lcom_err -lresolv -L/usr/lib -lgnutls -lidn -ldl -lz '
LIBTOOL='$(SHELL) $(top_builddir)/libtool'
LIBTOOL_DEPS='misc/ltmain.sh'
LINUX_FALSE='#'
LINUX_TRUE=''
LN_S='ln -s'
LTLIBOBJS=''
MACOS_FALSE=''
MACOS_TRUE='#'
MAJOR_VERSION='2'
MAKEINFO='${SHELL} /home/tyler/bzflag-2.0.8/misc/missing --run makeinfo'
MINOR_VERSION='0'
OBJEXT='o'
PACKAGE='bzflag'
PACKAGE_BUGREPORT=''
PACKAGE_NAME=''
PACKAGE_STRING=''
PACKAGE_TARNAME=''
PACKAGE_VERSION=''
PATH_SEPARATOR=':'
PC_FALSE=''
PC_TRUE='#'
PPC_FALSE=''
PPC_TRUE='#'
RANLIB='ranlib'
SDL_CFLAGS=''
SDL_CONFIG='no'
SDL_IMAGE_LIBS=''
SDL_LIBS=''
SET_MAKE=''
SHELL='/bin/sh'
SOLARIS_FALSE=''
SOLARIS_TRUE='#'
STRIP='strip'
VERSION='2.0.8'
WIN32_FALSE=''
WIN32_TRUE='#'
WINDRES=':'
WINPORT=''
X_CFLAGS=''
X_EXTRA_LIBS=''
X_LIBS=' -L/usr/X11R6/lib'
X_PRE_LIBS=''
ac_ct_AR='ar'
ac_ct_CC='gcc'
ac_ct_CXX='g++'
ac_ct_F77=''
ac_ct_RANLIB='ranlib'
ac_ct_STRIP='strip'
ac_ct_WINDRES=':'
am__fastdepCC_FALSE='#'
am__fastdepCC_TRUE=''
am__fastdepCXX_FALSE='#'
am__fastdepCXX_TRUE=''
am__include='include'
am__leading_dot='.'
am__quote=''
am__tar='${AMTAR} chof - "$$tardir"'
am__untar='${AMTAR} xf -'
bindir='${exec_prefix}/bin'
build='x86_64-unknown-linux-gnu'
build_alias=''
build_cpu='x86_64'
build_os='linux-gnu'
build_vendor='unknown'
datadir='${prefix}/share'
desktopdir='/usr/local/share/applications'
exec_prefix='${prefix}'
host='x86_64-unknown-linux-gnu'
host_alias=''
host_cpu='x86_64'
host_os='linux-gnu'
host_vendor='unknown'
includedir='${prefix}/include'
infodir='${prefix}/info'
install_sh='/home/tyler/bzflag-2.0.8/misc/install-sh'
libdir='${exec_prefix}/lib'
libexecdir='${exec_prefix}/libexec'
localstatedir='${prefix}/var'
mandir='${prefix}/man'
mkdir_p='mkdir -p --'
oldincludedir='/usr/include'
prefix='/usr/local'
program_transform_name='s,x,x,'
sbindir='${exec_prefix}/sbin'
sharedstatedir='${prefix}/com'
sysconfdir='${prefix}/etc'
target='x86_64-unknown-linux-gnu'
target_alias=''
target_cpu='x86_64'
target_os='linux-gnu'
target_vendor='unknown'
## ----------- ##
## confdefs.h. ##
## ----------- ##
#define BUILD_REGEX 1
#define BZ_BUILD_OS "linux-gnu"
#define BZ_BUILD_USER "tyler"
#define HALF_RATE_AUDIO 1
#define HAVE_ACOSF 1
#define HAVE_ASINF 1
#define HAVE_ATAN2F 1
#define HAVE_ATANF 1
#define HAVE_ATEXIT 1
#define HAVE_COSF 1
#define HAVE_CSTDIO 1
#define HAVE_CSTDLIB 1
#define HAVE_CSTRING 1
#define HAVE_DLFCN_H 1
#define HAVE_EXPF 1
#define HAVE_FABSF 1
#define HAVE_FF_EFFECT_DIRECTIONAL 1
#define HAVE_FF_EFFECT_RUMBLE 1
#define HAVE_FLOORF 1
#define HAVE_FMODF 1
#define HAVE_GETRLIMIT 1
#define HAVE_HYPOTF 1
#define HAVE_INTTYPES_H 1
#define HAVE_ISNAN 1
#define HAVE_LIBM 1
#define HAVE_LINUX_INPUT_H 1
#define HAVE_LOG10F 1
#define HAVE_LOGF 1
#define HAVE_MEMORY_H 1
#define HAVE_NCURSES_H
#define HAVE_POWF 1
#define HAVE_REGEX_H 1
#define HAVE_SELECT 1
#define HAVE_SINF 1
#define HAVE_SOCKLEN_T 1
#define HAVE_SQRTF 1
#define HAVE_STDINT_H 1
#define HAVE_STDINT_H 1
#define HAVE_STDLIB_H 1
#define HAVE_STD__COUNT 1
#define HAVE_STD__MAX 1
#define HAVE_STD__MIN 1
#define HAVE_STRINGS_H 1
#define HAVE_STRING_H 1
#define HAVE_SYS_PARAM_H 1
#define HAVE_SYS_STAT_H 1
#define HAVE_SYS_TYPES_H 1
#define HAVE_TANF 1
#define HAVE_UNISTD_H 1
#define HAVE_UNISTD_H 1
#define HAVE_USLEEP 1
#define HAVE_VALUES_H 1
#define HAVE_VSNPRINTF 1
#define HAVE_X11_XLIB_H 1
#define INSTALL_DATA_DIR "/usr/local/share/bzflag"
#define NDEBUG 1
#define PACKAGE "bzflag"
#define PACKAGE_BUGREPORT ""
#define PACKAGE_NAME ""
#define PACKAGE_STRING ""
#define PACKAGE_TARNAME ""
#define PACKAGE_VERSION ""
#define ROBOT 1
#define SNAPPING 1
#define STDC_HEADERS 1
#define STDC_HEADERS 1
#define VERSION "2.0.8"
#define XF86VIDMODE_EXT 1
#endif
#ifdef __cplusplus
extern "C" void std::exit (int) throw (); using std::exit;
configure: exit 0