rendered paste bodyld_mipsel/gcc-4.2.0/libgomp/config/posix -I/hoki/ralink/trunk/toolchain_build_mipsel/gcc-4.2.0/libgomp -Wall -Werror -pthread -ftls-model=initial-exec -g -Os -MT time.lo -MD -MP -MF .deps/time.Tpo -c /hoki/ralink/trunk/toolchain_build_mipsel/gcc-4.2.0/libgomp/config/posix/time.c -o time.o >/dev/null 2>&1
if /bin/sh ./libtool --mode=compile /hoki/ralink/trunk/toolchain_build_mipsel/gcc-4.2.0-final/./gcc/xgcc -B/hoki/ralink/trunk/toolchain_build_mipsel/gcc-4.2.0-final/./gcc/ -B/hoki/ralink/trunk/staging_dir_mipsel/mipsel-linux-uclibc/bin/ -B/hoki/ralink/trunk/staging_dir_mipsel/mipsel-linux-uclibc/lib/ -isystem /hoki/ralink/trunk/staging_dir_mipsel/mipsel-linux-uclibc/include -isystem /hoki/ralink/trunk/staging_dir_mipsel/mipsel-linux-uclibc/sys-include -DHAVE_CONFIG_H -I. -I/hoki/ralink/trunk/toolchain_build_mipsel/gcc-4.2.0/libgomp -I. -I/hoki/ralink/trunk/toolchain_build_mipsel/gcc-4.2.0/libgomp/config/posix -I/hoki/ralink/trunk/toolchain_build_mipsel/gcc-4.2.0/libgomp -Wall -Werror -ftls-model=initial-exec -Wc,-pthread -g -Os -MT fortran.lo -MD -MP -MF ".deps/fortran.Tpo" -c -o fortran.lo /hoki/ralink/trunk/toolchain_build_mipsel/gcc-4.2.0/libgomp/fortran.c; \
then mv -f ".deps/fortran.Tpo" ".deps/fortran.Plo"; else rm -f ".deps/fortran.Tpo"; exit 1; fi
/hoki/ralink/trunk/toolchain_build_mipsel/gcc-4.2.0-final/./gcc/xgcc -B/hoki/ralink/trunk/toolchain_build_mipsel/gcc-4.2.0-final/./gcc/ -B/hoki/ralink/trunk/staging_dir_mipsel/mipsel-linux-uclibc/bin/ -B/hoki/ralink/trunk/staging_dir_mipsel/mipsel-linux-uclibc/lib/ -isystem /hoki/ralink/trunk/staging_dir_mipsel/mipsel-linux-uclibc/include -isystem /hoki/ralink/trunk/staging_dir_mipsel/mipsel-linux-uclibc/sys-include -DHAVE_CONFIG_H -I. -I/hoki/ralink/trunk/toolchain_build_mipsel/gcc-4.2.0/libgomp -I. -I/hoki/ralink/trunk/toolchain_build_mipsel/gcc-4.2.0/libgomp/config/posix -I/hoki/ralink/trunk/toolchain_build_mipsel/gcc-4.2.0/libgomp -Wall -Werror -pthread -ftls-model=initial-exec -g -Os -MT fortran.lo -MD -MP -MF .deps/fortran.Tpo -c /hoki/ralink/trunk/toolchain_build_mipsel/gcc-4.2.0/libgomp/fortran.c -fPIC -DPIC -o .libs/fortran.o
/hoki/ralink/trunk/toolchain_build_mipsel/gcc-4.2.0-final/./gcc/xgcc -B/hoki/ralink/trunk/toolchain_build_mipsel/gcc-4.2.0-final/./gcc/ -B/hoki/ralink/trunk/staging_dir_mipsel/mipsel-linux-uclibc/bin/ -B/hoki/ralink/trunk/staging_dir_mipsel/mipsel-linux-uclibc/lib/ -isystem /hoki/ralink/trunk/staging_dir_mipsel/mipsel-linux-uclibc/include -isystem /hoki/ralink/trunk/staging_dir_mipsel/mipsel-linux-uclibc/sys-include -DHAVE_CONFIG_H -I. -I/hoki/ralink/trunk/toolchain_build_mipsel/gcc-4.2.0/libgomp -I. -I/hoki/ralink/trunk/toolchain_build_mipsel/gcc-4.2.0/libgomp/config/posix -I/hoki/ralink/trunk/toolchain_build_mipsel/gcc-4.2.0/libgomp -Wall -Werror -pthread -ftls-model=initial-exec -g -Os -MT fortran.lo -MD -MP -MF .deps/fortran.Tpo -c /hoki/ralink/trunk/toolchain_build_mipsel/gcc-4.2.0/libgomp/fortran.c -o fortran.o >/dev/null 2>&1
/bin/sh ./libtool --mode=link /hoki/ralink/trunk/toolchain_build_mipsel/gcc-4.2.0-final/./gcc/xgcc -B/hoki/ralink/trunk/toolchain_build_mipsel/gcc-4.2.0-final/./gcc/ -B/hoki/ralink/trunk/staging_dir_mipsel/mipsel-linux-uclibc/bin/ -B/hoki/ralink/trunk/staging_dir_mipsel/mipsel-linux-uclibc/lib/ -isystem /hoki/ralink/trunk/staging_dir_mipsel/mipsel-linux-uclibc/include -isystem /hoki/ralink/trunk/staging_dir_mipsel/mipsel-linux-uclibc/sys-include -Wall -Werror -ftls-model=initial-exec -Wc,-pthread -g -Os -Wl,-z,nodlopen -Wl,-O1 -o libgomp.la -rpath /hoki/ralink/trunk/staging_dir_mipsel/mipsel-linux-uclibc/lib -version-info 1:0:0 -Wl,--version-script,/hoki/ralink/trunk/toolchain_build_mipsel/gcc-4.2.0/libgomp/libgomp.map alloc.lo barrier.lo critical.lo env.lo error.lo iter.lo loop.lo ordered.lo parallel.lo sections.lo single.lo team.lo work.lo lock.lo mutex.lo proc.lo sem.lo bar.lo time.lo fortran.lo
/hoki/ralink/trunk/toolchain_build_mipsel/gcc-4.2.0-final/./gcc/xgcc -B/hoki/ralink/trunk/toolchain_build_mipsel/gcc-4.2.0-final/./gcc/ -B/hoki/ralink/trunk/staging_dir_mipsel/mipsel-linux-uclibc/bin/ -B/hoki/ralink/trunk/staging_dir_mipsel/mipsel-linux-uclibc/lib/ -isystem /hoki/ralink/trunk/staging_dir_mipsel/mipsel-linux-uclibc/include -isystem /hoki/ralink/trunk/staging_dir_mipsel/mipsel-linux-uclibc/sys-include -shared .libs/alloc.o .libs/barrier.o .libs/critical.o .libs/env.o .libs/error.o .libs/iter.o .libs/loop.o .libs/ordered.o .libs/parallel.o .libs/sections.o .libs/single.o .libs/team.o .libs/work.o .libs/lock.o .libs/mutex.o .libs/proc.o .libs/sem.o .libs/bar.o .libs/time.o .libs/fortran.o -pthread -Wl,-z -Wl,nodlopen -Wl,-O1 -Wl,--version-script -Wl,/hoki/ralink/trunk/toolchain_build_mipsel/gcc-4.2.0/libgomp/libgomp.map -Wl,-soname -Wl,libgomp.so.1 -o .libs/libgomp.so.1.0.0
/hoki/ralink/trunk/staging_dir_mipsel/mipsel-linux-uclibc/bin/ld: BFD 2.16.1 internal error, aborting at elfxx-mips.c line 7231 in _bfd_mips_elf_relocate_section
/hoki/ralink/trunk/staging_dir_mipsel/mipsel-linux-uclibc/bin/ld: Please report this bug.
collect2: ld returned 1 exit status
make[8]: *** [libgomp.la] Error 1
make[8]: Leaving directory `/hoki/ralink/trunk/toolchain_build_mipsel/gcc-4.2.0-final/mipsel-linux-uclibc/libgomp'
make[7]: *** [all-recursive] Error 1
make[7]: Leaving directory `/hoki/ralink/trunk/toolchain_build_mipsel/gcc-4.2.0-final/mipsel-linux-uclibc/libgomp'
make[6]: *** [all] Error 2
make[6]: Leaving directory `/hoki/ralink/trunk/toolchain_build_mipsel/gcc-4.2.0-final/mipsel-linux-uclibc/libgomp'
make[5]: *** [all-target-libgomp] Error 2
make[5]: Leaving directory `/hoki/ralink/trunk/toolchain_build_mipsel/gcc-4.2.0-final'
make[4]: *** [all] Error 2
make[4]: Leaving directory `/hoki/ralink/trunk/toolchain_build_mipsel/gcc-4.2.0-final'
make[3]: *** [/hoki/ralink/trunk/staging_dir_mipsel/stampfiles/.host_gcc-installed] Error 2
make[3]: Leaving directory `/hoki/ralink/trunk/toolchain/gcc'
make[2]: *** [gcc-install] Error 2
make[2]: Leaving directory `/hoki/ralink/trunk/toolchain'
make[1]: *** [toolchain/install] Error 2
make[1]: Leaving directory `/hoki/ralink/trunk'
make: *** [world] Fehler 2
2191,08s user 258,22s system 95% cpu 42:49,95 total, running make V=99