rendered paste body/usr/local/include/mysql -I/usr/include/openssl -I/usr/local/include/openssl -MT PetHandler.o -MD -MP -MF .deps/PetHandler.Tpo -c -o PetHandler.o PetHandler.cpp
mv -f .deps/PetHandler.Tpo .deps/PetHandler.Po
g++ -DHAVE_CONFIG_H -I. -I../.. -I/usr/include/mysql -I/usr/local/include/mysql -I/usr/include/openssl -I/usr/local/include/openssl -I. -I./../../dep/include -I./../shared -I./../../dep/src/gm -I./../logonserver -I/usr/include/mysql -I/usr/local/include/mysql -I/usr/include/openssl -I/usr/local/include/openssl -MT Player.o -MD -MP -MF .deps/Player.Tpo -c -o Player.o Player.cpp
Player.cpp: In destructor 'virtual Player::~Player()':
Player.cpp:340: error: 'CStackWalker' was not declared in this scope
Player.cpp:340: error: expected `;' before 'sw'
Player.cpp:341: error: 'sw' was not declared in this scope
make[2]: *** [Player.o] Error 1
make[2]: Leaving directory `/home/antrix/antrix_src/src/game'
make[1]: *** [install-recursive] Error 1
make[1]: Leaving directory `/home/antrix/antrix_src/src'
make: *** [install-recursive] Error 1