>>> No ././version_spec_TEST_cleanup.sh to run
>>> exiting with success for test ./version_spec_TEST
PASS: version_spec_TEST
====================
1 of 15 tests failed
====================
make[5]: *** [check-TESTS] Error 1
make[5]: Leaving directory `/var/tmp/portage/sys-apps/paludis-0.24.2/work/paludis-0.24.2/paludis'
make[4]: *** [check-am] Error 2
make[4]: Leaving directory `/var/tmp/portage/sys-apps/paludis-0.24.2/work/paludis-0.24.2/paludis'
make[3]: *** [check-recursive] Error 1
make[3]: Leaving directory `/var/tmp/portage/sys-apps/paludis-0.24.2/work/paludis-0.24.2/paludis'
make[2]: *** [check] Error 2
make[2]: Leaving directory `/var/tmp/portage/sys-apps/paludis-0.24.2/work/paludis-0.24.2/paludis'
make[1]: *** [check-recursive] Error 1
make[1]: Leaving directory `/var/tmp/portage/sys-apps/paludis-0.24.2/work/paludis-0.24.2'
make: *** [check] Error 2
!!! ERROR: sys-apps/paludis-0.24.2 failed.
Call stack:
ebuild.sh, line 1637: Called dyn_test
ebuild.sh, line 1043: Called qa_call 'src_test'
ebuild.sh, line 44: Called src_test
paludis-0.24.2.ebuild, line 112: Called die
!!! Make check failed
!!! If you need support, post the topmost build error, and the call stack if relevant.
!!! A complete build log is located at '/var/tmp/portage/sys-apps/paludis-0.24.2/temp/build.log'.