Untitled
public text v1 · immutablemake[2]: *** [lex.yy.o] Error 1
make[2]: Leaving directory `/var/tmp/portage/wine-0.9.4/work/wine-0.9.4/tools/wrc'
make[1]: *** [wrc] Error 2
make[1]: Leaving directory `/var/tmp/portage/wine-0.9.4/work/wine-0.9.4/tools'
make: *** [tools] Error 2
!!! ERROR: app-emulation/wine-0.9.4 failed.
!!! Function src_compile, Line 137, Exitcode 2
!!! depend
!!! If you need support, post the topmost build error, NOT this status message.