All pastes #591473 Raw Edit

Stuff

public text v1 · immutable
#591473 ·published 2007-06-27 07:25 UTC
rendered paste body
cp: cannot stat `reloc2': No such file or directory
FAIL: reloc2.sh
FAIL: reloc3.sh
/usr/bin/ld: /tmp/cchMRk6z.o: .got subsegment exceeds 64K (size 524288)
/usr/bin/ld: failed to set dynamic section sizes: File format not recognized
collect2: ld returned 1 exit status
gcc: reloc4lib2.so: No such file or directory
gcc: reloc4lib3.so: No such file or directory
cp: cannot stat `reloc4lib2.so': No such file or directory
cp: cannot stat `reloc4lib3.so': No such file or directory
cp: cannot stat `reloc4': No such file or directory
FAIL: reloc4.sh
gcc: reloc4lib3.so: No such file or directory
cp: cannot stat `reloc5': No such file or directory
FAIL: reloc5.sh
./reloc6.sh: line 14: 10855 Aborted                 LD_LIBRARY_PATH=. ./reloc6.nop >> reloc6.log
FAIL: reloc6.sh
FAIL: reloc7.sh
FAIL: reloc8.sh
FAIL: reloc9.sh
FAIL: reloc10.sh
FAIL: reloc11.sh
FAIL: shuffle1.sh
FAIL: shuffle2.sh
FAIL: shuffle3.sh
FAIL: shuffle4.sh
FAIL: shuffle5.sh
FAIL: shuffle6.sh
FAIL: shuffle7.sh
FAIL: shuffle8.sh
FAIL: undo1.sh
FAIL: layout1.sh
FAIL: layout2.sh
FAIL: tls1.sh
FAIL: tls2.sh
FAIL: tls3.sh
FAIL: tls4.sh
FAIL: tls5.sh
FAIL: tls6.sh
FAIL: tls7.sh
FAIL: cxx1.sh
FAIL: quick1.sh
./quick2.sh: line 178: 14163 Aborted                 LD_LIBRARY_PATH=quick2.tree/lib:quick2.tree/usr/lib quick2.tree/usr/bin/bin3
FAIL: quick2.sh
FAIL: quick3.sh
PASS: cycle1.sh
PASS: cycle2.sh
./deps1.sh: line 44: 14483 Segmentation fault      LD_LIBRARY_PATH=deps1.tree/lib deps1.tree/usr/bin/bin1
FAIL: deps1.sh
./deps2.sh: line 44: 14574 Segmentation fault      LD_LIBRARY_PATH=deps2.tree/lib deps2.tree/usr/bin/bin1
FAIL: deps2.sh
FAIL: undosyslibs.sh
=====================
36 of 38 tests failed
=====================
make[3]: *** [check-TESTS] Error 1
make[3]: Leaving directory `/home/oliver/cvs/devel/prelink/prelink/testsuite'
make[2]: *** [check-am] Error 2
make[2]: Leaving directory `/home/oliver/cvs/devel/prelink/prelink/testsuite'
make[1]: *** [check-harder] Error 2
make[1]: Leaving directory `/home/oliver/cvs/devel/prelink/prelink/testsuite'
error: Bad exit status from /var/tmp/rpm-tmp.2035 (%build)