rendered paste bodyi686-pc-linux-gnu-g++ -DSYSCONFDIR=\"/etc\" -DDATADIR=\"/usr/share\" -DLIBEXECDIR=\"/usr/libexec\" -DLIBDIR=\"/usr/lib\" -I. -I.. -I.. -I./ -I../ -DPALUDIS_HASH_IS_STD_TR1_UNORDERED=1 -DPALUDIS_TR1_MEMORY_IS_STD_TR1=1 -DPALUDIS_TR1_TYPE_TRAITS_IS_STD_TR1=1 -DPALUDIS_TR1_FUNCTIONAL_IS_STD_TR1=1 -Wall -Wextra -Wold-style-cast -Wredundant-decls -Wstrict-null-sentinel -Wmissing-noreturn -Woverloaded-virtual -Winit-self -Wunused -Wunused-function -Wshadow -Wno-redundant-decls -Wno-old-style-cast -I. -I/usr/lib/ruby/site_ruby/1.8/i686-linux -I/usr/lib/ruby/1.8/i686-linux -O2 -mcpu=i686 -pipe -MT libpaludisruby_la-paludis_ruby.lo -MD -MP -MF .deps/libpaludisruby_la-paludis_ruby.Tpo -c paludis_ruby.cc -fPIC -DPIC -o .libs/libpaludisruby_la-paludis_ruby.o
`-mcpu=' is deprecated. Use `-mtune=' or '-march=' instead.
i686-pc-linux-gnu-g++ -DSYSCONFDIR=\"/etc\" -DDATADIR=\"/usr/share\" -DLIBEXECDIR=\"/usr/libexec\" -DLIBDIR=\"/usr/lib\" -I. -I.. -I.. -I./ -I../ -DPALUDIS_HASH_IS_STD_TR1_UNORDERED=1 -DPALUDIS_TR1_MEMORY_IS_STD_TR1=1 -DPALUDIS_TR1_TYPE_TRAITS_IS_STD_TR1=1 -DPALUDIS_TR1_FUNCTIONAL_IS_STD_TR1=1 -Wall -Wextra -Wold-style-cast -Wredundant-decls -Wstrict-null-sentinel -Wmissing-noreturn -Woverloaded-virtual -Winit-self -Wunused -Wunused-function -Wshadow -Wno-redundant-decls -Wno-old-style-cast -I. -I/usr/lib/ruby/site_ruby/1.8/i686-linux -I/usr/lib/ruby/1.8/i686-linux -O2 -mcpu=i686 -pipe -MT libpaludisruby_la-environment.lo -MD -MP -MF .deps/libpaludisruby_la-environment.Tpo -c environment.cc -fPIC -DPIC -o .libs/libpaludisruby_la-environment.o
`-mcpu=' is deprecated. Use `-mtune=' or '-march=' instead.
./paludis_ruby.hh: In static member function 'static VALUE paludis::ruby::Common<T_>::to_s(VALUE) [with T_ = paludis::PackageDatabaseEntry]':
package_database_entry.cc:208: instantiated from here
./paludis_ruby.hh:173: error: 'stringify' was not declared in this scope
package_database_entry.cc: In static member function 'static VALUE<unnamed>::EntryValue<T_, m_>::fetch(VALUE) [with T_ = paludis::Validated<std::basic_string<char, std::char_traits<char>, std::allocator<char> >, paludis::RepositoryNameValidator, false>, T_ paludis::PackageDatabaseEntry::* m_ = &paludis::PackageDatabaseEntry::repository]':
package_database_entry.cc:213: instantiated from here
package_database_entry.cc:177: error: 'stringify' was not declared in this scope
make[3]: *** [libpaludisruby_la-package_database_entry.lo] Error 1
make[3]: *** Waiting for unfinished jobs....
mv -f .deps/libpaludisruby_la-environment.Tpo .deps/libpaludisruby_la-environment.Plo
mv -f .deps/libpaludisruby_la-paludis_ruby.Tpo .deps/libpaludisruby_la-paludis_ruby.Plo
make[3]: Leaving directory `/var/tmp/paludis/sys-apps/paludis-scm/work/paludis-scm/ruby'
make[2]: *** [all-recursive] Error 1
make[2]: Leaving directory `/var/tmp/paludis/sys-apps/paludis-scm/work/paludis-scm/ruby'
make[1]: *** [all-recursive] Error 1
make[1]: Leaving directory `/var/tmp/paludis/sys-apps/paludis-scm/work/paludis-scm'
make: *** [all] Error 2
!!! ERROR in sys-apps/paludis-scm:
!!! In src_compile at line 3503
!!! emake failed
!!! Call stack:
!!! * src_compile (/var/tmp/paludis/sys-apps/paludis-scm/temp/loadsaveenv:3503)
!!! * ebuild_f_compile (/usr/libexec/paludis/src_compile.bash:51)
!!! * ebuild_main (/usr/libexec/paludis/ebuild.bash:405)
!!! * main (/usr/libexec/paludis/ebuild.bash:423)
die trap: exiting with error.
Install error:
* In program paludis --log-level qa --dl-deps-default discard --install =sys-apps/paludis-scm::paludis-overlay --add-to-world-spec ( sys-apps/paludis ):
* When performing install action from command line:
* When executing install task:
* When installing 'sys-apps/paludis-scm':
* Install error: Install failed for 'sys-apps/paludis-scm::paludis-overlay'