rendered paste body(KDE4)whirm@sphynx:~/src/kde4/build/KDE/kdepim$ cmakekde
-- Found Qt-Version 4.3.0
-- Found X11: /usr/lib/libX11.so
-- Found KDE 4.0 include dir: /home/whirm/src/kde4/include
-- Found KDE 4 library dir: /home/whirm/src/kde4/lib
-- Found KDE4 kconfig_compiler preprocessor: /home/whirm/src/kde4/bin/kconfig_compiler
-- Found KDE PIM libraries
-- Found Strigi: /home/whirm/src/kde4/lib/libstreamanalyzer.so
-- Found Strigi: /home/whirm/src/kde4/lib/libstreams.so
-- Make sure Strigi is a recent SVN version!
-- ** svn://anonsvn.kde.org/home/kde/trunk/kdesupport/strigi
-- Found gpgme-config
-- Found gpgme.
-- Found sasl2: /usr/lib/libsasl2.so
-- Found MySQL: /usr/include/mysql, /usr/lib/libmysqlclient.so
-- Found MySQL Embedded: /usr/include/mysql, /usr/lib/mysql/libmysqld.a
-- Found Plasma: /home/whirm/src/kde4/lib/libplasma.so
-- Found Nepomuk: /home/whirm/src/kde4/lib/libnepomuk.so;/home/whirm/src/kde4/lib/libnepomuk-middleware.so
-- Remember to port the vcf strigi-plugin
-- Newsticker Kontact plugins disabled.
-- KWeather plugins will not compile. Kdetoys must be installed before compiling it
-- /home/whirm/src/kde4/src/KDE/kdepim/kmobiletools: skipped subdir $(KIOSLAVES_DIR)
-- /home/whirm/src/kde4/src/KDE/kdepim/kmobiletools: skipped subdir $(TEST_DIR)
-- Could not find pilot-link (pi-dlp.h)
-- Could not find pilot-link (libpisock.so)
-- Could not find libmal.h
-- Could not find libmal
-- GroupWise resources are disabled.
-- disabled networkstatus
-- GroupWise wizard disabled.
--
----------------------------------------------------------------------------------
-- The following list of OPTIONAL packages were located on your system. --
-- You will have all the following features available from this software. --
----------------------------------------------------------------------------------
+ libXss
+ gpgme
+ cyrus-sasl
+ mysql-embedded
+ xsltproc
+ boost
+ plasma
----------------------------------------------------------------------------------
-- The following list of OPTIONAL packages could NOT be located on your system. --
-- Consider installing them to enable more features from this software. --
----------------------------------------------------------------------------------
+ gnokii: Gnokii Development Libraries <http://www.gnokii.org>
Needed to provide the ability to import and export KDE addressbook entries to/from mobile phones that are accessible via gnokii
+ opensync, 0.19 or greater: OpenSync Development Libraries <http://www.opensync.org>
Needed to provide synching applications from KDE PIM applications. Necessary to compile kitchensync and other PIM applications.
+ osengine, 0.19 or greater: OpenSync Engine Development Libraries <http://www.opensync.org>
Needed to provide synching applications from KDE PIM applications. Necessary to compile kitchensync and other PIM applications.
+ libmapi: OpenChange MAPI Client Library <http://www.openchange.org>
Needed to support OpenChange / Exchange servers
+ pilot-link, 0.12: Pilot-link Development Library <http://www.pilot-link.org/>
Needed for KPilot.
+ libmal, 0.40: libmal Development Library <http://jasonday.home.att.net/code/libmal>
Needed for KPilot's Avantgo conduit.
-- Configuring done
-- Generating done
-- Build files have been written to: /home/whirm/src/kde4/build/KDE/kdepim
makeobj[0]: Entering directory `/home/whirm/src/kde4/build/KDE/kdepim'
/usr/bin/cmake -H/home/whirm/src/kde4/src/KDE/kdepim -B/home/whirm/src/kde4/build/KDE/kdepim --check-build-system CMakeFiles/Makefile.cmake 0
/usr/bin/cmake -E cmake_progress_start /home/whirm/src/kde4/build/KDE/kdepim/CMakeFiles 92
/usr/bin/make -f CMakeFiles/Makefile2 all
make[1]: Entering directory `/home/whirm/src/kde4/build/KDE/kdepim'
/usr/bin/make -f kode/libkode/CMakeFiles/kode.dir/build.make kode/libkode/CMakeFiles/kode.dir/depend
make[2]: Entering directory `/home/whirm/src/kde4/build/KDE/kdepim'
make[2]: Nothing to be done for `kode/libkode/CMakeFiles/kode.dir/depend'.
make[2]: Leaving directory `/home/whirm/src/kde4/build/KDE/kdepim'
/usr/bin/make -f kode/libkode/CMakeFiles/kode.dir/build.make kode/libkode/CMakeFiles/kode.dir/build
make[2]: Entering directory `/home/whirm/src/kde4/build/KDE/kdepim'
make[2]: Nothing to be done for `kode/libkode/CMakeFiles/kode.dir/build'.
make[2]: Leaving directory `/home/whirm/src/kde4/build/KDE/kdepim'
/usr/bin/cmake -E cmake_progress_report /home/whirm/src/kde4/build/KDE/kdepim/CMakeFiles
[ 0%] Built target kode
/usr/bin/make -f kode/CMakeFiles/kode_bin.dir/build.make kode/CMakeFiles/kode_bin.dir/depend
make[2]: Entering directory `/home/whirm/src/kde4/build/KDE/kdepim'
make[2]: Nothing to be done for `kode/CMakeFiles/kode_bin.dir/depend'.
make[2]: Leaving directory `/home/whirm/src/kde4/build/KDE/kdepim'
/usr/bin/make -f kode/CMakeFiles/kode_bin.dir/build.make kode/CMakeFiles/kode_bin.dir/build
make[2]: Entering directory `/home/whirm/src/kde4/build/KDE/kdepim'
make[2]: Nothing to be done for `kode/CMakeFiles/kode_bin.dir/build'.
make[2]: Leaving directory `/home/whirm/src/kde4/build/KDE/kdepim'
/usr/bin/cmake -E cmake_progress_report /home/whirm/src/kde4/build/KDE/kdepim/CMakeFiles
[ 0%] Built target kode_bin
/usr/bin/make -f kode/libkode/tests/CMakeFiles/nestedclasses_test.dir/build.make kode/libkode/tests/CMakeFiles/nestedclasses_test.dir/depend
make[2]: Entering directory `/home/whirm/src/kde4/build/KDE/kdepim'
make[2]: Nothing to be done for `kode/libkode/tests/CMakeFiles/nestedclasses_test.dir/depend'.
make[2]: Leaving directory `/home/whirm/src/kde4/build/KDE/kdepim'
/usr/bin/make -f kode/libkode/tests/CMakeFiles/nestedclasses_test.dir/build.make kode/libkode/tests/CMakeFiles/nestedclasses_test.dir/build
make[2]: Entering directory `/home/whirm/src/kde4/build/KDE/kdepim'
make[2]: Nothing to be done for `kode/libkode/tests/CMakeFiles/nestedclasses_test.dir/build'.
make[2]: Leaving directory `/home/whirm/src/kde4/build/KDE/kdepim'
/usr/bin/cmake -E cmake_progress_report /home/whirm/src/kde4/build/KDE/kdepim/CMakeFiles
[ 0%] Built target nestedclasses_test
/usr/bin/make -f kode/common/CMakeFiles/kxmlcommon.dir/build.make kode/common/CMakeFiles/kxmlcommon.dir/depend
make[2]: Entering directory `/home/whirm/src/kde4/build/KDE/kdepim'
make[2]: Nothing to be done for `kode/common/CMakeFiles/kxmlcommon.dir/depend'.
make[2]: Leaving directory `/home/whirm/src/kde4/build/KDE/kdepim'
/usr/bin/make -f kode/common/CMakeFiles/kxmlcommon.dir/build.make kode/common/CMakeFiles/kxmlcommon.dir/build
make[2]: Entering directory `/home/whirm/src/kde4/build/KDE/kdepim'
make[2]: Nothing to be done for `kode/common/CMakeFiles/kxmlcommon.dir/build'.
make[2]: Leaving directory `/home/whirm/src/kde4/build/KDE/kdepim'
/usr/bin/cmake -E cmake_progress_report /home/whirm/src/kde4/build/KDE/kdepim/CMakeFiles
[ 0%] Built target kxmlcommon
/usr/bin/make -f kode/schema/CMakeFiles/schema.dir/build.make kode/schema/CMakeFiles/schema.dir/depend
make[2]: Entering directory `/home/whirm/src/kde4/build/KDE/kdepim'
make[2]: Nothing to be done for `kode/schema/CMakeFiles/schema.dir/depend'.
make[2]: Leaving directory `/home/whirm/src/kde4/build/KDE/kdepim'
/usr/bin/make -f kode/schema/CMakeFiles/schema.dir/build.make kode/schema/CMakeFiles/schema.dir/build
make[2]: Entering directory `/home/whirm/src/kde4/build/KDE/kdepim'
make[2]: Nothing to be done for `kode/schema/CMakeFiles/schema.dir/build'.
make[2]: Leaving directory `/home/whirm/src/kde4/build/KDE/kdepim'
/usr/bin/cmake -E cmake_progress_report /home/whirm/src/kde4/build/KDE/kdepim/CMakeFiles 1
[ 1%] Built target schema
/usr/bin/make -f kode/schema/CMakeFiles/schematest.dir/build.make kode/schema/CMakeFiles/schematest.dir/depend
make[2]: Entering directory `/home/whirm/src/kde4/build/KDE/kdepim'
make[2]: Nothing to be done for `kode/schema/CMakeFiles/schematest.dir/depend'.
make[2]: Leaving directory `/home/whirm/src/kde4/build/KDE/kdepim'
/usr/bin/make -f kode/schema/CMakeFiles/schematest.dir/build.make kode/schema/CMakeFiles/schematest.dir/build
make[2]: Entering directory `/home/whirm/src/kde4/build/KDE/kdepim'
make[2]: Nothing to be done for `kode/schema/CMakeFiles/schematest.dir/build'.
make[2]: Leaving directory `/home/whirm/src/kde4/build/KDE/kdepim'
/usr/bin/cmake -E cmake_progress_report /home/whirm/src/kde4/build/KDE/kdepim/CMakeFiles
[ 1%] Built target schematest
/usr/bin/make -f kode/kxml_compiler/CMakeFiles/kschema.dir/build.make kode/kxml_compiler/CMakeFiles/kschema.dir/depend
make[2]: Entering directory `/home/whirm/src/kde4/build/KDE/kdepim'
make[2]: Nothing to be done for `kode/kxml_compiler/CMakeFiles/kschema.dir/depend'.
make[2]: Leaving directory `/home/whirm/src/kde4/build/KDE/kdepim'
/usr/bin/make -f kode/kxml_compiler/CMakeFiles/kschema.dir/build.make kode/kxml_compiler/CMakeFiles/kschema.dir/build
make[2]: Entering directory `/home/whirm/src/kde4/build/KDE/kdepim'
make[2]: Nothing to be done for `kode/kxml_compiler/CMakeFiles/kschema.dir/build'.
make[2]: Leaving directory `/home/whirm/src/kde4/build/KDE/kdepim'
/usr/bin/cmake -E cmake_progress_report /home/whirm/src/kde4/build/KDE/kdepim/CMakeFiles
[ 1%] Built target kschema
/usr/bin/make -f kode/kxml_compiler/CMakeFiles/kxml_compiler.dir/build.make kode/kxml_compiler/CMakeFiles/kxml_compiler.dir/depend
make[2]: Entering directory `/home/whirm/src/kde4/build/KDE/kdepim'
make[2]: Nothing to be done for `kode/kxml_compiler/CMakeFiles/kxml_compiler.dir/depend'.
make[2]: Leaving directory `/home/whirm/src/kde4/build/KDE/kdepim'
/usr/bin/make -f kode/kxml_compiler/CMakeFiles/kxml_compiler.dir/build.make kode/kxml_compiler/CMakeFiles/kxml_compiler.dir/build
make[2]: Entering directory `/home/whirm/src/kde4/build/KDE/kdepim'
make[2]: Nothing to be done for `kode/kxml_compiler/CMakeFiles/kxml_compiler.dir/build'.
make[2]: Leaving directory `/home/whirm/src/kde4/build/KDE/kdepim'
/usr/bin/cmake -E cmake_progress_report /home/whirm/src/kde4/build/KDE/kdepim/CMakeFiles
[ 1%] Built target kxml_compiler
/usr/bin/make -f kode/kxforms/CMakeFiles/kxforms.dir/build.make kode/kxforms/CMakeFiles/kxforms.dir/depend
make[2]: Entering directory `/home/whirm/src/kde4/build/KDE/kdepim'
make[2]: Nothing to be done for `kode/kxforms/CMakeFiles/kxforms.dir/depend'.
make[2]: Leaving directory `/home/whirm/src/kde4/build/KDE/kdepim'
/usr/bin/make -f kode/kxforms/CMakeFiles/kxforms.dir/build.make kode/kxforms/CMakeFiles/kxforms.dir/build
make[2]: Entering directory `/home/whirm/src/kde4/build/KDE/kdepim'
make[2]: Nothing to be done for `kode/kxforms/CMakeFiles/kxforms.dir/build'.
make[2]: Leaving directory `/home/whirm/src/kde4/build/KDE/kdepim'
/usr/bin/cmake -E cmake_progress_report /home/whirm/src/kde4/build/KDE/kdepim/CMakeFiles 2 3
[ 3%] Built target kxforms
/usr/bin/make -f kode/kwsdl/wsdl/CMakeFiles/wsdl.dir/build.make kode/kwsdl/wsdl/CMakeFiles/wsdl.dir/depend
make[2]: Entering directory `/home/whirm/src/kde4/build/KDE/kdepim'
make[2]: Nothing to be done for `kode/kwsdl/wsdl/CMakeFiles/wsdl.dir/depend'.
make[2]: Leaving directory `/home/whirm/src/kde4/build/KDE/kdepim'
/usr/bin/make -f kode/kwsdl/wsdl/CMakeFiles/wsdl.dir/build.make kode/kwsdl/wsdl/CMakeFiles/wsdl.dir/build
make[2]: Entering directory `/home/whirm/src/kde4/build/KDE/kdepim'
make[2]: Nothing to be done for `kode/kwsdl/wsdl/CMakeFiles/wsdl.dir/build'.
make[2]: Leaving directory `/home/whirm/src/kde4/build/KDE/kdepim'
/usr/bin/cmake -E cmake_progress_report /home/whirm/src/kde4/build/KDE/kdepim/CMakeFiles
[ 3%] Built target wsdl
/usr/bin/make -f kode/kwsdl/CMakeFiles/kwsdl_compiler.dir/build.make kode/kwsdl/CMakeFiles/kwsdl_compiler.dir/depend
make[2]: Entering directory `/home/whirm/src/kde4/build/KDE/kdepim'
make[2]: Nothing to be done for `kode/kwsdl/CMakeFiles/kwsdl_compiler.dir/depend'.
make[2]: Leaving directory `/home/whirm/src/kde4/build/KDE/kdepim'
/usr/bin/make -f kode/kwsdl/CMakeFiles/kwsdl_compiler.dir/build.make kode/kwsdl/CMakeFiles/kwsdl_compiler.dir/build
make[2]: Entering directory `/home/whirm/src/kde4/build/KDE/kdepim'
make[2]: Nothing to be done for `kode/kwsdl/CMakeFiles/kwsdl_compiler.dir/build'.
make[2]: Leaving directory `/home/whirm/src/kde4/build/KDE/kdepim'
/usr/bin/cmake -E cmake_progress_report /home/whirm/src/kde4/build/KDE/kdepim/CMakeFiles 6
[ 4%] Built target kwsdl_compiler
/usr/bin/make -f kode/kwsdl/wscl/CMakeFiles/wscl.dir/build.make kode/kwsdl/wscl/CMakeFiles/wscl.dir/depend
make[2]: Entering directory `/home/whirm/src/kde4/build/KDE/kdepim'
make[2]: Nothing to be done for `kode/kwsdl/wscl/CMakeFiles/wscl.dir/depend'.
make[2]: Leaving directory `/home/whirm/src/kde4/build/KDE/kdepim'
/usr/bin/make -f kode/kwsdl/wscl/CMakeFiles/wscl.dir/build.make kode/kwsdl/wscl/CMakeFiles/wscl.dir/build
make[2]: Entering directory `/home/whirm/src/kde4/build/KDE/kdepim'
make[2]: Nothing to be done for `kode/kwsdl/wscl/CMakeFiles/wscl.dir/build'.
make[2]: Leaving directory `/home/whirm/src/kde4/build/KDE/kdepim'
/usr/bin/cmake -E cmake_progress_report /home/whirm/src/kde4/build/KDE/kdepim/CMakeFiles 7
[ 5%] Built target wscl
/usr/bin/make -f kode/kwsdl/kung/CMakeFiles/kschemawidgets.dir/build.make kode/kwsdl/kung/CMakeFiles/kschemawidgets.dir/depend
make[2]: Entering directory `/home/whirm/src/kde4/build/KDE/kdepim'
make[2]: Nothing to be done for `kode/kwsdl/kung/CMakeFiles/kschemawidgets.dir/depend'.
make[2]: Leaving directory `/home/whirm/src/kde4/build/KDE/kdepim'
/usr/bin/make -f kode/kwsdl/kung/CMakeFiles/kschemawidgets.dir/build.make kode/kwsdl/kung/CMakeFiles/kschemawidgets.dir/build
make[2]: Entering directory `/home/whirm/src/kde4/build/KDE/kdepim'
make[2]: Nothing to be done for `kode/kwsdl/kung/CMakeFiles/kschemawidgets.dir/build'.
make[2]: Leaving directory `/home/whirm/src/kde4/build/KDE/kdepim'
/usr/bin/cmake -E cmake_progress_report /home/whirm/src/kde4/build/KDE/kdepim/CMakeFiles
[ 5%] Built target kschemawidgets
/usr/bin/make -f kode/kwsdl/kung/CMakeFiles/kung.dir/build.make kode/kwsdl/kung/CMakeFiles/kung.dir/depend
make[2]: Entering directory `/home/whirm/src/kde4/build/KDE/kdepim'
make[2]: Nothing to be done for `kode/kwsdl/kung/CMakeFiles/kung.dir/depend'.
make[2]: Leaving directory `/home/whirm/src/kde4/build/KDE/kdepim'
/usr/bin/make -f kode/kwsdl/kung/CMakeFiles/kung.dir/build.make kode/kwsdl/kung/CMakeFiles/kung.dir/build
make[2]: Entering directory `/home/whirm/src/kde4/build/KDE/kdepim'
make[2]: Nothing to be done for `kode/kwsdl/kung/CMakeFiles/kung.dir/build'.
make[2]: Leaving directory `/home/whirm/src/kde4/build/KDE/kdepim'
/usr/bin/cmake -E cmake_progress_report /home/whirm/src/kde4/build/KDE/kdepim/CMakeFiles 8
[ 6%] Built target kung
/usr/bin/make -f akonadi/server/CMakeFiles/akonadiprivate.dir/build.make akonadi/server/CMakeFiles/akonadiprivate.dir/depend
make[2]: Entering directory `/home/whirm/src/kde4/build/KDE/kdepim'
make[2]: Nothing to be done for `akonadi/server/CMakeFiles/akonadiprivate.dir/depend'.
make[2]: Leaving directory `/home/whirm/src/kde4/build/KDE/kdepim'
/usr/bin/make -f akonadi/server/CMakeFiles/akonadiprivate.dir/build.make akonadi/server/CMakeFiles/akonadiprivate.dir/build
make[2]: Entering directory `/home/whirm/src/kde4/build/KDE/kdepim'
make[2]: Nothing to be done for `akonadi/server/CMakeFiles/akonadiprivate.dir/build'.
make[2]: Leaving directory `/home/whirm/src/kde4/build/KDE/kdepim'
/usr/bin/cmake -E cmake_progress_report /home/whirm/src/kde4/build/KDE/kdepim/CMakeFiles 9 10
[ 8%] Built target akonadiprivate
/usr/bin/make -f akonadi/server/CMakeFiles/akonadiserver_bin.dir/build.make akonadi/server/CMakeFiles/akonadiserver_bin.dir/depend
make[2]: Entering directory `/home/whirm/src/kde4/build/KDE/kdepim'
make[2]: Nothing to be done for `akonadi/server/CMakeFiles/akonadiserver_bin.dir/depend'.
make[2]: Leaving directory `/home/whirm/src/kde4/build/KDE/kdepim'
/usr/bin/make -f akonadi/server/CMakeFiles/akonadiserver_bin.dir/build.make akonadi/server/CMakeFiles/akonadiserver_bin.dir/build
make[2]: Entering directory `/home/whirm/src/kde4/build/KDE/kdepim'
make[2]: Nothing to be done for `akonadi/server/CMakeFiles/akonadiserver_bin.dir/build'.
make[2]: Leaving directory `/home/whirm/src/kde4/build/KDE/kdepim'
/usr/bin/cmake -E cmake_progress_report /home/whirm/src/kde4/build/KDE/kdepim/CMakeFiles
[ 8%] Built target akonadiserver_bin
/usr/bin/make -f akonadi/server/control/CMakeFiles/akonadi_control.dir/build.make akonadi/server/control/CMakeFiles/akonadi_control.dir/depend
make[2]: Entering directory `/home/whirm/src/kde4/build/KDE/kdepim'
make[2]: Nothing to be done for `akonadi/server/control/CMakeFiles/akonadi_control.dir/depend'.
make[2]: Leaving directory `/home/whirm/src/kde4/build/KDE/kdepim'
/usr/bin/make -f akonadi/server/control/CMakeFiles/akonadi_control.dir/build.make akonadi/server/control/CMakeFiles/akonadi_control.dir/build
make[2]: Entering directory `/home/whirm/src/kde4/build/KDE/kdepim'
make[2]: Nothing to be done for `akonadi/server/control/CMakeFiles/akonadi_control.dir/build'.
make[2]: Leaving directory `/home/whirm/src/kde4/build/KDE/kdepim'
/usr/bin/cmake -E cmake_progress_report /home/whirm/src/kde4/build/KDE/kdepim/CMakeFiles 11
[ 9%] Built target akonadi_control
/usr/bin/make -f akonadi/server/sqlplugin/CMakeFiles/qsql_mysql_embedded.dir/build.make akonadi/server/sqlplugin/CMakeFiles/qsql_mysql_embedded.dir/depend
make[2]: Entering directory `/home/whirm/src/kde4/build/KDE/kdepim'
make[2]: Nothing to be done for `akonadi/server/sqlplugin/CMakeFiles/qsql_mysql_embedded.dir/depend'.
make[2]: Leaving directory `/home/whirm/src/kde4/build/KDE/kdepim'
/usr/bin/make -f akonadi/server/sqlplugin/CMakeFiles/qsql_mysql_embedded.dir/build.make akonadi/server/sqlplugin/CMakeFiles/qsql_mysql_embedded.dir/build
make[2]: Entering directory `/home/whirm/src/kde4/build/KDE/kdepim'
Linking CXX shared module ../../../lib/libqsqlmysqlembedded.so
cd /home/whirm/src/kde4/build/KDE/kdepim/akonadi/server/sqlplugin && /usr/bin/cmake -P CMakeFiles/qsql_mysql_embedded.dir/cmake_clean_target.cmake
cd /home/whirm/src/kde4/build/KDE/kdepim/akonadi/server/sqlplugin && /usr/bin/cmake -E cmake_link_script CMakeFiles/qsql_mysql_embedded.dir/link.txt --verbose=1
/usr/bin/c++ -fPIC -Wnon-virtual-dtor -Wno-long-long -ansi -Wundef -Wcast-align -Wchar-subscripts -Wall -W -Wpointer-arith -Wformat-security -fno-exceptions -fno-check-new -fno-common -fvisibility=hidden -g3 -fno-inline -Wl,--fatal-warnings -Wl,--no-undefined -lc -shared -Wl,-soname,libqsqlmysqlembedded.so -o ../../../lib/libqsqlmysqlembedded.so "CMakeFiles/qsql_mysql_embedded.dir/main.o" "CMakeFiles/qsql_mysql_embedded.dir/qsql_mysql_embedded.o" -L/usr/local/lib -L/home/whirm/src/kde4/build/qt-copy/lib -L/usr/lib/mysql -lQtCore -lpthread -lQtSql -Wl,-Bstatic -lmysqld -Wl,-Bdynamic -lmysqlclient -lssl -lcrypto -lcrypt -lnsl -lz
/usr/lib/mysql/libmysqld.a(my_getsystime.o): In function `my_getsystime':
(.text+0xa): undefined reference to `clock_gettime'
/usr/lib/mysql/libmysqld.a(NdbTick.o): In function `NdbTick_CurrentMicrosecond':
(.text+0x1a): undefined reference to `clock_gettime'
/usr/lib/mysql/libmysqld.a(NdbTick.o): In function `NdbTick_CurrentMillisecond':
(.text+0x6a): undefined reference to `clock_gettime'
/usr/lib/mysql/libmysqld.a(NdbCondition.o): In function `NdbCondition_WaitTimeout':
(.text+0x98): undefined reference to `clock_gettime'
collect2: ld returned 1 exit status
make[2]: *** [lib/libqsqlmysqlembedded.so] Error 1
make[2]: Leaving directory `/home/whirm/src/kde4/build/KDE/kdepim'
make[1]: *** [akonadi/server/sqlplugin/CMakeFiles/qsql_mysql_embedded.dir/all] Error 2
make[1]: Leaving directory `/home/whirm/src/kde4/build/KDE/kdepim'
make: *** [all] Error 2
makeobj[0]: Leaving directory `/home/whirm/src/kde4/build/KDE/kdepim'
(KDE4)whirm@sphynx:~/src/kde4/build/KDE/kdepim$