rendered paste body(KDE4)whirm@sphynx:~/src/kde4/build/KDE/kdebase$ cmakekde
-- Found Qt-Version 4.3.0
-- Found X11: /usr/lib/libX11.so
-- Found KDE 4.0 include dir: /home/whirm/src/kde4/include
-- Found KDE 4 library dir: /home/whirm/src/kde4/lib
-- Found KDE4 kconfig_compiler preprocessor: /home/whirm/src/kde4/bin/kconfig_compiler
-- Found Strigi: /home/whirm/src/kde4/lib/libstreamanalyzer.so
-- Found Strigi: /home/whirm/src/kde4/lib/libstreams.so
-- Make sure Strigi is a recent SVN version!
-- ** svn://anonsvn.kde.org/home/kde/trunk/kdesupport/strigi
-- Found Qt-Version 4.3.0
-- Found X11: /usr/lib/libX11.so
-- Found KDE 4.0 include dir: /home/whirm/src/kde4/include
-- Found KDE 4 library dir: /home/whirm/src/kde4/lib
-- Found KDE4 kconfig_compiler preprocessor: /home/whirm/src/kde4/bin/kconfig_compiler
-- Found Strigi: /home/whirm/src/kde4/lib/libstreamanalyzer.so
-- Found Strigi: /home/whirm/src/kde4/lib/libstreams.so
-- Make sure Strigi is a recent SVN version!
-- ** svn://anonsvn.kde.org/home/kde/trunk/kdesupport/strigi
-- Found KDE PIM libraries
-- Found sasl2: /usr/lib/libsasl2.so
-- Found sasl2: /usr/lib/libsasl2.so
-- KDE4_KLDAP_LIBS kldap
-- Create macro to display info at the end of install
-- Found NetworkManager:
-- Found bluez: /usr/lib/libbluetooth.so
-- Found Nepomuk: /home/whirm/src/kde4/lib/libnepomuk.so;/home/whirm/src/kde4/lib/libnepomuk-middleware.so
-- Found Qt-Version 4.3.0
-- Found X11: /usr/lib/libX11.so
-- Found KDE 4.0 include dir: /home/whirm/src/kde4/include
-- Found KDE 4 library dir: /home/whirm/src/kde4/lib
-- Found KDE4 kconfig_compiler preprocessor: /home/whirm/src/kde4/bin/kconfig_compiler
-- Found Strigi: /home/whirm/src/kde4/lib/libstreamanalyzer.so
-- Found Strigi: /home/whirm/src/kde4/lib/libstreams.so
-- Make sure Strigi is a recent SVN version!
-- ** svn://anonsvn.kde.org/home/kde/trunk/kdesupport/strigi
-- Found Nepomuk: /home/whirm/src/kde4/lib/libnepomuk.so;/home/whirm/src/kde4/lib/libnepomuk-middleware.so
-- Found Nepomuk: /home/whirm/src/kde4/lib/libnepomuk.so;/home/whirm/src/kde4/lib/libnepomuk-middleware.so
-- Found Qt-Version 4.3.0
-- Found X11: /usr/lib/libX11.so
-- Found KDE 4.0 include dir: /home/whirm/src/kde4/include
-- Found KDE 4 library dir: /home/whirm/src/kde4/lib
-- Found KDE4 kconfig_compiler preprocessor: /home/whirm/src/kde4/bin/kconfig_compiler
-- Found Strigi: /home/whirm/src/kde4/lib/libstreamanalyzer.so
-- Found Strigi: /home/whirm/src/kde4/lib/libstreams.so
-- Make sure Strigi is a recent SVN version!
-- ** svn://anonsvn.kde.org/home/kde/trunk/kdesupport/strigi
-- Found PNG: /usr/lib/libpng.so
-- Found sensors: /usr/lib/libsensors.so
-- Found Freetype: -lfreetype -lz
-- option: USE_XKLAVIER <ON>
-- Found LibXKlavier: /usr/lib/libxklavier.so
-- Found GObject libraries: /usr/lib/libgobject-2.0.so;/usr/lib/libgmodule-2.0.so;/usr/lib/libgthread-2.0.so;/usr/lib/libglib-2.0.so
-- Found GObject includes : /usr/include/glib-2.0/gobject
-- /home/whirm/src/kde4/src/KDE/kdebase/workspace/kcontrol: skipped subdir $(KSMCARD_SUBDIR)
-- taskbar panel extension disable (since taskbar lib is disabled), reactivate it when we use plasma or remove it
--
----------------------------------------------------------------------------------
-- The following list of OPTIONAL packages were located on your system. --
-- You will have all the following features available from this software. --
----------------------------------------------------------------------------------
+ BlueZ
+ Compositing support
----------------------------------------------------------------------------------
-- The following list of OPTIONAL packages could NOT be located on your system. --
-- Consider installing them to enable more features from this software. --
----------------------------------------------------------------------------------
+ Samba: Sambas libsmbclient is required for the smb-ioslave. A version which already has smbc_set_context() is required <http://www.samba.org>
+ NetworkManager: NetworkManager is a daemon for user controlled networking <http://www.gnome.org/projects/NetworkManager>
-- Configuring done
-- Generating done
-- Build files have been written to: /home/whirm/src/kde4/build/KDE/kdebase
makeobj[0]: Entering directory `/home/whirm/src/kde4/build/KDE/kdebase'
/usr/bin/cmake -H/home/whirm/src/kde4/src/KDE/kdebase -B/home/whirm/src/kde4/build/KDE/kdebase --check-build-system CMakeFiles/Makefile.cmake 0
/usr/bin/cmake -E cmake_progress_start /home/whirm/src/kde4/build/KDE/kdebase/CMakeFiles 97
/usr/bin/make -f CMakeFiles/Makefile2 all
make[1]: Entering directory `/home/whirm/src/kde4/build/KDE/kdebase'
/usr/bin/make -f runtime/kuiserver/CMakeFiles/kdeinit_kuiserver.dir/build.make runtime/kuiserver/CMakeFiles/kdeinit_kuiserver.dir/depend
make[2]: Entering directory `/home/whirm/src/kde4/build/KDE/kdebase'
make[2]: Nothing to be done for `runtime/kuiserver/CMakeFiles/kdeinit_kuiserver.dir/depend'.
make[2]: Leaving directory `/home/whirm/src/kde4/build/KDE/kdebase'
/usr/bin/make -f runtime/kuiserver/CMakeFiles/kdeinit_kuiserver.dir/build.make runtime/kuiserver/CMakeFiles/kdeinit_kuiserver.dir/build
make[2]: Entering directory `/home/whirm/src/kde4/build/KDE/kdebase'
make[2]: Nothing to be done for `runtime/kuiserver/CMakeFiles/kdeinit_kuiserver.dir/build'.
make[2]: Leaving directory `/home/whirm/src/kde4/build/KDE/kdebase'
/usr/bin/cmake -E cmake_progress_report /home/whirm/src/kde4/build/KDE/kdebase/CMakeFiles
[ 0%] Built target kdeinit_kuiserver
/usr/bin/make -f runtime/kuiserver/CMakeFiles/kuiserver.dir/build.make runtime/kuiserver/CMakeFiles/kuiserver.dir/depend
make[2]: Entering directory `/home/whirm/src/kde4/build/KDE/kdebase'
make[2]: Nothing to be done for `runtime/kuiserver/CMakeFiles/kuiserver.dir/depend'.
make[2]: Leaving directory `/home/whirm/src/kde4/build/KDE/kdebase'
/usr/bin/make -f runtime/kuiserver/CMakeFiles/kuiserver.dir/build.make runtime/kuiserver/CMakeFiles/kuiserver.dir/build
make[2]: Entering directory `/home/whirm/src/kde4/build/KDE/kdebase'
make[2]: Nothing to be done for `runtime/kuiserver/CMakeFiles/kuiserver.dir/build'.
make[2]: Leaving directory `/home/whirm/src/kde4/build/KDE/kdebase'
/usr/bin/cmake -E cmake_progress_report /home/whirm/src/kde4/build/KDE/kdebase/CMakeFiles
[ 0%] Built target kuiserver
/usr/bin/make -f runtime/drkonqi/CMakeFiles/drkonqi.dir/build.make runtime/drkonqi/CMakeFiles/drkonqi.dir/depend
make[2]: Entering directory `/home/whirm/src/kde4/build/KDE/kdebase'
make[2]: Nothing to be done for `runtime/drkonqi/CMakeFiles/drkonqi.dir/depend'.
make[2]: Leaving directory `/home/whirm/src/kde4/build/KDE/kdebase'
/usr/bin/make -f runtime/drkonqi/CMakeFiles/drkonqi.dir/build.make runtime/drkonqi/CMakeFiles/drkonqi.dir/build
make[2]: Entering directory `/home/whirm/src/kde4/build/KDE/kdebase'
make[2]: Nothing to be done for `runtime/drkonqi/CMakeFiles/drkonqi.dir/build'.
make[2]: Leaving directory `/home/whirm/src/kde4/build/KDE/kdebase'
/usr/bin/cmake -E cmake_progress_report /home/whirm/src/kde4/build/KDE/kdebase/CMakeFiles 1
[ 1%] Built target drkonqi
/usr/bin/make -f runtime/khelpcenter/CMakeFiles/kdeinit_khelpcenter.dir/build.make runtime/khelpcenter/CMakeFiles/kdeinit_khelpcenter.dir/depend
make[2]: Entering directory `/home/whirm/src/kde4/build/KDE/kdebase'
make[2]: Nothing to be done for `runtime/khelpcenter/CMakeFiles/kdeinit_khelpcenter.dir/depend'.
make[2]: Leaving directory `/home/whirm/src/kde4/build/KDE/kdebase'
/usr/bin/make -f runtime/khelpcenter/CMakeFiles/kdeinit_khelpcenter.dir/build.make runtime/khelpcenter/CMakeFiles/kdeinit_khelpcenter.dir/build
make[2]: Entering directory `/home/whirm/src/kde4/build/KDE/kdebase'
make[2]: Nothing to be done for `runtime/khelpcenter/CMakeFiles/kdeinit_khelpcenter.dir/build'.
make[2]: Leaving directory `/home/whirm/src/kde4/build/KDE/kdebase'
/usr/bin/cmake -E cmake_progress_report /home/whirm/src/kde4/build/KDE/kdebase/CMakeFiles 2
[ 2%] Built target kdeinit_khelpcenter
/usr/bin/make -f runtime/khelpcenter/CMakeFiles/khc_indexbuilder.dir/build.make runtime/khelpcenter/CMakeFiles/khc_indexbuilder.dir/depend
make[2]: Entering directory `/home/whirm/src/kde4/build/KDE/kdebase'
make[2]: Nothing to be done for `runtime/khelpcenter/CMakeFiles/khc_indexbuilder.dir/depend'.
make[2]: Leaving directory `/home/whirm/src/kde4/build/KDE/kdebase'
/usr/bin/make -f runtime/khelpcenter/CMakeFiles/khc_indexbuilder.dir/build.make runtime/khelpcenter/CMakeFiles/khc_indexbuilder.dir/build
make[2]: Entering directory `/home/whirm/src/kde4/build/KDE/kdebase'
make[2]: Nothing to be done for `runtime/khelpcenter/CMakeFiles/khc_indexbuilder.dir/build'.
make[2]: Leaving directory `/home/whirm/src/kde4/build/KDE/kdebase'
/usr/bin/cmake -E cmake_progress_report /home/whirm/src/kde4/build/KDE/kdebase/CMakeFiles
[ 2%] Built target khc_indexbuilder
/usr/bin/make -f runtime/khelpcenter/CMakeFiles/khelpcenter.dir/build.make runtime/khelpcenter/CMakeFiles/khelpcenter.dir/depend
make[2]: Entering directory `/home/whirm/src/kde4/build/KDE/kdebase'
make[2]: Nothing to be done for `runtime/khelpcenter/CMakeFiles/khelpcenter.dir/depend'.
make[2]: Leaving directory `/home/whirm/src/kde4/build/KDE/kdebase'
/usr/bin/make -f runtime/khelpcenter/CMakeFiles/khelpcenter.dir/build.make runtime/khelpcenter/CMakeFiles/khelpcenter.dir/build
make[2]: Entering directory `/home/whirm/src/kde4/build/KDE/kdebase'
make[2]: Nothing to be done for `runtime/khelpcenter/CMakeFiles/khelpcenter.dir/build'.
make[2]: Leaving directory `/home/whirm/src/kde4/build/KDE/kdebase'
/usr/bin/cmake -E cmake_progress_report /home/whirm/src/kde4/build/KDE/kdebase/CMakeFiles
[ 2%] Built target khelpcenter
/usr/bin/make -f runtime/kioexec/CMakeFiles/kioexec.dir/build.make runtime/kioexec/CMakeFiles/kioexec.dir/depend
make[2]: Entering directory `/home/whirm/src/kde4/build/KDE/kdebase'
make[2]: Nothing to be done for `runtime/kioexec/CMakeFiles/kioexec.dir/depend'.
make[2]: Leaving directory `/home/whirm/src/kde4/build/KDE/kdebase'
/usr/bin/make -f runtime/kioexec/CMakeFiles/kioexec.dir/build.make runtime/kioexec/CMakeFiles/kioexec.dir/build
make[2]: Entering directory `/home/whirm/src/kde4/build/KDE/kdebase'
make[2]: Nothing to be done for `runtime/kioexec/CMakeFiles/kioexec.dir/build'.
make[2]: Leaving directory `/home/whirm/src/kde4/build/KDE/kdebase'
/usr/bin/cmake -E cmake_progress_report /home/whirm/src/kde4/build/KDE/kdebase/CMakeFiles
[ 2%] Built target kioexec
/usr/bin/make -f runtime/kioslave/about/CMakeFiles/kio_about.dir/build.make runtime/kioslave/about/CMakeFiles/kio_about.dir/depend
make[2]: Entering directory `/home/whirm/src/kde4/build/KDE/kdebase'
make[2]: Nothing to be done for `runtime/kioslave/about/CMakeFiles/kio_about.dir/depend'.
make[2]: Leaving directory `/home/whirm/src/kde4/build/KDE/kdebase'
/usr/bin/make -f runtime/kioslave/about/CMakeFiles/kio_about.dir/build.make runtime/kioslave/about/CMakeFiles/kio_about.dir/build
make[2]: Entering directory `/home/whirm/src/kde4/build/KDE/kdebase'
make[2]: Nothing to be done for `runtime/kioslave/about/CMakeFiles/kio_about.dir/build'.
make[2]: Leaving directory `/home/whirm/src/kde4/build/KDE/kdebase'
/usr/bin/cmake -E cmake_progress_report /home/whirm/src/kde4/build/KDE/kdebase/CMakeFiles
[ 2%] Built target kio_about
/usr/bin/make -f runtime/kioslave/cgi/CMakeFiles/kio_cgi.dir/build.make runtime/kioslave/cgi/CMakeFiles/kio_cgi.dir/depend
make[2]: Entering directory `/home/whirm/src/kde4/build/KDE/kdebase'
make[2]: Nothing to be done for `runtime/kioslave/cgi/CMakeFiles/kio_cgi.dir/depend'.
make[2]: Leaving directory `/home/whirm/src/kde4/build/KDE/kdebase'
/usr/bin/make -f runtime/kioslave/cgi/CMakeFiles/kio_cgi.dir/build.make runtime/kioslave/cgi/CMakeFiles/kio_cgi.dir/build
make[2]: Entering directory `/home/whirm/src/kde4/build/KDE/kdebase'
make[2]: Nothing to be done for `runtime/kioslave/cgi/CMakeFiles/kio_cgi.dir/build'.
make[2]: Leaving directory `/home/whirm/src/kde4/build/KDE/kdebase'
/usr/bin/cmake -E cmake_progress_report /home/whirm/src/kde4/build/KDE/kdebase/CMakeFiles 3
[ 3%] Built target kio_cgi
/usr/bin/make -f runtime/kioslave/cgi/kcmcgi/CMakeFiles/kcm_cgi.dir/build.make runtime/kioslave/cgi/kcmcgi/CMakeFiles/kcm_cgi.dir/depend
make[2]: Entering directory `/home/whirm/src/kde4/build/KDE/kdebase'
make[2]: Nothing to be done for `runtime/kioslave/cgi/kcmcgi/CMakeFiles/kcm_cgi.dir/depend'.
make[2]: Leaving directory `/home/whirm/src/kde4/build/KDE/kdebase'
/usr/bin/make -f runtime/kioslave/cgi/kcmcgi/CMakeFiles/kcm_cgi.dir/build.make runtime/kioslave/cgi/kcmcgi/CMakeFiles/kcm_cgi.dir/build
make[2]: Entering directory `/home/whirm/src/kde4/build/KDE/kdebase'
make[2]: Nothing to be done for `runtime/kioslave/cgi/kcmcgi/CMakeFiles/kcm_cgi.dir/build'.
make[2]: Leaving directory `/home/whirm/src/kde4/build/KDE/kdebase'
/usr/bin/cmake -E cmake_progress_report /home/whirm/src/kde4/build/KDE/kdebase/CMakeFiles
[ 3%] Built target kcm_cgi
/usr/bin/make -f runtime/kioslave/floppy/CMakeFiles/kio_floppy.dir/build.make runtime/kioslave/floppy/CMakeFiles/kio_floppy.dir/depend
make[2]: Entering directory `/home/whirm/src/kde4/build/KDE/kdebase'
make[2]: Nothing to be done for `runtime/kioslave/floppy/CMakeFiles/kio_floppy.dir/depend'.
make[2]: Leaving directory `/home/whirm/src/kde4/build/KDE/kdebase'
/usr/bin/make -f runtime/kioslave/floppy/CMakeFiles/kio_floppy.dir/build.make runtime/kioslave/floppy/CMakeFiles/kio_floppy.dir/build
make[2]: Entering directory `/home/whirm/src/kde4/build/KDE/kdebase'
make[2]: Nothing to be done for `runtime/kioslave/floppy/CMakeFiles/kio_floppy.dir/build'.
make[2]: Leaving directory `/home/whirm/src/kde4/build/KDE/kdebase'
/usr/bin/cmake -E cmake_progress_report /home/whirm/src/kde4/build/KDE/kdebase/CMakeFiles
[ 3%] Built target kio_floppy
/usr/bin/make -f runtime/kioslave/filter/CMakeFiles/kio_filter.dir/build.make runtime/kioslave/filter/CMakeFiles/kio_filter.dir/depend
make[2]: Entering directory `/home/whirm/src/kde4/build/KDE/kdebase'
make[2]: Nothing to be done for `runtime/kioslave/filter/CMakeFiles/kio_filter.dir/depend'.
make[2]: Leaving directory `/home/whirm/src/kde4/build/KDE/kdebase'
/usr/bin/make -f runtime/kioslave/filter/CMakeFiles/kio_filter.dir/build.make runtime/kioslave/filter/CMakeFiles/kio_filter.dir/build
make[2]: Entering directory `/home/whirm/src/kde4/build/KDE/kdebase'
make[2]: Nothing to be done for `runtime/kioslave/filter/CMakeFiles/kio_filter.dir/build'.
make[2]: Leaving directory `/home/whirm/src/kde4/build/KDE/kdebase'
/usr/bin/cmake -E cmake_progress_report /home/whirm/src/kde4/build/KDE/kdebase/CMakeFiles
[ 3%] Built target kio_filter
/usr/bin/make -f runtime/kioslave/info/CMakeFiles/kio_info.dir/build.make runtime/kioslave/info/CMakeFiles/kio_info.dir/depend
make[2]: Entering directory `/home/whirm/src/kde4/build/KDE/kdebase'
make[2]: Nothing to be done for `runtime/kioslave/info/CMakeFiles/kio_info.dir/depend'.
make[2]: Leaving directory `/home/whirm/src/kde4/build/KDE/kdebase'
/usr/bin/make -f runtime/kioslave/info/CMakeFiles/kio_info.dir/build.make runtime/kioslave/info/CMakeFiles/kio_info.dir/build
make[2]: Entering directory `/home/whirm/src/kde4/build/KDE/kdebase'
make[2]: Nothing to be done for `runtime/kioslave/info/CMakeFiles/kio_info.dir/build'.
make[2]: Leaving directory `/home/whirm/src/kde4/build/KDE/kdebase'
/usr/bin/cmake -E cmake_progress_report /home/whirm/src/kde4/build/KDE/kdebase/CMakeFiles
[ 3%] Built target kio_info
/usr/bin/make -f runtime/kioslave/nntp/CMakeFiles/kio_nntp.dir/build.make runtime/kioslave/nntp/CMakeFiles/kio_nntp.dir/depend
make[2]: Entering directory `/home/whirm/src/kde4/build/KDE/kdebase'
make[2]: Nothing to be done for `runtime/kioslave/nntp/CMakeFiles/kio_nntp.dir/depend'.
make[2]: Leaving directory `/home/whirm/src/kde4/build/KDE/kdebase'
/usr/bin/make -f runtime/kioslave/nntp/CMakeFiles/kio_nntp.dir/build.make runtime/kioslave/nntp/CMakeFiles/kio_nntp.dir/build
make[2]: Entering directory `/home/whirm/src/kde4/build/KDE/kdebase'
make[2]: Nothing to be done for `runtime/kioslave/nntp/CMakeFiles/kio_nntp.dir/build'.
make[2]: Leaving directory `/home/whirm/src/kde4/build/KDE/kdebase'
/usr/bin/cmake -E cmake_progress_report /home/whirm/src/kde4/build/KDE/kdebase/CMakeFiles
[ 3%] Built target kio_nntp
/usr/bin/make -f runtime/kioslave/pop3/CMakeFiles/kio_pop3.dir/build.make runtime/kioslave/pop3/CMakeFiles/kio_pop3.dir/depend
make[2]: Entering directory `/home/whirm/src/kde4/build/KDE/kdebase'
make[2]: Nothing to be done for `runtime/kioslave/pop3/CMakeFiles/kio_pop3.dir/depend'.
make[2]: Leaving directory `/home/whirm/src/kde4/build/KDE/kdebase'
/usr/bin/make -f runtime/kioslave/pop3/CMakeFiles/kio_pop3.dir/build.make runtime/kioslave/pop3/CMakeFiles/kio_pop3.dir/build
make[2]: Entering directory `/home/whirm/src/kde4/build/KDE/kdebase'
make[2]: Nothing to be done for `runtime/kioslave/pop3/CMakeFiles/kio_pop3.dir/build'.
make[2]: Leaving directory `/home/whirm/src/kde4/build/KDE/kdebase'
/usr/bin/cmake -E cmake_progress_report /home/whirm/src/kde4/build/KDE/kdebase/CMakeFiles
[ 3%] Built target kio_pop3
/usr/bin/make -f runtime/kioslave/smtp/CMakeFiles/kio_smtp.dir/build.make runtime/kioslave/smtp/CMakeFiles/kio_smtp.dir/depend
make[2]: Entering directory `/home/whirm/src/kde4/build/KDE/kdebase'
make[2]: Nothing to be done for `runtime/kioslave/smtp/CMakeFiles/kio_smtp.dir/depend'.
make[2]: Leaving directory `/home/whirm/src/kde4/build/KDE/kdebase'
/usr/bin/make -f runtime/kioslave/smtp/CMakeFiles/kio_smtp.dir/build.make runtime/kioslave/smtp/CMakeFiles/kio_smtp.dir/build
make[2]: Entering directory `/home/whirm/src/kde4/build/KDE/kdebase'
make[2]: Nothing to be done for `runtime/kioslave/smtp/CMakeFiles/kio_smtp.dir/build'.
make[2]: Leaving directory `/home/whirm/src/kde4/build/KDE/kdebase'
/usr/bin/cmake -E cmake_progress_report /home/whirm/src/kde4/build/KDE/kdebase/CMakeFiles
[ 3%] Built target kio_smtp
/usr/bin/make -f runtime/kioslave/tar/CMakeFiles/kio_tar.dir/build.make runtime/kioslave/tar/CMakeFiles/kio_tar.dir/depend
make[2]: Entering directory `/home/whirm/src/kde4/build/KDE/kdebase'
make[2]: Nothing to be done for `runtime/kioslave/tar/CMakeFiles/kio_tar.dir/depend'.
make[2]: Leaving directory `/home/whirm/src/kde4/build/KDE/kdebase'
/usr/bin/make -f runtime/kioslave/tar/CMakeFiles/kio_tar.dir/build.make runtime/kioslave/tar/CMakeFiles/kio_tar.dir/build
make[2]: Entering directory `/home/whirm/src/kde4/build/KDE/kdebase'
make[2]: Nothing to be done for `runtime/kioslave/tar/CMakeFiles/kio_tar.dir/build'.
make[2]: Leaving directory `/home/whirm/src/kde4/build/KDE/kdebase'
/usr/bin/cmake -E cmake_progress_report /home/whirm/src/kde4/build/KDE/kdebase/CMakeFiles
[ 3%] Built target kio_tar
/usr/bin/make -f runtime/kioslave/settings/CMakeFiles/kio_settings.dir/build.make runtime/kioslave/settings/CMakeFiles/kio_settings.dir/depend
make[2]: Entering directory `/home/whirm/src/kde4/build/KDE/kdebase'
make[2]: Nothing to be done for `runtime/kioslave/settings/CMakeFiles/kio_settings.dir/depend'.
make[2]: Leaving directory `/home/whirm/src/kde4/build/KDE/kdebase'
/usr/bin/make -f runtime/kioslave/settings/CMakeFiles/kio_settings.dir/build.make runtime/kioslave/settings/CMakeFiles/kio_settings.dir/build
make[2]: Entering directory `/home/whirm/src/kde4/build/KDE/kdebase'
make[2]: Nothing to be done for `runtime/kioslave/settings/CMakeFiles/kio_settings.dir/build'.
make[2]: Leaving directory `/home/whirm/src/kde4/build/KDE/kdebase'
/usr/bin/cmake -E cmake_progress_report /home/whirm/src/kde4/build/KDE/kdebase/CMakeFiles
[ 3%] Built target kio_settings
/usr/bin/make -f runtime/kioslave/trash/CMakeFiles/kio_trash.dir/build.make runtime/kioslave/trash/CMakeFiles/kio_trash.dir/depend
make[2]: Entering directory `/home/whirm/src/kde4/build/KDE/kdebase'
make[2]: Nothing to be done for `runtime/kioslave/trash/CMakeFiles/kio_trash.dir/depend'.
make[2]: Leaving directory `/home/whirm/src/kde4/build/KDE/kdebase'
/usr/bin/make -f runtime/kioslave/trash/CMakeFiles/kio_trash.dir/build.make runtime/kioslave/trash/CMakeFiles/kio_trash.dir/build
make[2]: Entering directory `/home/whirm/src/kde4/build/KDE/kdebase'
make[2]: Nothing to be done for `runtime/kioslave/trash/CMakeFiles/kio_trash.dir/build'.
make[2]: Leaving directory `/home/whirm/src/kde4/build/KDE/kdebase'
/usr/bin/cmake -E cmake_progress_report /home/whirm/src/kde4/build/KDE/kdebase/CMakeFiles
[ 3%] Built target kio_trash
/usr/bin/make -f runtime/kioslave/trash/CMakeFiles/ktrash.dir/build.make runtime/kioslave/trash/CMakeFiles/ktrash.dir/depend
make[2]: Entering directory `/home/whirm/src/kde4/build/KDE/kdebase'
make[2]: Nothing to be done for `runtime/kioslave/trash/CMakeFiles/ktrash.dir/depend'.
make[2]: Leaving directory `/home/whirm/src/kde4/build/KDE/kdebase'
/usr/bin/make -f runtime/kioslave/trash/CMakeFiles/ktrash.dir/build.make runtime/kioslave/trash/CMakeFiles/ktrash.dir/build
make[2]: Entering directory `/home/whirm/src/kde4/build/KDE/kdebase'
make[2]: Nothing to be done for `runtime/kioslave/trash/CMakeFiles/ktrash.dir/build'.
make[2]: Leaving directory `/home/whirm/src/kde4/build/KDE/kdebase'
/usr/bin/cmake -E cmake_progress_report /home/whirm/src/kde4/build/KDE/kdebase/CMakeFiles
[ 3%] Built target ktrash
/usr/bin/make -f runtime/kioslave/trash/CMakeFiles/trash.dir/build.make runtime/kioslave/trash/CMakeFiles/trash.dir/depend
make[2]: Entering directory `/home/whirm/src/kde4/build/KDE/kdebase'
make[2]: Nothing to be done for `runtime/kioslave/trash/CMakeFiles/trash.dir/depend'.
make[2]: Leaving directory `/home/whirm/src/kde4/build/KDE/kdebase'
/usr/bin/make -f runtime/kioslave/trash/CMakeFiles/trash.dir/build.make runtime/kioslave/trash/CMakeFiles/trash.dir/build
make[2]: Entering directory `/home/whirm/src/kde4/build/KDE/kdebase'
make[2]: Nothing to be done for `runtime/kioslave/trash/CMakeFiles/trash.dir/build'.
make[2]: Leaving directory `/home/whirm/src/kde4/build/KDE/kdebase'
/usr/bin/cmake -E cmake_progress_report /home/whirm/src/kde4/build/KDE/kdebase/CMakeFiles
[ 3%] Built target trash
/usr/bin/make -f runtime/kioslave/media/CMakeFiles/kio_media.dir/build.make runtime/kioslave/media/CMakeFiles/kio_media.dir/depend
make[2]: Entering directory `/home/whirm/src/kde4/build/KDE/kdebase'
make[2]: Nothing to be done for `runtime/kioslave/media/CMakeFiles/kio_media.dir/depend'.
make[2]: Leaving directory `/home/whirm/src/kde4/build/KDE/kdebase'
/usr/bin/make -f runtime/kioslave/media/CMakeFiles/kio_media.dir/build.make runtime/kioslave/media/CMakeFiles/kio_media.dir/build
make[2]: Entering directory `/home/whirm/src/kde4/build/KDE/kdebase'
make[2]: Nothing to be done for `runtime/kioslave/media/CMakeFiles/kio_media.dir/build'.
make[2]: Leaving directory `/home/whirm/src/kde4/build/KDE/kdebase'
/usr/bin/cmake -E cmake_progress_report /home/whirm/src/kde4/build/KDE/kdebase/CMakeFiles
[ 3%] Built target kio_media
/usr/bin/make -f runtime/kioslave/media/mediamanager/CMakeFiles/kded_mediamanager.dir/build.make runtime/kioslave/media/mediamanager/CMakeFiles/kded_mediamanager.dir/depend
make[2]: Entering directory `/home/whirm/src/kde4/build/KDE/kdebase'
make[2]: Nothing to be done for `runtime/kioslave/media/mediamanager/CMakeFiles/kded_mediamanager.dir/depend'.
make[2]: Leaving directory `/home/whirm/src/kde4/build/KDE/kdebase'
/usr/bin/make -f runtime/kioslave/media/mediamanager/CMakeFiles/kded_mediamanager.dir/build.make runtime/kioslave/media/mediamanager/CMakeFiles/kded_mediamanager.dir/build
make[2]: Entering directory `/home/whirm/src/kde4/build/KDE/kdebase'
make[2]: Nothing to be done for `runtime/kioslave/media/mediamanager/CMakeFiles/kded_mediamanager.dir/build'.
make[2]: Leaving directory `/home/whirm/src/kde4/build/KDE/kdebase'
/usr/bin/cmake -E cmake_progress_report /home/whirm/src/kde4/build/KDE/kdebase/CMakeFiles 5
[ 4%] Built target kded_mediamanager
/usr/bin/make -f runtime/kioslave/media/medianotifier/CMakeFiles/kded_medianotifier.dir/build.make runtime/kioslave/media/medianotifier/CMakeFiles/kded_medianotifier.dir/depend
make[2]: Entering directory `/home/whirm/src/kde4/build/KDE/kdebase'
make[2]: Nothing to be done for `runtime/kioslave/media/medianotifier/CMakeFiles/kded_medianotifier.dir/depend'.
make[2]: Leaving directory `/home/whirm/src/kde4/build/KDE/kdebase'
/usr/bin/make -f runtime/kioslave/media/medianotifier/CMakeFiles/kded_medianotifier.dir/build.make runtime/kioslave/media/medianotifier/CMakeFiles/kded_medianotifier.dir/build
make[2]: Entering directory `/home/whirm/src/kde4/build/KDE/kdebase'
make[2]: Nothing to be done for `runtime/kioslave/media/medianotifier/CMakeFiles/kded_medianotifier.dir/build'.
make[2]: Leaving directory `/home/whirm/src/kde4/build/KDE/kdebase'
/usr/bin/cmake -E cmake_progress_report /home/whirm/src/kde4/build/KDE/kdebase/CMakeFiles
[ 4%] Built target kded_medianotifier
/usr/bin/make -f runtime/kioslave/media/mounthelper/CMakeFiles/kio_media_mounthelper.dir/build.make runtime/kioslave/media/mounthelper/CMakeFiles/kio_media_mounthelper.dir/depend
make[2]: Entering directory `/home/whirm/src/kde4/build/KDE/kdebase'
make[2]: Nothing to be done for `runtime/kioslave/media/mounthelper/CMakeFiles/kio_media_mounthelper.dir/depend'.
make[2]: Leaving directory `/home/whirm/src/kde4/build/KDE/kdebase'
/usr/bin/make -f runtime/kioslave/media/mounthelper/CMakeFiles/kio_media_mounthelper.dir/build.make runtime/kioslave/media/mounthelper/CMakeFiles/kio_media_mounthelper.dir/build
make[2]: Entering directory `/home/whirm/src/kde4/build/KDE/kdebase'
make[2]: Nothing to be done for `runtime/kioslave/media/mounthelper/CMakeFiles/kio_media_mounthelper.dir/build'.
make[2]: Leaving directory `/home/whirm/src/kde4/build/KDE/kdebase'
/usr/bin/cmake -E cmake_progress_report /home/whirm/src/kde4/build/KDE/kdebase/CMakeFiles 6
[ 5%] Built target kio_media_mounthelper
/usr/bin/make -f runtime/kioslave/media/kcmodule/CMakeFiles/kcm_media.dir/build.make runtime/kioslave/media/kcmodule/CMakeFiles/kcm_media.dir/depend
make[2]: Entering directory `/home/whirm/src/kde4/build/KDE/kdebase'
make[2]: Nothing to be done for `runtime/kioslave/media/kcmodule/CMakeFiles/kcm_media.dir/depend'.
make[2]: Leaving directory `/home/whirm/src/kde4/build/KDE/kdebase'
/usr/bin/make -f runtime/kioslave/media/kcmodule/CMakeFiles/kcm_media.dir/build.make runtime/kioslave/media/kcmodule/CMakeFiles/kcm_media.dir/build
make[2]: Entering directory `/home/whirm/src/kde4/build/KDE/kdebase'
make[2]: Nothing to be done for `runtime/kioslave/media/kcmodule/CMakeFiles/kcm_media.dir/build'.
make[2]: Leaving directory `/home/whirm/src/kde4/build/KDE/kdebase'
/usr/bin/cmake -E cmake_progress_report /home/whirm/src/kde4/build/KDE/kdebase/CMakeFiles 7
[ 6%] Built target kcm_media
/usr/bin/make -f runtime/kioslave/remote/CMakeFiles/kio_remote.dir/build.make runtime/kioslave/remote/CMakeFiles/kio_remote.dir/depend
make[2]: Entering directory `/home/whirm/src/kde4/build/KDE/kdebase'
make[2]: Nothing to be done for `runtime/kioslave/remote/CMakeFiles/kio_remote.dir/depend'.
make[2]: Leaving directory `/home/whirm/src/kde4/build/KDE/kdebase'
/usr/bin/make -f runtime/kioslave/remote/CMakeFiles/kio_remote.dir/build.make runtime/kioslave/remote/CMakeFiles/kio_remote.dir/build
make[2]: Entering directory `/home/whirm/src/kde4/build/KDE/kdebase'
make[2]: Nothing to be done for `runtime/kioslave/remote/CMakeFiles/kio_remote.dir/build'.
make[2]: Leaving directory `/home/whirm/src/kde4/build/KDE/kdebase'
/usr/bin/cmake -E cmake_progress_report /home/whirm/src/kde4/build/KDE/kdebase/CMakeFiles
[ 6%] Built target kio_remote
/usr/bin/make -f runtime/kioslave/remote/kdedmodule/CMakeFiles/kded_remotedirnotify.dir/build.make runtime/kioslave/remote/kdedmodule/CMakeFiles/kded_remotedirnotify.dir/depend
make[2]: Entering directory `/home/whirm/src/kde4/build/KDE/kdebase'
make[2]: Nothing to be done for `runtime/kioslave/remote/kdedmodule/CMakeFiles/kded_remotedirnotify.dir/depend'.
make[2]: Leaving directory `/home/whirm/src/kde4/build/KDE/kdebase'
/usr/bin/make -f runtime/kioslave/remote/kdedmodule/CMakeFiles/kded_remotedirnotify.dir/build.make runtime/kioslave/remote/kdedmodule/CMakeFiles/kded_remotedirnotify.dir/build
make[2]: Entering directory `/home/whirm/src/kde4/build/KDE/kdebase'
make[2]: Nothing to be done for `runtime/kioslave/remote/kdedmodule/CMakeFiles/kded_remotedirnotify.dir/build'.
make[2]: Leaving directory `/home/whirm/src/kde4/build/KDE/kdebase'
/usr/bin/cmake -E cmake_progress_report /home/whirm/src/kde4/build/KDE/kdebase/CMakeFiles
[ 6%] Built target kded_remotedirnotify
/usr/bin/make -f runtime/kioslave/home/CMakeFiles/kio_home.dir/build.make runtime/kioslave/home/CMakeFiles/kio_home.dir/depend
make[2]: Entering directory `/home/whirm/src/kde4/build/KDE/kdebase'
make[2]: Nothing to be done for `runtime/kioslave/home/CMakeFiles/kio_home.dir/depend'.
make[2]: Leaving directory `/home/whirm/src/kde4/build/KDE/kdebase'
/usr/bin/make -f runtime/kioslave/home/CMakeFiles/kio_home.dir/build.make runtime/kioslave/home/CMakeFiles/kio_home.dir/build
make[2]: Entering directory `/home/whirm/src/kde4/build/KDE/kdebase'
make[2]: Nothing to be done for `runtime/kioslave/home/CMakeFiles/kio_home.dir/build'.
make[2]: Leaving directory `/home/whirm/src/kde4/build/KDE/kdebase'
/usr/bin/cmake -E cmake_progress_report /home/whirm/src/kde4/build/KDE/kdebase/CMakeFiles
[ 6%] Built target kio_home
/usr/bin/make -f runtime/kioslave/home/kdedmodule/CMakeFiles/kded_homedirnotify.dir/build.make runtime/kioslave/home/kdedmodule/CMakeFiles/kded_homedirnotify.dir/depend
make[2]: Entering directory `/home/whirm/src/kde4/build/KDE/kdebase'
make[2]: Nothing to be done for `runtime/kioslave/home/kdedmodule/CMakeFiles/kded_homedirnotify.dir/depend'.
make[2]: Leaving directory `/home/whirm/src/kde4/build/KDE/kdebase'
/usr/bin/make -f runtime/kioslave/home/kdedmodule/CMakeFiles/kded_homedirnotify.dir/build.make runtime/kioslave/home/kdedmodule/CMakeFiles/kded_homedirnotify.dir/build
make[2]: Entering directory `/home/whirm/src/kde4/build/KDE/kdebase'
make[2]: Nothing to be done for `runtime/kioslave/home/kdedmodule/CMakeFiles/kded_homedirnotify.dir/build'.
make[2]: Leaving directory `/home/whirm/src/kde4/build/KDE/kdebase'
/usr/bin/cmake -E cmake_progress_report /home/whirm/src/kde4/build/KDE/kdebase/CMakeFiles
[ 6%] Built target kded_homedirnotify
/usr/bin/make -f runtime/kioslave/system/CMakeFiles/kio_system.dir/build.make runtime/kioslave/system/CMakeFiles/kio_system.dir/depend
make[2]: Entering directory `/home/whirm/src/kde4/build/KDE/kdebase'
make[2]: Nothing to be done for `runtime/kioslave/system/CMakeFiles/kio_system.dir/depend'.
make[2]: Leaving directory `/home/whirm/src/kde4/build/KDE/kdebase'
/usr/bin/make -f runtime/kioslave/system/CMakeFiles/kio_system.dir/build.make runtime/kioslave/system/CMakeFiles/kio_system.dir/build
make[2]: Entering directory `/home/whirm/src/kde4/build/KDE/kdebase'
make[2]: Nothing to be done for `runtime/kioslave/system/CMakeFiles/kio_system.dir/build'.
make[2]: Leaving directory `/home/whirm/src/kde4/build/KDE/kdebase'
/usr/bin/cmake -E cmake_progress_report /home/whirm/src/kde4/build/KDE/kdebase/CMakeFiles
[ 6%] Built target kio_system
/usr/bin/make -f runtime/kioslave/system/kdedmodule/CMakeFiles/kded_systemdirnotify.dir/build.make runtime/kioslave/system/kdedmodule/CMakeFiles/kded_systemdirnotify.dir/depend
make[2]: Entering directory `/home/whirm/src/kde4/build/KDE/kdebase'
make[2]: Nothing to be done for `runtime/kioslave/system/kdedmodule/CMakeFiles/kded_systemdirnotify.dir/depend'.
make[2]: Leaving directory `/home/whirm/src/kde4/build/KDE/kdebase'
/usr/bin/make -f runtime/kioslave/system/kdedmodule/CMakeFiles/kded_systemdirnotify.dir/build.make runtime/kioslave/system/kdedmodule/CMakeFiles/kded_systemdirnotify.dir/build
make[2]: Entering directory `/home/whirm/src/kde4/build/KDE/kdebase'
make[2]: Nothing to be done for `runtime/kioslave/system/kdedmodule/CMakeFiles/kded_systemdirnotify.dir/build'.
make[2]: Leaving directory `/home/whirm/src/kde4/build/KDE/kdebase'
/usr/bin/cmake -E cmake_progress_report /home/whirm/src/kde4/build/KDE/kdebase/CMakeFiles
[ 6%] Built target kded_systemdirnotify
/usr/bin/make -f runtime/kioslave/ldap/CMakeFiles/kio_ldap.dir/build.make runtime/kioslave/ldap/CMakeFiles/kio_ldap.dir/depend
make[2]: Entering directory `/home/whirm/src/kde4/build/KDE/kdebase'
make[2]: Nothing to be done for `runtime/kioslave/ldap/CMakeFiles/kio_ldap.dir/depend'.
make[2]: Leaving directory `/home/whirm/src/kde4/build/KDE/kdebase'
/usr/bin/make -f runtime/kioslave/ldap/CMakeFiles/kio_ldap.dir/build.make runtime/kioslave/ldap/CMakeFiles/kio_ldap.dir/build
make[2]: Entering directory `/home/whirm/src/kde4/build/KDE/kdebase'
make[2]: Nothing to be done for `runtime/kioslave/ldap/CMakeFiles/kio_ldap.dir/build'.
make[2]: Leaving directory `/home/whirm/src/kde4/build/KDE/kdebase'
/usr/bin/cmake -E cmake_progress_report /home/whirm/src/kde4/build/KDE/kdebase/CMakeFiles
[ 6%] Built target kio_ldap
/usr/bin/make -f runtime/kioslave/fish/CMakeFiles/kio_fish.dir/build.make runtime/kioslave/fish/CMakeFiles/kio_fish.dir/depend
make[2]: Entering directory `/home/whirm/src/kde4/build/KDE/kdebase'
make[2]: Nothing to be done for `runtime/kioslave/fish/CMakeFiles/kio_fish.dir/depend'.
make[2]: Leaving directory `/home/whirm/src/kde4/build/KDE/kdebase'
/usr/bin/make -f runtime/kioslave/fish/CMakeFiles/kio_fish.dir/build.make runtime/kioslave/fish/CMakeFiles/kio_fish.dir/build
make[2]: Entering directory `/home/whirm/src/kde4/build/KDE/kdebase'
make[2]: Nothing to be done for `runtime/kioslave/fish/CMakeFiles/kio_fish.dir/build'.
make[2]: Leaving directory `/home/whirm/src/kde4/build/KDE/kdebase'
/usr/bin/cmake -E cmake_progress_report /home/whirm/src/kde4/build/KDE/kdebase/CMakeFiles
[ 6%] Built target kio_fish
/usr/bin/make -f runtime/kioslave/sftp/CMakeFiles/kio_sftp.dir/build.make runtime/kioslave/sftp/CMakeFiles/kio_sftp.dir/depend
make[2]: Entering directory `/home/whirm/src/kde4/build/KDE/kdebase'
make[2]: Nothing to be done for `runtime/kioslave/sftp/CMakeFiles/kio_sftp.dir/depend'.
make[2]: Leaving directory `/home/whirm/src/kde4/build/KDE/kdebase'
/usr/bin/make -f runtime/kioslave/sftp/CMakeFiles/kio_sftp.dir/build.make runtime/kioslave/sftp/CMakeFiles/kio_sftp.dir/build
make[2]: Entering directory `/home/whirm/src/kde4/build/KDE/kdebase'
make[2]: Nothing to be done for `runtime/kioslave/sftp/CMakeFiles/kio_sftp.dir/build'.
make[2]: Leaving directory `/home/whirm/src/kde4/build/KDE/kdebase'
/usr/bin/cmake -E cmake_progress_report /home/whirm/src/kde4/build/KDE/kdebase/CMakeFiles
[ 6%] Built target kio_sftp
/usr/bin/make -f runtime/kioslave/finger/CMakeFiles/kio_finger.dir/build.make runtime/kioslave/finger/CMakeFiles/kio_finger.dir/depend
make[2]: Entering directory `/home/whirm/src/kde4/build/KDE/kdebase'
make[2]: Nothing to be done for `runtime/kioslave/finger/CMakeFiles/kio_finger.dir/depend'.
make[2]: Leaving directory `/home/whirm/src/kde4/build/KDE/kdebase'
/usr/bin/make -f runtime/kioslave/finger/CMakeFiles/kio_finger.dir/build.make runtime/kioslave/finger/CMakeFiles/kio_finger.dir/build
make[2]: Entering directory `/home/whirm/src/kde4/build/KDE/kdebase'
make[2]: Nothing to be done for `runtime/kioslave/finger/CMakeFiles/kio_finger.dir/build'.
make[2]: Leaving directory `/home/whirm/src/kde4/build/KDE/kdebase'
/usr/bin/cmake -E cmake_progress_report /home/whirm/src/kde4/build/KDE/kdebase/CMakeFiles
[ 6%] Built target kio_finger
/usr/bin/make -f runtime/kioslave/man/CMakeFiles/kio_man.dir/build.make runtime/kioslave/man/CMakeFiles/kio_man.dir/depend
make[2]: Entering directory `/home/whirm/src/kde4/build/KDE/kdebase'
make[2]: Nothing to be done for `runtime/kioslave/man/CMakeFiles/kio_man.dir/depend'.
make[2]: Leaving directory `/home/whirm/src/kde4/build/KDE/kdebase'
/usr/bin/make -f runtime/kioslave/man/CMakeFiles/kio_man.dir/build.make runtime/kioslave/man/CMakeFiles/kio_man.dir/build
make[2]: Entering directory `/home/whirm/src/kde4/build/KDE/kdebase'
make[2]: Nothing to be done for `runtime/kioslave/man/CMakeFiles/kio_man.dir/build'.
make[2]: Leaving directory `/home/whirm/src/kde4/build/KDE/kdebase'
/usr/bin/cmake -E cmake_progress_report /home/whirm/src/kde4/build/KDE/kdebase/CMakeFiles 9
[ 7%] Built target kio_man
/usr/bin/make -f runtime/kioslave/man/CMakeFiles/kmanpart.dir/build.make runtime/kioslave/man/CMakeFiles/kmanpart.dir/depend
make[2]: Entering directory `/home/whirm/src/kde4/build/KDE/kdebase'
make[2]: Nothing to be done for `runtime/kioslave/man/CMakeFiles/kmanpart.dir/depend'.
make[2]: Leaving directory `/home/whirm/src/kde4/build/KDE/kdebase'
/usr/bin/make -f runtime/kioslave/man/CMakeFiles/kmanpart.dir/build.make runtime/kioslave/man/CMakeFiles/kmanpart.dir/build
make[2]: Entering directory `/home/whirm/src/kde4/build/KDE/kdebase'
make[2]: Nothing to be done for `runtime/kioslave/man/CMakeFiles/kmanpart.dir/build'.
make[2]: Leaving directory `/home/whirm/src/kde4/build/KDE/kdebase'
/usr/bin/cmake -E cmake_progress_report /home/whirm/src/kde4/build/KDE/kdebase/CMakeFiles
[ 7%] Built target kmanpart
/usr/bin/make -f runtime/kioslave/nfs/CMakeFiles/kio_nfs.dir/build.make runtime/kioslave/nfs/CMakeFiles/kio_nfs.dir/depend
make[2]: Entering directory `/home/whirm/src/kde4/build/KDE/kdebase'
make[2]: Nothing to be done for `runtime/kioslave/nfs/CMakeFiles/kio_nfs.dir/depend'.
make[2]: Leaving directory `/home/whirm/src/kde4/build/KDE/kdebase'
/usr/bin/make -f runtime/kioslave/nfs/CMakeFiles/kio_nfs.dir/build.make runtime/kioslave/nfs/CMakeFiles/kio_nfs.dir/build
make[2]: Entering directory `/home/whirm/src/kde4/build/KDE/kdebase'
make[2]: Nothing to be done for `runtime/kioslave/nfs/CMakeFiles/kio_nfs.dir/build'.
make[2]: Leaving directory `/home/whirm/src/kde4/build/KDE/kdebase'
/usr/bin/cmake -E cmake_progress_report /home/whirm/src/kde4/build/KDE/kdebase/CMakeFiles
[ 7%] Built target kio_nfs
/usr/bin/make -f runtime/kioslave/thumbnail/CMakeFiles/cursorthumbnail.dir/build.make runtime/kioslave/thumbnail/CMakeFiles/cursorthumbnail.dir/depend
make[2]: Entering directory `/home/whirm/src/kde4/build/KDE/kdebase'
make[2]: Nothing to be done for `runtime/kioslave/thumbnail/CMakeFiles/cursorthumbnail.dir/depend'.
make[2]: Leaving directory `/home/whirm/src/kde4/build/KDE/kdebase'
/usr/bin/make -f runtime/kioslave/thumbnail/CMakeFiles/cursorthumbnail.dir/build.make runtime/kioslave/thumbnail/CMakeFiles/cursorthumbnail.dir/build
make[2]: Entering directory `/home/whirm/src/kde4/build/KDE/kdebase'
make[2]: Nothing to be done for `runtime/kioslave/thumbnail/CMakeFiles/cursorthumbnail.dir/build'.
make[2]: Leaving directory `/home/whirm/src/kde4/build/KDE/kdebase'
/usr/bin/cmake -E cmake_progress_report /home/whirm/src/kde4/build/KDE/kdebase/CMakeFiles
[ 7%] Built target cursorthumbnail
/usr/bin/make -f runtime/kioslave/thumbnail/CMakeFiles/djvuthumbnail.dir/build.make runtime/kioslave/thumbnail/CMakeFiles/djvuthumbnail.dir/depend
make[2]: Entering directory `/home/whirm/src/kde4/build/KDE/kdebase'
make[2]: Nothing to be done for `runtime/kioslave/thumbnail/CMakeFiles/djvuthumbnail.dir/depend'.
make[2]: Leaving directory `/home/whirm/src/kde4/build/KDE/kdebase'
/usr/bin/make -f runtime/kioslave/thumbnail/CMakeFiles/djvuthumbnail.dir/build.make runtime/kioslave/thumbnail/CMakeFiles/djvuthumbnail.dir/build
make[2]: Entering directory `/home/whirm/src/kde4/build/KDE/kdebase'
make[2]: Nothing to be done for `runtime/kioslave/thumbnail/CMakeFiles/djvuthumbnail.dir/build'.
make[2]: Leaving directory `/home/whirm/src/kde4/build/KDE/kdebase'
/usr/bin/cmake -E cmake_progress_report /home/whirm/src/kde4/build/KDE/kdebase/CMakeFiles
[ 7%] Built target djvuthumbnail
/usr/bin/make -f runtime/kioslave/thumbnail/CMakeFiles/exrthumbnail.dir/build.make runtime/kioslave/thumbnail/CMakeFiles/exrthumbnail.dir/depend
make[2]: Entering directory `/home/whirm/src/kde4/build/KDE/kdebase'
make[2]: Nothing to be done for `runtime/kioslave/thumbnail/CMakeFiles/exrthumbnail.dir/depend'.
make[2]: Leaving directory `/home/whirm/src/kde4/build/KDE/kdebase'
/usr/bin/make -f runtime/kioslave/thumbnail/CMakeFiles/exrthumbnail.dir/build.make runtime/kioslave/thumbnail/CMakeFiles/exrthumbnail.dir/build
make[2]: Entering directory `/home/whirm/src/kde4/build/KDE/kdebase'
make[2]: Nothing to be done for `runtime/kioslave/thumbnail/CMakeFiles/exrthumbnail.dir/build'.
make[2]: Leaving directory `/home/whirm/src/kde4/build/KDE/kdebase'
/usr/bin/cmake -E cmake_progress_report /home/whirm/src/kde4/build/KDE/kdebase/CMakeFiles
[ 7%] Built target exrthumbnail
/usr/bin/make -f runtime/kioslave/thumbnail/CMakeFiles/htmlthumbnail.dir/build.make runtime/kioslave/thumbnail/CMakeFiles/htmlthumbnail.dir/depend
make[2]: Entering directory `/home/whirm/src/kde4/build/KDE/kdebase'
make[2]: Nothing to be done for `runtime/kioslave/thumbnail/CMakeFiles/htmlthumbnail.dir/depend'.
make[2]: Leaving directory `/home/whirm/src/kde4/build/KDE/kdebase'
/usr/bin/make -f runtime/kioslave/thumbnail/CMakeFiles/htmlthumbnail.dir/build.make runtime/kioslave/thumbnail/CMakeFiles/htmlthumbnail.dir/build
make[2]: Entering directory `/home/whirm/src/kde4/build/KDE/kdebase'
make[2]: Nothing to be done for `runtime/kioslave/thumbnail/CMakeFiles/htmlthumbnail.dir/build'.
make[2]: Leaving directory `/home/whirm/src/kde4/build/KDE/kdebase'
/usr/bin/cmake -E cmake_progress_report /home/whirm/src/kde4/build/KDE/kdebase/CMakeFiles
[ 7%] Built target htmlthumbnail
/usr/bin/make -f runtime/kioslave/thumbnail/CMakeFiles/imagethumbnail.dir/build.make runtime/kioslave/thumbnail/CMakeFiles/imagethumbnail.dir/depend
make[2]: Entering directory `/home/whirm/src/kde4/build/KDE/kdebase'
make[2]: Nothing to be done for `runtime/kioslave/thumbnail/CMakeFiles/imagethumbnail.dir/depend'.
make[2]: Leaving directory `/home/whirm/src/kde4/build/KDE/kdebase'
/usr/bin/make -f runtime/kioslave/thumbnail/CMakeFiles/imagethumbnail.dir/build.make runtime/kioslave/thumbnail/CMakeFiles/imagethumbnail.dir/build
make[2]: Entering directory `/home/whirm/src/kde4/build/KDE/kdebase'
make[2]: Nothing to be done for `runtime/kioslave/thumbnail/CMakeFiles/imagethumbnail.dir/build'.
make[2]: Leaving directory `/home/whirm/src/kde4/build/KDE/kdebase'
/usr/bin/cmake -E cmake_progress_report /home/whirm/src/kde4/build/KDE/kdebase/CMakeFiles
[ 7%] Built target imagethumbnail
/usr/bin/make -f runtime/kioslave/thumbnail/CMakeFiles/kio_thumbnail.dir/build.make runtime/kioslave/thumbnail/CMakeFiles/kio_thumbnail.dir/depend
make[2]: Entering directory `/home/whirm/src/kde4/build/KDE/kdebase'
make[2]: Nothing to be done for `runtime/kioslave/thumbnail/CMakeFiles/kio_thumbnail.dir/depend'.
make[2]: Leaving directory `/home/whirm/src/kde4/build/KDE/kdebase'
/usr/bin/make -f runtime/kioslave/thumbnail/CMakeFiles/kio_thumbnail.dir/build.make runtime/kioslave/thumbnail/CMakeFiles/kio_thumbnail.dir/build
make[2]: Entering directory `/home/whirm/src/kde4/build/KDE/kdebase'
make[2]: Nothing to be done for `runtime/kioslave/thumbnail/CMakeFiles/kio_thumbnail.dir/build'.
make[2]: Leaving directory `/home/whirm/src/kde4/build/KDE/kdebase'
/usr/bin/cmake -E cmake_progress_report /home/whirm/src/kde4/build/KDE/kdebase/CMakeFiles
[ 7%] Built target kio_thumbnail
/usr/bin/make -f runtime/kioslave/thumbnail/CMakeFiles/svgthumbnail.dir/build.make runtime/kioslave/thumbnail/CMakeFiles/svgthumbnail.dir/depend
make[2]: Entering directory `/home/whirm/src/kde4/build/KDE/kdebase'
make[2]: Nothing to be done for `runtime/kioslave/thumbnail/CMakeFiles/svgthumbnail.dir/depend'.
make[2]: Leaving directory `/home/whirm/src/kde4/build/KDE/kdebase'
/usr/bin/make -f runtime/kioslave/thumbnail/CMakeFiles/svgthumbnail.dir/build.make runtime/kioslave/thumbnail/CMakeFiles/svgthumbnail.dir/build
make[2]: Entering directory `/home/whirm/src/kde4/build/KDE/kdebase'
make[2]: Nothing to be done for `runtime/kioslave/thumbnail/CMakeFiles/svgthumbnail.dir/build'.
make[2]: Leaving directory `/home/whirm/src/kde4/build/KDE/kdebase'
/usr/bin/cmake -E cmake_progress_report /home/whirm/src/kde4/build/KDE/kdebase/CMakeFiles
[ 7%] Built target svgthumbnail
/usr/bin/make -f runtime/kioslave/thumbnail/CMakeFiles/textthumbnail.dir/build.make runtime/kioslave/thumbnail/CMakeFiles/textthumbnail.dir/depend
make[2]: Entering directory `/home/whirm/src/kde4/build/KDE/kdebase'
make[2]: Nothing to be done for `runtime/kioslave/thumbnail/CMakeFiles/textthumbnail.dir/depend'.
make[2]: Leaving directory `/home/whirm/src/kde4/build/KDE/kdebase'
/usr/bin/make -f runtime/kioslave/thumbnail/CMakeFiles/textthumbnail.dir/build.make runtime/kioslave/thumbnail/CMakeFiles/textthumbnail.dir/build
make[2]: Entering directory `/home/whirm/src/kde4/build/KDE/kdebase'
make[2]: Nothing to be done for `runtime/kioslave/thumbnail/CMakeFiles/textthumbnail.dir/build'.
make[2]: Leaving directory `/home/whirm/src/kde4/build/KDE/kdebase'
/usr/bin/cmake -E cmake_progress_report /home/whirm/src/kde4/build/KDE/kdebase/CMakeFiles
[ 7%] Built target textthumbnail
/usr/bin/make -f runtime/knetattach/CMakeFiles/knetattach.dir/build.make runtime/knetattach/CMakeFiles/knetattach.dir/depend
make[2]: Entering directory `/home/whirm/src/kde4/build/KDE/kdebase'
make[2]: Nothing to be done for `runtime/knetattach/CMakeFiles/knetattach.dir/depend'.
make[2]: Leaving directory `/home/whirm/src/kde4/build/KDE/kdebase'
/usr/bin/make -f runtime/knetattach/CMakeFiles/knetattach.dir/build.make runtime/knetattach/CMakeFiles/knetattach.dir/build
make[2]: Entering directory `/home/whirm/src/kde4/build/KDE/kdebase'
make[2]: Nothing to be done for `runtime/knetattach/CMakeFiles/knetattach.dir/build'.
make[2]: Leaving directory `/home/whirm/src/kde4/build/KDE/kdebase'
/usr/bin/cmake -E cmake_progress_report /home/whirm/src/kde4/build/KDE/kdebase/CMakeFiles
[ 7%] Built target knetattach
/usr/bin/make -f runtime/kpasswdserver/CMakeFiles/kded_kpasswdserver.dir/build.make runtime/kpasswdserver/CMakeFiles/kded_kpasswdserver.dir/depend
make[2]: Entering directory `/home/whirm/src/kde4/build/KDE/kdebase'
make[2]: Nothing to be done for `runtime/kpasswdserver/CMakeFiles/kded_kpasswdserver.dir/depend'.
make[2]: Leaving directory `/home/whirm/src/kde4/build/KDE/kdebase'
/usr/bin/make -f runtime/kpasswdserver/CMakeFiles/kded_kpasswdserver.dir/build.make runtime/kpasswdserver/CMakeFiles/kded_kpasswdserver.dir/build
make[2]: Entering directory `/home/whirm/src/kde4/build/KDE/kdebase'
make[2]: Nothing to be done for `runtime/kpasswdserver/CMakeFiles/kded_kpasswdserver.dir/build'.
make[2]: Leaving directory `/home/whirm/src/kde4/build/KDE/kdebase'
/usr/bin/cmake -E cmake_progress_report /home/whirm/src/kde4/build/KDE/kdebase/CMakeFiles
[ 7%] Built target kded_kpasswdserver
/usr/bin/make -f runtime/kdebugdialog/CMakeFiles/kdebugdialog.dir/build.make runtime/kdebugdialog/CMakeFiles/kdebugdialog.dir/depend
make[2]: Entering directory `/home/whirm/src/kde4/build/KDE/kdebase'
make[2]: Nothing to be done for `runtime/kdebugdialog/CMakeFiles/kdebugdialog.dir/depend'.
make[2]: Leaving directory `/home/whirm/src/kde4/build/KDE/kdebase'
/usr/bin/make -f runtime/kdebugdialog/CMakeFiles/kdebugdialog.dir/build.make runtime/kdebugdialog/CMakeFiles/kdebugdialog.dir/build
make[2]: Entering directory `/home/whirm/src/kde4/build/KDE/kdebase'
make[2]: Nothing to be done for `runtime/kdebugdialog/CMakeFiles/kdebugdialog.dir/build'.
make[2]: Leaving directory `/home/whirm/src/kde4/build/KDE/kdebase'
/usr/bin/cmake -E cmake_progress_report /home/whirm/src/kde4/build/KDE/kdebase/CMakeFiles 10
[ 8%] Built target kdebugdialog
/usr/bin/make -f runtime/ktimezoned/CMakeFiles/kded_ktimezoned.dir/build.make runtime/ktimezoned/CMakeFiles/kded_ktimezoned.dir/depend
make[2]: Entering directory `/home/whirm/src/kde4/build/KDE/kdebase'
make[2]: Nothing to be done for `runtime/ktimezoned/CMakeFiles/kded_ktimezoned.dir/depend'.
make[2]: Leaving directory `/home/whirm/src/kde4/build/KDE/kdebase'
/usr/bin/make -f runtime/ktimezoned/CMakeFiles/kded_ktimezoned.dir/build.make runtime/ktimezoned/CMakeFiles/kded_ktimezoned.dir/build
make[2]: Entering directory `/home/whirm/src/kde4/build/KDE/kdebase'
make[2]: Nothing to be done for `runtime/ktimezoned/CMakeFiles/kded_ktimezoned.dir/build'.
make[2]: Leaving directory `/home/whirm/src/kde4/build/KDE/kdebase'
/usr/bin/cmake -E cmake_progress_report /home/whirm/src/kde4/build/KDE/kdebase/CMakeFiles
[ 8%] Built target kded_ktimezoned
/usr/bin/make -f runtime/kcontrol/kcontrol/CMakeFiles/kdeinit_kcontrol.dir/build.make runtime/kcontrol/kcontrol/CMakeFiles/kdeinit_kcontrol.dir/depend
make[2]: Entering directory `/home/whirm/src/kde4/build/KDE/kdebase'
make[2]: Nothing to be done for `runtime/kcontrol/kcontrol/CMakeFiles/kdeinit_kcontrol.dir/depend'.
make[2]: Leaving directory `/home/whirm/src/kde4/build/KDE/kdebase'
/usr/bin/make -f runtime/kcontrol/kcontrol/CMakeFiles/kdeinit_kcontrol.dir/build.make runtime/kcontrol/kcontrol/CMakeFiles/kdeinit_kcontrol.dir/build
make[2]: Entering directory `/home/whirm/src/kde4/build/KDE/kdebase'
make[2]: Nothing to be done for `runtime/kcontrol/kcontrol/CMakeFiles/kdeinit_kcontrol.dir/build'.
make[2]: Leaving directory `/home/whirm/src/kde4/build/KDE/kdebase'
/usr/bin/cmake -E cmake_progress_report /home/whirm/src/kde4/build/KDE/kdebase/CMakeFiles 11
[ 9%] Built target kdeinit_kcontrol
/usr/bin/make -f runtime/kcontrol/kcontrol/CMakeFiles/kcontrol.dir/build.make runtime/kcontrol/kcontrol/CMakeFiles/kcontrol.dir/depend
make[2]: Entering directory `/home/whirm/src/kde4/build/KDE/kdebase'
make[2]: Nothing to be done for `runtime/kcontrol/kcontrol/CMakeFiles/kcontrol.dir/depend'.
make[2]: Leaving directory `/home/whirm/src/kde4/build/KDE/kdebase'
/usr/bin/make -f runtime/kcontrol/kcontrol/CMakeFiles/kcontrol.dir/build.make runtime/kcontrol/kcontrol/CMakeFiles/kcontrol.dir/build
make[2]: Entering directory `/home/whirm/src/kde4/build/KDE/kdebase'
make[2]: Nothing to be done for `runtime/kcontrol/kcontrol/CMakeFiles/kcontrol.dir/build'.
make[2]: Leaving directory `/home/whirm/src/kde4/build/KDE/kdebase'
/usr/bin/cmake -E cmake_progress_report /home/whirm/src/kde4/build/KDE/kdebase/CMakeFiles
[ 9%] Built target kcontrol
/usr/bin/make -f runtime/kcontrol/kcontrol/CMakeFiles/kdeinit_kinfocenter.dir/build.make runtime/kcontrol/kcontrol/CMakeFiles/kdeinit_kinfocenter.dir/depend
make[2]: Entering directory `/home/whirm/src/kde4/build/KDE/kdebase'
make[2]: Nothing to be done for `runtime/kcontrol/kcontrol/CMakeFiles/kdeinit_kinfocenter.dir/depend'.
make[2]: Leaving directory `/home/whirm/src/kde4/build/KDE/kdebase'
/usr/bin/make -f runtime/kcontrol/kcontrol/CMakeFiles/kdeinit_kinfocenter.dir/build.make runtime/kcontrol/kcontrol/CMakeFiles/kdeinit_kinfocenter.dir/build
make[2]: Entering directory `/home/whirm/src/kde4/build/KDE/kdebase'
make[2]: Nothing to be done for `runtime/kcontrol/kcontrol/CMakeFiles/kdeinit_kinfocenter.dir/build'.
make[2]: Leaving directory `/home/whirm/src/kde4/build/KDE/kdebase'
/usr/bin/cmake -E cmake_progress_report /home/whirm/src/kde4/build/KDE/kdebase/CMakeFiles 12
[ 10%] Built target kdeinit_kinfocenter
/usr/bin/make -f runtime/kcontrol/kcontrol/CMakeFiles/kinfocenter.dir/build.make runtime/kcontrol/kcontrol/CMakeFiles/kinfocenter.dir/depend
make[2]: Entering directory `/home/whirm/src/kde4/build/KDE/kdebase'
make[2]: Nothing to be done for `runtime/kcontrol/kcontrol/CMakeFiles/kinfocenter.dir/depend'.
make[2]: Leaving directory `/home/whirm/src/kde4/build/KDE/kdebase'
/usr/bin/make -f runtime/kcontrol/kcontrol/CMakeFiles/kinfocenter.dir/build.make runtime/kcontrol/kcontrol/CMakeFiles/kinfocenter.dir/build
make[2]: Entering directory `/home/whirm/src/kde4/build/KDE/kdebase'
make[2]: Nothing to be done for `runtime/kcontrol/kcontrol/CMakeFiles/kinfocenter.dir/build'.
make[2]: Leaving directory `/home/whirm/src/kde4/build/KDE/kdebase'
/usr/bin/cmake -E cmake_progress_report /home/whirm/src/kde4/build/KDE/kdebase/CMakeFiles
[ 10%] Built target kinfocenter
/usr/bin/make -f runtime/kcontrol/icons/CMakeFiles/kcm_icons.dir/build.make runtime/kcontrol/icons/CMakeFiles/kcm_icons.dir/depend
make[2]: Entering directory `/home/whirm/src/kde4/build/KDE/kdebase'
make[2]: Nothing to be done for `runtime/kcontrol/icons/CMakeFiles/kcm_icons.dir/depend'.
make[2]: Leaving directory `/home/whirm/src/kde4/build/KDE/kdebase'
/usr/bin/make -f runtime/kcontrol/icons/CMakeFiles/kcm_icons.dir/build.make runtime/kcontrol/icons/CMakeFiles/kcm_icons.dir/build
make[2]: Entering directory `/home/whirm/src/kde4/build/KDE/kdebase'
make[2]: Nothing to be done for `runtime/kcontrol/icons/CMakeFiles/kcm_icons.dir/build'.
make[2]: Leaving directory `/home/whirm/src/kde4/build/KDE/kdebase'
/usr/bin/cmake -E cmake_progress_report /home/whirm/src/kde4/build/KDE/kdebase/CMakeFiles
[ 10%] Built target kcm_icons
/usr/bin/make -f runtime/kcontrol/locale/CMakeFiles/kcm_locale.dir/build.make runtime/kcontrol/locale/CMakeFiles/kcm_locale.dir/depend
make[2]: Entering directory `/home/whirm/src/kde4/build/KDE/kdebase'
make[2]: Nothing to be done for `runtime/kcontrol/locale/CMakeFiles/kcm_locale.dir/depend'.
make[2]: Leaving directory `/home/whirm/src/kde4/build/KDE/kdebase'
/usr/bin/make -f runtime/kcontrol/locale/CMakeFiles/kcm_locale.dir/build.make runtime/kcontrol/locale/CMakeFiles/kcm_locale.dir/build
make[2]: Entering directory `/home/whirm/src/kde4/build/KDE/kdebase'
make[2]: Nothing to be done for `runtime/kcontrol/locale/CMakeFiles/kcm_locale.dir/build'.
make[2]: Leaving directory `/home/whirm/src/kde4/build/KDE/kdebase'
/usr/bin/cmake -E cmake_progress_report /home/whirm/src/kde4/build/KDE/kdebase/CMakeFiles 13
[ 11%] Built target kcm_locale
/usr/bin/make -f runtime/kcontrol/kded/CMakeFiles/kcm_kded.dir/build.make runtime/kcontrol/kded/CMakeFiles/kcm_kded.dir/depend
make[2]: Entering directory `/home/whirm/src/kde4/build/KDE/kdebase'
make[2]: Nothing to be done for `runtime/kcontrol/kded/CMakeFiles/kcm_kded.dir/depend'.
make[2]: Leaving directory `/home/whirm/src/kde4/build/KDE/kdebase'
/usr/bin/make -f runtime/kcontrol/kded/CMakeFiles/kcm_kded.dir/build.make runtime/kcontrol/kded/CMakeFiles/kcm_kded.dir/build
make[2]: Entering directory `/home/whirm/src/kde4/build/KDE/kdebase'
make[2]: Nothing to be done for `runtime/kcontrol/kded/CMakeFiles/kcm_kded.dir/build'.
make[2]: Leaving directory `/home/whirm/src/kde4/build/KDE/kdebase'
/usr/bin/cmake -E cmake_progress_report /home/whirm/src/kde4/build/KDE/kdebase/CMakeFiles
[ 11%] Built target kcm_kded
/usr/bin/make -f runtime/kcontrol/knotify/CMakeFiles/kcm_knotify.dir/build.make runtime/kcontrol/knotify/CMakeFiles/kcm_knotify.dir/depend
make[2]: Entering directory `/home/whirm/src/kde4/build/KDE/kdebase'
make[2]: Nothing to be done for `runtime/kcontrol/knotify/CMakeFiles/kcm_knotify.dir/depend'.
make[2]: Leaving directory `/home/whirm/src/kde4/build/KDE/kdebase'
/usr/bin/make -f runtime/kcontrol/knotify/CMakeFiles/kcm_knotify.dir/build.make runtime/kcontrol/knotify/CMakeFiles/kcm_knotify.dir/build
make[2]: Entering directory `/home/whirm/src/kde4/build/KDE/kdebase'
make[2]: Nothing to be done for `runtime/kcontrol/knotify/CMakeFiles/kcm_knotify.dir/build'.
make[2]: Leaving directory `/home/whirm/src/kde4/build/KDE/kdebase'
/usr/bin/cmake -E cmake_progress_report /home/whirm/src/kde4/build/KDE/kdebase/CMakeFiles
[ 11%] Built target kcm_knotify
/usr/bin/make -f runtime/kcontrol/componentchooser/CMakeFiles/kcm_componentchooser.dir/build.make runtime/kcontrol/componentchooser/CMakeFiles/kcm_componentchooser.dir/depend
make[2]: Entering directory `/home/whirm/src/kde4/build/KDE/kdebase'
make[2]: Nothing to be done for `runtime/kcontrol/componentchooser/CMakeFiles/kcm_componentchooser.dir/depend'.
make[2]: Leaving directory `/home/whirm/src/kde4/build/KDE/kdebase'
/usr/bin/make -f runtime/kcontrol/componentchooser/CMakeFiles/kcm_componentchooser.dir/build.make runtime/kcontrol/componentchooser/CMakeFiles/kcm_componentchooser.dir/build
make[2]: Entering directory `/home/whirm/src/kde4/build/KDE/kdebase'
make[2]: Nothing to be done for `runtime/kcontrol/componentchooser/CMakeFiles/kcm_componentchooser.dir/build'.
make[2]: Leaving directory `/home/whirm/src/kde4/build/KDE/kdebase'
/usr/bin/cmake -E cmake_progress_report /home/whirm/src/kde4/build/KDE/kdebase/CMakeFiles
[ 11%] Built target kcm_componentchooser
/usr/bin/make -f runtime/kcontrol/dnssd/CMakeFiles/kcm_kdnssd.dir/build.make runtime/kcontrol/dnssd/CMakeFiles/kcm_kdnssd.dir/depend
make[2]: Entering directory `/home/whirm/src/kde4/build/KDE/kdebase'
make[2]: Nothing to be done for `runtime/kcontrol/dnssd/CMakeFiles/kcm_kdnssd.dir/depend'.
make[2]: Leaving directory `/home/whirm/src/kde4/build/KDE/kdebase'
/usr/bin/make -f runtime/kcontrol/dnssd/CMakeFiles/kcm_kdnssd.dir/build.make runtime/kcontrol/dnssd/CMakeFiles/kcm_kdnssd.dir/build
make[2]: Entering directory `/home/whirm/src/kde4/build/KDE/kdebase'
make[2]: Nothing to be done for `runtime/kcontrol/dnssd/CMakeFiles/kcm_kdnssd.dir/build'.
make[2]: Leaving directory `/home/whirm/src/kde4/build/KDE/kdebase'
/usr/bin/cmake -E cmake_progress_report /home/whirm/src/kde4/build/KDE/kdebase/CMakeFiles
[ 11%] Built target kcm_kdnssd
/usr/bin/make -f runtime/kcontrol/samba/CMakeFiles/kcm_samba.dir/build.make runtime/kcontrol/samba/CMakeFiles/kcm_samba.dir/depend
make[2]: Entering directory `/home/whirm/src/kde4/build/KDE/kdebase'
make[2]: Nothing to be done for `runtime/kcontrol/samba/CMakeFiles/kcm_samba.dir/depend'.
make[2]: Leaving directory `/home/whirm/src/kde4/build/KDE/kdebase'
/usr/bin/make -f runtime/kcontrol/samba/CMakeFiles/kcm_samba.dir/build.make runtime/kcontrol/samba/CMakeFiles/kcm_samba.dir/build
make[2]: Entering directory `/home/whirm/src/kde4/build/KDE/kdebase'
make[2]: Nothing to be done for `runtime/kcontrol/samba/CMakeFiles/kcm_samba.dir/build'.
make[2]: Leaving directory `/home/whirm/src/kde4/build/KDE/kdebase'
/usr/bin/cmake -E cmake_progress_report /home/whirm/src/kde4/build/KDE/kdebase/CMakeFiles
[ 11%] Built target kcm_samba
/usr/bin/make -f runtime/kcmshell/CMakeFiles/kdeinit_kcmshell.dir/build.make runtime/kcmshell/CMakeFiles/kdeinit_kcmshell.dir/depend
make[2]: Entering directory `/home/whirm/src/kde4/build/KDE/kdebase'
make[2]: Nothing to be done for `runtime/kcmshell/CMakeFiles/kdeinit_kcmshell.dir/depend'.
make[2]: Leaving directory `/home/whirm/src/kde4/build/KDE/kdebase'
/usr/bin/make -f runtime/kcmshell/CMakeFiles/kdeinit_kcmshell.dir/build.make runtime/kcmshell/CMakeFiles/kdeinit_kcmshell.dir/build
make[2]: Entering directory `/home/whirm/src/kde4/build/KDE/kdebase'
make[2]: Nothing to be done for `runtime/kcmshell/CMakeFiles/kdeinit_kcmshell.dir/build'.
make[2]: Leaving directory `/home/whirm/src/kde4/build/KDE/kdebase'
/usr/bin/cmake -E cmake_progress_report /home/whirm/src/kde4/build/KDE/kdebase/CMakeFiles 14
[ 12%] Built target kdeinit_kcmshell
/usr/bin/make -f runtime/kcmshell/CMakeFiles/kcmshell.dir/build.make runtime/kcmshell/CMakeFiles/kcmshell.dir/depend
make[2]: Entering directory `/home/whirm/src/kde4/build/KDE/kdebase'
make[2]: Nothing to be done for `runtime/kcmshell/CMakeFiles/kcmshell.dir/depend'.
make[2]: Leaving directory `/home/whirm/src/kde4/build/KDE/kdebase'
/usr/bin/make -f runtime/kcmshell/CMakeFiles/kcmshell.dir/build.make runtime/kcmshell/CMakeFiles/kcmshell.dir/build
make[2]: Entering directory `/home/whirm/src/kde4/build/KDE/kdebase'
make[2]: Nothing to be done for `runtime/kcmshell/CMakeFiles/kcmshell.dir/build'.
make[2]: Leaving directory `/home/whirm/src/kde4/build/KDE/kdebase'
/usr/bin/cmake -E cmake_progress_report /home/whirm/src/kde4/build/KDE/kdebase/CMakeFiles
[ 12%] Built target kcmshell
/usr/bin/make -f runtime/knewstuff/CMakeFiles/khotnewstuff.dir/build.make runtime/knewstuff/CMakeFiles/khotnewstuff.dir/depend
make[2]: Entering directory `/home/whirm/src/kde4/build/KDE/kdebase'
make[2]: Nothing to be done for `runtime/knewstuff/CMakeFiles/khotnewstuff.dir/depend'.
make[2]: Leaving directory `/home/whirm/src/kde4/build/KDE/kdebase'
/usr/bin/make -f runtime/knewstuff/CMakeFiles/khotnewstuff.dir/build.make runtime/knewstuff/CMakeFiles/khotnewstuff.dir/build
make[2]: Entering directory `/home/whirm/src/kde4/build/KDE/kdebase'
make[2]: Nothing to be done for `runtime/knewstuff/CMakeFiles/khotnewstuff.dir/build'.
make[2]: Leaving directory `/home/whirm/src/kde4/build/KDE/kdebase'
/usr/bin/cmake -E cmake_progress_report /home/whirm/src/kde4/build/KDE/kdebase/CMakeFiles
[ 12%] Built target khotnewstuff
/usr/bin/make -f runtime/kdeprint/printmgr/CMakeFiles/kcm_printmgr.dir/build.make runtime/kdeprint/printmgr/CMakeFiles/kcm_printmgr.dir/depend
make[2]: Entering directory `/home/whirm/src/kde4/build/KDE/kdebase'
make[2]: Nothing to be done for `runtime/kdeprint/printmgr/CMakeFiles/kcm_printmgr.dir/depend'.
make[2]: Leaving directory `/home/whirm/src/kde4/build/KDE/kdebase'
/usr/bin/make -f runtime/kdeprint/printmgr/CMakeFiles/kcm_printmgr.dir/build.make runtime/kdeprint/printmgr/CMakeFiles/kcm_printmgr.dir/build
make[2]: Entering directory `/home/whirm/src/kde4/build/KDE/kdebase'
make[2]: Nothing to be done for `runtime/kdeprint/printmgr/CMakeFiles/kcm_printmgr.dir/build'.
make[2]: Leaving directory `/home/whirm/src/kde4/build/KDE/kdebase'
/usr/bin/cmake -E cmake_progress_report /home/whirm/src/kde4/build/KDE/kdebase/CMakeFiles
[ 12%] Built target kcm_printmgr
/usr/bin/make -f runtime/kdeprint/kdeprint_part/CMakeFiles/kdeprint_part.dir/build.make runtime/kdeprint/kdeprint_part/CMakeFiles/kdeprint_part.dir/depend
make[2]: Entering directory `/home/whirm/src/kde4/build/KDE/kdebase'
make[2]: Nothing to be done for `runtime/kdeprint/kdeprint_part/CMakeFiles/kdeprint_part.dir/depend'.
make[2]: Leaving directory `/home/whirm/src/kde4/build/KDE/kdebase'
/usr/bin/make -f runtime/kdeprint/kdeprint_part/CMakeFiles/kdeprint_part.dir/build.make runtime/kdeprint/kdeprint_part/CMakeFiles/kdeprint_part.dir/build
make[2]: Entering directory `/home/whirm/src/kde4/build/KDE/kdebase'
make[2]: Nothing to be done for `runtime/kdeprint/kdeprint_part/CMakeFiles/kdeprint_part.dir/build'.
make[2]: Leaving directory `/home/whirm/src/kde4/build/KDE/kdebase'
/usr/bin/cmake -E cmake_progress_report /home/whirm/src/kde4/build/KDE/kdebase/CMakeFiles
[ 12%] Built target kdeprint_part
/usr/bin/make -f runtime/kdeprint/kdeprintfax/CMakeFiles/kdeprintfax.dir/build.make runtime/kdeprint/kdeprintfax/CMakeFiles/kdeprintfax.dir/depend
make[2]: Entering directory `/home/whirm/src/kde4/build/KDE/kdebase'
make[2]: Nothing to be done for `runtime/kdeprint/kdeprintfax/CMakeFiles/kdeprintfax.dir/depend'.
make[2]: Leaving directory `/home/whirm/src/kde4/build/KDE/kdebase'
/usr/bin/make -f runtime/kdeprint/kdeprintfax/CMakeFiles/kdeprintfax.dir/build.make runtime/kdeprint/kdeprintfax/CMakeFiles/kdeprintfax.dir/build
make[2]: Entering directory `/home/whirm/src/kde4/build/KDE/kdebase'
make[2]: Nothing to be done for `runtime/kdeprint/kdeprintfax/CMakeFiles/kdeprintfax.dir/build'.
make[2]: Leaving directory `/home/whirm/src/kde4/build/KDE/kdebase'
/usr/bin/cmake -E cmake_progress_report /home/whirm/src/kde4/build/KDE/kdebase/CMakeFiles
[ 12%] Built target kdeprintfax
/usr/bin/make -f runtime/kdeprint/kjobviewer/CMakeFiles/kdeinit_kjobviewer.dir/build.make runtime/kdeprint/kjobviewer/CMakeFiles/kdeinit_kjobviewer.dir/depend
make[2]: Entering directory `/home/whirm/src/kde4/build/KDE/kdebase'
make[2]: Nothing to be done for `runtime/kdeprint/kjobviewer/CMakeFiles/kdeinit_kjobviewer.dir/depend'.
make[2]: Leaving directory `/home/whirm/src/kde4/build/KDE/kdebase'
/usr/bin/make -f runtime/kdeprint/kjobviewer/CMakeFiles/kdeinit_kjobviewer.dir/build.make runtime/kdeprint/kjobviewer/CMakeFiles/kdeinit_kjobviewer.dir/build
make[2]: Entering directory `/home/whirm/src/kde4/build/KDE/kdebase'
make[2]: Nothing to be done for `runtime/kdeprint/kjobviewer/CMakeFiles/kdeinit_kjobviewer.dir/build'.
make[2]: Leaving directory `/home/whirm/src/kde4/build/KDE/kdebase'
/usr/bin/cmake -E cmake_progress_report /home/whirm/src/kde4/build/KDE/kdebase/CMakeFiles
[ 12%] Built target kdeinit_kjobviewer
/usr/bin/make -f runtime/kdeprint/kjobviewer/CMakeFiles/kjobviewer.dir/build.make runtime/kdeprint/kjobviewer/CMakeFiles/kjobviewer.dir/depend
make[2]: Entering directory `/home/whirm/src/kde4/build/KDE/kdebase'
make[2]: Nothing to be done for `runtime/kdeprint/kjobviewer/CMakeFiles/kjobviewer.dir/depend'.
make[2]: Leaving directory `/home/whirm/src/kde4/build/KDE/kdebase'
/usr/bin/make -f runtime/kdeprint/kjobviewer/CMakeFiles/kjobviewer.dir/build.make runtime/kdeprint/kjobviewer/CMakeFiles/kjobviewer.dir/build
make[2]: Entering directory `/home/whirm/src/kde4/build/KDE/kdebase'
make[2]: Nothing to be done for `runtime/kdeprint/kjobviewer/CMakeFiles/kjobviewer.dir/build'.
make[2]: Leaving directory `/home/whirm/src/kde4/build/KDE/kdebase'
/usr/bin/cmake -E cmake_progress_report /home/whirm/src/kde4/build/KDE/kdebase/CMakeFiles
[ 12%] Built target kjobviewer
/usr/bin/make -f runtime/kdeprint/kprinter/CMakeFiles/kdeinit_kprinter.dir/build.make runtime/kdeprint/kprinter/CMakeFiles/kdeinit_kprinter.dir/depend
make[2]: Entering directory `/home/whirm/src/kde4/build/KDE/kdebase'
make[2]: Nothing to be done for `runtime/kdeprint/kprinter/CMakeFiles/kdeinit_kprinter.dir/depend'.
make[2]: Leaving directory `/home/whirm/src/kde4/build/KDE/kdebase'
/usr/bin/make -f runtime/kdeprint/kprinter/CMakeFiles/kdeinit_kprinter.dir/build.make runtime/kdeprint/kprinter/CMakeFiles/kdeinit_kprinter.dir/build
make[2]: Entering directory `/home/whirm/src/kde4/build/KDE/kdebase'
make[2]: Nothing to be done for `runtime/kdeprint/kprinter/CMakeFiles/kdeinit_kprinter.dir/build'.
make[2]: Leaving directory `/home/whirm/src/kde4/build/KDE/kdebase'
/usr/bin/cmake -E cmake_progress_report /home/whirm/src/kde4/build/KDE/kdebase/CMakeFiles
[ 12%] Built target kdeinit_kprinter
/usr/bin/make -f runtime/kdeprint/kprinter/CMakeFiles/kprinter.dir/build.make runtime/kdeprint/kprinter/CMakeFiles/kprinter.dir/depend
make[2]: Entering directory `/home/whirm/src/kde4/build/KDE/kdebase'
make[2]: Nothing to be done for `runtime/kdeprint/kprinter/CMakeFiles/kprinter.dir/depend'.
make[2]: Leaving directory `/home/whirm/src/kde4/build/KDE/kdebase'
/usr/bin/make -f runtime/kdeprint/kprinter/CMakeFiles/kprinter.dir/build.make runtime/kdeprint/kprinter/CMakeFiles/kprinter.dir/build
make[2]: Entering directory `/home/whirm/src/kde4/build/KDE/kdebase'
make[2]: Nothing to be done for `runtime/kdeprint/kprinter/CMakeFiles/kprinter.dir/build'.
make[2]: Leaving directory `/home/whirm/src/kde4/build/KDE/kdebase'
/usr/bin/cmake -E cmake_progress_report /home/whirm/src/kde4/build/KDE/kdebase/CMakeFiles
[ 12%] Built target kprinter
/usr/bin/make -f runtime/kdeprint/slave/CMakeFiles/kio_print.dir/build.make runtime/kdeprint/slave/CMakeFiles/kio_print.dir/depend
make[2]: Entering directory `/home/whirm/src/kde4/build/KDE/kdebase'
make[2]: Nothing to be done for `runtime/kdeprint/slave/CMakeFiles/kio_print.dir/depend'.
make[2]: Leaving directory `/home/whirm/src/kde4/build/KDE/kdebase'
/usr/bin/make -f runtime/kdeprint/slave/CMakeFiles/kio_print.dir/build.make runtime/kdeprint/slave/CMakeFiles/kio_print.dir/build
make[2]: Entering directory `/home/whirm/src/kde4/build/KDE/kdebase'
make[2]: Nothing to be done for `runtime/kdeprint/slave/CMakeFiles/kio_print.dir/build'.
make[2]: Leaving directory `/home/whirm/src/kde4/build/KDE/kdebase'
/usr/bin/cmake -E cmake_progress_report /home/whirm/src/kde4/build/KDE/kdebase/CMakeFiles 15
[ 13%] Built target kio_print
/usr/bin/make -f runtime/kdesu/kdesu/CMakeFiles/kdesu_executable.dir/build.make runtime/kdesu/kdesu/CMakeFiles/kdesu_executable.dir/depend
make[2]: Entering directory `/home/whirm/src/kde4/build/KDE/kdebase'
make[2]: Nothing to be done for `runtime/kdesu/kdesu/CMakeFiles/kdesu_executable.dir/depend'.
make[2]: Leaving directory `/home/whirm/src/kde4/build/KDE/kdebase'
/usr/bin/make -f runtime/kdesu/kdesu/CMakeFiles/kdesu_executable.dir/build.make runtime/kdesu/kdesu/CMakeFiles/kdesu_executable.dir/build
make[2]: Entering directory `/home/whirm/src/kde4/build/KDE/kdebase'
make[2]: Nothing to be done for `runtime/kdesu/kdesu/CMakeFiles/kdesu_executable.dir/build'.
make[2]: Leaving directory `/home/whirm/src/kde4/build/KDE/kdebase'
/usr/bin/cmake -E cmake_progress_report /home/whirm/src/kde4/build/KDE/kdebase/CMakeFiles
[ 13%] Built target kdesu_executable
/usr/bin/make -f runtime/kdesu/kdesud/CMakeFiles/kdesud.dir/build.make runtime/kdesu/kdesud/CMakeFiles/kdesud.dir/depend
make[2]: Entering directory `/home/whirm/src/kde4/build/KDE/kdebase'
make[2]: Nothing to be done for `runtime/kdesu/kdesud/CMakeFiles/kdesud.dir/depend'.
make[2]: Leaving directory `/home/whirm/src/kde4/build/KDE/kdebase'
/usr/bin/make -f runtime/kdesu/kdesud/CMakeFiles/kdesud.dir/build.make runtime/kdesu/kdesud/CMakeFiles/kdesud.dir/build
make[2]: Entering directory `/home/whirm/src/kde4/build/KDE/kdebase'
/usr/bin/cmake -E cmake_progress_report /home/whirm/src/kde4/build/KDE/kdebase/CMakeFiles
[ 13%] Building CXX object runtime/kdesu/kdesud/CMakeFiles/kdesud.dir/secure.o
/usr/bin/c++ -Wnon-virtual-dtor -Wno-long-long -ansi -Wundef -Wcast-align -Wchar-subscripts -Wall -W -Wpointer-arith -Wformat-security -fno-exceptions -fno-check-new -fno-common -fvisibility=hidden -Wnon-virtual-dtor -Wno-long-long -ansi -Wundef -Wcast-align -Wchar-subscripts -Wall -W -Wpointer-arith -Wformat-security -fno-exceptions -fno-check-new -fno-common -fvisibility=hidden -g3 -fno-inline -I/home/whirm/src/kde4/build/KDE/kdebase/runtime/kdesu/kdesud -I/home/whirm/src/kde4/src/KDE/kdebase/runtime/kdesu/kdesud -I/home/whirm/src/kde4/src/KDE/kdebase -I/home/whirm/src/kde4/build/KDE/kdebase -I/home/whirm/src/kde4/build/KDE/kdebase/runtime -I/home/whirm/src/kde4/build/qt-copy/include -I/home/whirm/src/kde4/build/qt-copy/include/Qt -I/home/whirm/src/kde4/build/qt-copy/mkspecs/default -I/home/whirm/src/kde4/build/qt-copy/include/QtCore -I/home/whirm/src/kde4/build/qt-copy/include/QtGui -I/home/whirm/src/kde4/build/qt-copy/include/Qt3Support -I/home/whirm/src/kde4/build/qt-copy/include/QtAssistant -I/home/whirm/src/kde4/build/qt-copy/include/QtDesigner -I/home/whirm/src/kde4/build/qt-copy/include/QtNetwork -I/home/whirm/src/kde4/build/qt-copy/include/QtOpenGL -I/home/whirm/src/kde4/build/qt-copy/include/QtSql -I/home/whirm/src/kde4/build/qt-copy/include/QtXml -I/home/whirm/src/kde4/build/qt-copy/include/QtSvg -I/home/whirm/src/kde4/build/qt-copy/include/QtScript -I/home/whirm/src/kde4/build/qt-copy/include/QtUiTools -I/home/whirm/src/kde4/build/qt-copy/include/QtTest -I/home/whirm/src/kde4/build/qt-copy/include/QtDBus -I/home/whirm/src/kde4/include -I/home/whirm/src/kde4/include/KDE -I/usr/local/include -D_BSD_SOURCE -D_XOPEN_SOURCE=500 -D_BSD_SOURCE -D_GNU_SOURCE -DQT_NO_STL -DQT_NO_CAST_TO_ASCII -D_REENTRANT -DKDE_DEPRECATED_WARNINGS -DHAVE_CONFIG_H=1 -D_BSD_SOURCE -D_XOPEN_SOURCE=500 -D_BSD_SOURCE -D_GNU_SOURCE -DQT_NO_STL -DQT_NO_CAST_TO_ASCII -D_REENTRANT -DKDE_DEPRECATED_WARNINGS -DHAVE_CONFIG_H=1 -o runtime/kdesu/kdesud/CMakeFiles/kdesud.dir/secure.o -c /home/whirm/src/kde4/src/KDE/kdebase/runtime/kdesu/kdesud/secure.cpp
/home/whirm/src/kde4/src/KDE/kdebase/runtime/kdesu/kdesud/secure.cpp: In constructor ‘SocketSecurity::SocketSecurity(int)’:
/home/whirm/src/kde4/src/KDE/kdebase/runtime/kdesu/kdesud/secure.cpp:43: error: expected primary-expression before ‘.’ token
/home/whirm/src/kde4/src/KDE/kdebase/runtime/kdesu/kdesud/secure.cpp:44: error: expected primary-expression before ‘.’ token
/home/whirm/src/kde4/src/KDE/kdebase/runtime/kdesu/kdesud/secure.cpp:45: error: expected primary-expression before ‘.’ token
make[2]: *** [runtime/kdesu/kdesud/CMakeFiles/kdesud.dir/secure.o] Error 1
make[2]: Leaving directory `/home/whirm/src/kde4/build/KDE/kdebase'
make[1]: *** [runtime/kdesu/kdesud/CMakeFiles/kdesud.dir/all] Error 2
make[1]: Leaving directory `/home/whirm/src/kde4/build/KDE/kdebase'
make: *** [all] Error 2
makeobj[0]: Leaving directory `/home/whirm/src/kde4/build/KDE/kdebase'
(KDE4)whirm@sphynx:~/src/kde4/build/KDE/kdebase$
(KDE4)whirm@sphynx:~/src/kde4/build/KDE/kdebase$