rendered paste bodyif x86_64-linux-gnu-g++ -DHAVE_CONFIG_H -I. -I. -I.. -Wall -O3 -g -O2 -MT init.o -MD -MP -MF ".deps/init.Tpo" -c -o init.o init.cc; \
then mv -f ".deps/init.Tpo" ".deps/init.Po"; else rm -f ".deps/init.Tpo"; exit 1; fi
init.cc: In function 'void load_data_files()':
init.cc:64: error: 'PACKAGE_DATA_DIR' was not declared in this scope
init.cc:65: error: expected `)' before string constant
init.cc:66: error: expected `)' before string constant
init.cc:67: error: expected `)' before string constant
init.cc:68: error: expected `)' before string constant
init.cc:69: error: expected `)' before string constant
init.cc:70: error: expected `)' before string constant
init.cc:71: error: expected `)' before string constant
init.cc:72: error: expected `)' before string constant
init.cc:73: error: expected `)' before string constant
init.cc:74: error: expected `)' before string constant
init.cc:75: error: expected `)' before string constant
init.cc:76: error: expected `)' before string constant
init.cc:77: error: expected `)' before string constant
init.cc:78: error: expected `)' before string constant
init.cc:79: error: expected `)' before string constant
init.cc:80: error: expected `)' before string constant
init.cc:81: error: expected `)' before string constant
init.cc:82: error: expected `)' before string constant
init.cc:83: error: expected `)' before string constant
init.cc:84: error: expected `)' before string constant
init.cc:85: error: expected `)' before string constant
init.cc:89: error: expected `)' before string constant
init.cc:90: error: expected `)' before string constant
init.cc:91: error: expected `)' before string constant
init.cc:92: error: expected `)' before string constant
init.cc:93: error: expected `)' before string constant
init.cc:94: error: expected `)' before string constant
init.cc:95: error: expected `)' before string constant
init.cc:110: error: expected `)' before string constant
init.cc:121: error: expected `)' before string constant
make[3]: *** [init.o] Error 1
make[3]: Leaving directory `/build/persia/open-invaders-0.2/src'
make[2]: *** [all-recursive] Error 1
make[2]: Leaving directory `/build/persia/open-invaders-0.2'
make[1]: *** [all] Error 2
make[1]: Leaving directory `/build/persia/open-invaders-0.2'
make: *** [build-stamp] Error 2
******************************************************************************
Build finished at 20070626-1729
FAILED [dpkg-buildpackage died]