rendered paste body __ __ _____ ___ _ _ _
\ \/ /___ _ __ |___ / / _ \| || | / |
\ // _ \ '_ \ |_ \| | | | || |_ __| |
/ \ __/ | | | ___) | |_| |__ _|__| |
/_/\_\___|_| |_| |____(_)___(_) |_| |_|
nm: /var/tmp/portage/app-emulation/xen-3.0.4_p1/work/xen-3.0.4_1-src/xen/.xen-syms.0: no symbols
No valid symbol.
make[2]: *** [/var/tmp/portage/app-emulation/xen-3.0.4_p1/work/xen-3.0.4_1-src/xen/xen-syms] Error 1
make[1]: *** [/var/tmp/portage/app-emulation/xen-3.0.4_p1/work/xen-3.0.4_1-src/xen/xen] Error 2
make: *** [build] Error 2
!!! ERROR: app-emulation/xen-3.0.4_p1 failed.
Call stack:
ebuild.sh, line 1615: Called dyn_compile
ebuild.sh, line 972: Called qa_call 'src_compile'
ebuild.sh, line 44: Called src_compile
xen-3.0.4_p1.ebuild, line 76: Called die
!!! compile failed
!!! If you need support, post the topmost build error, and the call stack if relevant.
!!! A complete build log is located at '/var/tmp/portage/app-emulation/xen-3.0.4_p1/temp/build.log'.